{"text_format":"1","workbook":"xlsx","n_sheets":19,"sheets":["MEN","IDT","ABS","DES","KOG","PSI","AFE","OBS","DIR","TEM","JUR","PRA","PRO","POR","REK","Link","PET","FormNDS","FormNAT"],"not_rendered":{"charts":0,"images":33,"macros":1,"external_links":0,"defined_names":35,"comments":0,"pivot_tables":0},"unopened":[],"bounds":{"document_bytes":16777216,"sheet_cells":100000,"rows_first":2000,"rows_last":500,"rows_between":2000,"halvings":0,"cell_chars":16384,"cell_head_chars":4096},"cells_cut":0,"cells_raw":0,"read":"whole","date_system":"1900"}

{"sheet":"MEN","index":0,"n_rows":14,"n_cols":7,"rows_kept":14,"cut":false,"hidden":false,"merged":[[13,1,15,18],[9,6,10,9],[5,6,8,9],[11,6,11,9],[5,10,11,13],[2,15,11,17]]}
[]
[]
[null,null,null,null,null,"PROGRAM PENILAIAN UNTUK KURIKULUM 2013"]
[null,null,null,null,null,{"$f":"IDT!V4","v":"SMA MUHAMMADIYAH WONOSOBO"}]
[]
[]
[]
[]
[]
[null,null,null,null,null,null,{"$f":"IDT!V5","v":"Jalan K.H. Ahmad Dahlan 10 Tel.(0286)321532 Wonosobo 56311"}]
[]
[]
[null,null,"Versi 2013-001"]
[null,"Aplikasi ini gratis untuk siapa saja yang berminat, khususnya sekolah-sekolah SMA yang karena keterbatasan waktu dan kesempatan sehingga \npihak sekolah belum sempat membuatnya. Silahkan dipakai, dimodifikasi dulu sesuai kebutuhan sekolah anda, atau di klaim buatan sekolah anda. \nJika Ada Kesulitan bisa menghubungi Bp. Drs. Supriyanto (Guru Kimia di SMA Muhammadiyah Wonosobo) di No. HP. 0888 0669 4521. Trims"]

{"sheet":"IDT","index":1,"n_rows":170,"n_cols":22,"rows_kept":170,"cut":false,"hidden":false,"merged":[]}
[]
["Skor","Nilai",null,"Urut","Kode\nGuru","Nama Lengkap Guru","Jenis ID","NIP/NBM/NUPTK","Mengajar Mapel",null,"No. Urut","Kode Tingkat","Kode Jurusan","Paralel","Kelas","Kode Kelas","Wali kelas","Nama Wali",null,"Identitas Sekolah"]
[1,1,null,1,"AA","Zulfan Setyanto, S.T., M.Kom","NBM","986.663","Teknologi Informasi dan Komunikasi",".",1,10,"01",1,{"$f":"IF(K3=\"\",\"\",CONCATENATE(L3,\"-\",IF(M3=\"01\",\"BHS\",IF(M3=\"02\",\"IPA\",\"IPS\")),\".\",N3))","v":"10-BHS.1"},{"$f":"IF(K3=\"\",\"\",CONCATENATE(L3,M3,N3))","v":"10011"},"BX",{"$f":"VLOOKUP(Q3,DATAGURU,2,FALSE)","v":"Dhany Suryanto, S.Pd."},null,"NPSN",":",20331953]
[2,2,null,2,"AB","Drs. Shodiq Al Fajar","NIP","19570124 198603 1 003","Matematika",".",{"$f":"IF(L4=\"\",\"\",K3+1)","v":2},10,"01",2,{"$f":"IF(K4=\"\",\"\",CONCATENATE(L4,\"-\",IF(M4=\"01\",\"BHS\",IF(M4=\"02\",\"IPA\",\"IPS\")),\".\",N4))","v":"10-BHS.2"},{"$f":"IF(K4=\"\",\"\",CONCATENATE(L4,M4,N4))","v":"10012"},"BH","Nur Khadijah, S.Ag.",null,"Nama Sekolah",":","SMA MUHAMMADIYAH WONOSOBO"]
[3,4,null,3,"AC","Drs. Sunarko","NBM","714.403",{"$f":"L55","v":"Ibadah"},".",{"$f":"IF(L5=\"\",\"\",K4+1)","v":3},10,"02",1,"10-IPA.1","10021","BY","Stefindityaningrum Gita Nurani, S.Pd.",null,"Alamat Sekolah",":","Jalan K.H. Ahmad Dahlan 10 Tel.(0286)321532 Wonosobo 56311"]
[4,5,null,4,"AD","Drs. Jamil","NBM","756.945","PAI",".",4,10,"02",2,"10-IPA.2","10022","BW","Haning Cahya Sayekti, S.Si",null,"Tahun Pelajaran",":","2013/2014"]
[5,7,null,5,"AE","Dra. Hj. Windarti","NBM","797.905","Sosiologi",".",5,10,"02",3,"10-IPA.3","10023","BS","Dika Rizki Permana, S.Pd.",null,"Semester",":","Ganjil"]
[6,8,null,6,"AF","Dra. Rahayu Fitriningrum","NIP","19650202 199003 2 009","Biologi",".",6,10,"02",4,"10-IPA.4","10024","AJ","Mochamad Alman Hasan",null,"KKM Skala 100",":",76]
[7,9,null,7,"AG","Drs. Mundriyanto","NBM","756.948","Sejarah Indonesia",".",7,10,"03",1,"10-IPS.1","10031","AV","Pitoyo Adhitomo, S.IP.",null,"KKM Skala 4",":",{"$f":"NILAI_KONVERSI(V8)","v":2.66}]
[8,11,null,8,"AH","Kastari, S.Pd.","NIP","19610807 198601 1 003",{"$f":"L50","v":"Pendidikan Jasmani, Olah Raga dan Kesehatan"},".",8,10,"03",2,"10-IPS.2","10032","BZ","Amelia Yohanta, S.Pd."]
[9,12,null,9,"AI","Drs. Kusmaedi","NBM","685.553","Sosiologi",".",9,10,"03",3,"10-IPS.3","10033","AU","Sri Budi Susilowati, S.Ag."]
[10,14,null,10,"AJ","Mochamad Alman Hasan","NBM","849.945","Seni Budaya",".",10,10,"03",4,"10-IPS.4","10034","BM","Musshofi, S.Pd. Jas"]
[11,15,null,11,"AK","Drs. Eko Samuryanto","NBM","841.928","Ekonomi",".",11,10,"03",5,"10-IPS.5","10035","BV","Rizka Septyna Dewi, S.Pd."]
[12,17,null,12,"AL","Drs. Supriyanto","NBM","801.584","Kimia",".",12,11,"01",1,"11-BHS.1","11011","BR","Edi Triono, A.Md."]
[13,18,null,13,"AM","Retno Widarsih, S.Pd.","NIP","19690330 200701 2 012","Bahasa Indonesia",".",13,11,"02",1,"11-IPA.1","11021","BU","Abdul Fadholi, S.Pd."]
[14,19,null,14,"AN","Dra. Hj. Elly Kartina","NIP","19581207 198303 2 010","Kimia",".",14,11,"02",2,"11-IPA.2","11022","BJ","Dani Sulistyowati, S.Si."]
[15,21,null,15,"AO","Dra. Roipah","NBM","720.895","Bahasa Indonesia",".",15,11,"02",3,"11-IPA.3","11023","BK","Rizka Dwi Utami, S.Pd."]
[16,22,null,16,"AP","Lutfi Arif Rakhman, SH.","NBM","833.091",{"$f":"L36","v":"Pendidikan Pancasila dan Kewarganegaraan"},".",16,11,"03",1,"11-IPS.1","11031","BN","Nisak Indri Khayati, S.Sn."]
[17,24,null,17,"AQ","Sumardiyani, S.Pd.","NBM","937.241","Ekonomi",".",17,11,"03",2,"11-IPS.2","11032","BE","Feni Kusuma Wardani, S.Pd."]
[18,25,null,18,"AR","Sumardi, S.Pd.","NIP","19700327 200801 1 005","Biologi",".",18,11,"03",3,"11-IPS.3","11033","AK","Drs. Eko Samuryanto"]
[19,26,null,19,"AS","Dra. Pri Hastuti","NBM","905.312","Ekonomi",".",19,11,"03",4,"11-IPS.4","11034","BD","Dra. Hj. Riyang Hidayati Lestari"]
[20,28,null,20,"AT","Siti Ngafiah, S.Pd.","NBM","919.307","Bahasa Inggris",".",20,11,"03",5,"11-IPS.5","11035","CD","Muhamad Khasan Abdur Rouf"]
[21,29,null,21,"AU","Sri Budi Susilowati, S.Ag.","NBM","919.309","PAI",".",21,12,"01",1,"12-BHS.1","12011","AY","Etikasari, S.Pd."]
[22,31,null,22,"AV","Pitoyo Adhitomo, S.IP.","NBM","581.276","Geografi",".",22,12,"02",1,"12-IPA.1","12021","AN","Dra. Hj. Elly Kartina"]
[23,32,null,23,"AW","Bukhori, S.Ag.","NBM","915.942","Bahasa Arab",".",23,12,"02",2,"12-IPA.2","12022","AM","Retno Widarsih, S.Pd."]
[24,34,null,24,"AX","Nur Sahid, S.Pd.","NBM","915.943","Ekonomi",".",24,12,"02",3,"12-IPA.3","12023","AZ","Eni Kurnianingsih, S.Pd."]
[25,35,null,25,"AY","Etikasari, S.Pd.","NBM","990.645","Bahasa Inggris",".",25,12,"03",1,"12-IPS.1","12031","AO","Dra. Roipah"]
[26,36,null,26,"AZ","Eni Kurnianingsih, S.Pd.","NBM","968.526","Bahasa Indonesia",".",26,12,"03",2,"12-IPS.2","12032","AS","Dra. Pri Hastuti"]
[27,38,null,27,"BA","Hening Andriastuti, S.Pd.","NBM","986.068","Bahasa Inggris",".",27,12,"03",3,"12-IPS.3","12033","BF","Erfika Yunia, S.Ag"]
[28,39,null,28,"BB","Riyanti, SH.","NBM","986.069","PPKn",".",28,12,"03",4,"12-IPS.4","12034","BG","R. Budi Prasetyo, S. Pd."]
[29,41,null,29,"BC","Dhian Erfianto, S.Pd.","NBM","997.701","Bahasa Inggris",".",29,12,"03",5,"12-IPS.5","12035","BL","Ratna Ristianingsih, S.Pd."]
[30,42,null,30,"BD","Dra. Hj. Riyang Hidayati Lestari","NIP","19680812 199403 2 002","PAI",".","",null,null,null,"",""]
[31,43,null,31,"BE","Feni Kusuma Wardani, S.Pd.","NUPTK","9853758659300002","Sejarah","."]
[32,45,null,32,"BF","Erfika Yunia, S.Ag","NBM","968.516","Bahasa Arab",".","Kode","Nama Mapel"]
[33,46,null,33,"BG","R. Budi Prasetyo, S. Pd.","NBM","107.1364","Bahasa Indonesia",".","001","Pendidikan Agama"]
[34,48,null,34,"BH","Nur Khadijah, S.Ag.","NBM","750.191","PAI",".","002","Pendidikan Pancasila dan Kewarganegaraan"]
[35,49,null,35,"BI","Uun Sugianto, S.Pd.","NUPTK","5857758661200002","Seni Budaya",".","003","Bahasa Indonesia"]
[36,51,null,36,"BJ","Dani Sulistyowati, S.Si.","NBM","113.0941","Kimia",".","004","Bahasa dan Sastra Indonesia"]
[37,52,null,37,"BK","Rizka Dwi Utami, S.Pd.","NBM","113.0942","Matematika",".","005","Bahasa Inggris"]
[38,53,null,38,"BL","Ratna Ristianingsih, S.Pd.","NBM","113.0862","Geografi",".","006","Matematika"]
[39,55,null,39,"BM","Musshofi, S.Pd. Jas","KTP","340213.200585.0004","Penjasorkes",".","007","Fisika"]
[40,56,null,40,"BN","Nisak Indri Khayati, S.Sn.","NBM","-","Seni Budaya",".","008","Biologi"]
[41,58,null,41,"BO","Nasehan, S.Pd","NBM","551.519","BP/BK",".","009","Kimia"]
[42,59,null,42,"BP","Kayat Purwanto, S.Pd.","NUPTK","1853749651200012","BP/BK",".","010","Sejarah Indonesia"]
[43,60,null,43,"BQ","Ira Damayanti, S.Pd.","NUPTK","8560758659300012","BP/BK",".","011","Geografi"]
[44,60,null,44,"BR","Edi Triono, A.Md.","NBM","-","Bahasa Jepang",".","012","Ekonomi"]
[45,61,null,45,"BS","Dika Rizki Permana, S.Pd.","NBM","113.0943","Fisika",".","013","Sosiologi"]
[46,61,null,46,"BT","Dani Amrie Dwi Kurniawan, A.Md.","NBM","-","Teknologi Informasi dan Komunikasi",".","014","Antropologi"]
[47,61,null,47,"BU","Abdul Fadholi, S.Pd.","NBM","113.2184","Prakarya dan Kewirausahaan",".","015","Seni Budaya"]
[48,62,null,48,"BV","Rizka Septyna Dewi, S.Pd.","NBM","113.2182","Matematika",".","016","Pendidikan Jasmani, Olah Raga dan Kesehatan"]
[49,62,null,49,"BW","Haning Cahya Sayekti, S.Si","NBM","113.0947","Fisika",".","017","Teknologi Informasi dan Komunikasi"]
[50,62,null,50,"BX","Dhany Suryanto, S.Pd.","NBM","-","Sosiologi",".","018","Bahasa Arab"]
[51,63,null,51,"BY","Stefindityaningrum Gita Nurani, S.Pd.","NBM","113.0948","Bahasa Inggris",".","019","Bahasa dan Sastra Jepang"]
[52,63,null,52,"BZ","Amelia Yohanta, S.Pd.","NBM","-","Matematika",".","020","Tauhid"]
[53,63,null,53,"CA","Shinta Herwidyaningtyas, S.Pd.","NBM","-","BP/BK",".","021","Ibadah"]
[54,64,null,54,"CB","Shella Puspita Chandra, S.S","NBM","-","Bahasa Inggris",".","022","Akhlaq"]
[55,64,null,55,"CC","Teguh Riyanto, S.S","NBM","-","Bahasa Inggris",".","023","Al Qur'an dan Hadits"]
[56,64,null,56,"CD","Muhamad Khasan Abdur Rouf","NBM","-","Bahasa Arab",".","024","Tarikh"]
[57,65,null,57,"CE","Sukmawati Puspitasari, S.Pd. Si.","NBM","-","Matematika",".","025","Kemuhammadiyahan"]
[58,65,null,58,"CF",null,null,null,null,null,"026","Bimbingan Konseling"]
[59,65,null,59,"CG",null,null,null,null,null,"027","Prakarya dan Kewirausahaan"]
[60,66,null,60,"CH",null,null,null,null,null,"028","Sejarah"]
[61,66,null,61,"CI",null,null,null,null,null,"029","Bahasa dan Sastra Inggris"]
[62,66,null,62,"CJ"]
[63,67,null,63,"CK"]
[64,67,null,64,"CL"]
[65,68,null,65,"CM"]
[66,68,null,66,"CN"]
[67,68,null,67,"CO"]
[68,69,null,68,"CP"]
[69,69,null,69,"CQ"]
[70,69,null,70,"CR"]
[71,70]
[72,70]
[73,70]
[74,71]
[75,71]
[76,71]
[77,72]
[78,72]
[79,72]
[80,73]
[81,73]
[82,73]
[83,74]
[84,74]
[85,75]
[86,75]
[87,76]
[88,76]
[89,76]
[90,77]
[91,77]
[92,78]
[93,78]
[94,78]
[95,79]
[96,79]
[97,79]
[98,80]
[99,80]
[100,80]
[101,81]
[102,81]
[103,82]
[104,82]
[105,82]
[106,83]
[107,83]
[108,83]
[109,84]
[110,84]
[111,85]
[112,85]
[113,85]
[114,86]
[115,86]
[116,86]
[117,87]
[118,87]
[119,87]
[120,88]
[121,88]
[122,89]
[123,89]
[124,89]
[125,90]
[126,90]
[127,91]
[128,91]
[129,91]
[130,92]
[131,92]
[132,92]
[133,92]
[134,93]
[135,93]
[136,93]
[137,93]
[138,93]
[139,94]
[140,94]
[141,94]
[142,94]
[143,95]
[144,95]
[145,95]
[146,95]
[147,95]
[148,96]
[149,96]
[150,96]
[151,96]
[152,96]
[153,97]
[154,97]
[155,97]
[156,97]
[157,98]
[158,98]
[159,98]
[160,98]
[161,98]
[162,99]
[163,99]
[164,99]
[165,99]
[166,100]
[167,100]
[168,100]

{"sheet":"ABS","index":2,"n_rows":84,"n_cols":68,"rows_kept":84,"cut":false,"hidden":false,"merged":[[4,50,6,63],[6,14,6,18],[3,1,3,3],[3,5,3,23],[3,25,3,27],[3,28,3,31],[4,28,4,29],[5,1,5,3],[5,5,5,16],[5,17,5,21],[5,22,5,23],[6,1,6,3],[4,1,4,3],[4,5,4,7],[4,8,4,9],[4,10,4,12],[4,14,4,27],[6,5,6,11],[5,28,5,29],[7,1,7,3],[7,5,7,11],[9,1,13,1],[9,2,13,2],[9,3,13,3],[9,4,13,4],[9,5,13,5],[9,6,9,59],[12,20,13,20],[12,21,13,21],[12,22,13,22],[12,23,13,23],[12,24,13,24],[12,25,13,25],[12,35,13,35],[12,36,13,36],[12,37,13,37],[12,38,13,38],[12,27,13,27],[12,28,13,28],[12,29,13,29],[12,30,13,30],[12,31,13,31],[9,60,11,64],[12,6,13,6],[12,7,13,7],[12,8,13,8],[12,9,13,9],[12,10,13,10],[12,11,13,11],[12,12,13,12],[12,13,13,13],[12,14,13,14],[12,26,13,26],[12,15,13,15],[12,16,13,16],[12,17,13,17],[12,18,13,18],[12,19,13,19],[12,32,13,32],[59,5,59,22],[12,57,13,57],[12,58,13,58],[12,59,13,59],[12,45,13,45],[12,46,13,46],[12,47,13,47],[12,48,13,48],[12,49,13,49],[12,60,13,60],[12,51,13,51],[12,52,13,52],[12,53,13,53],[12,54,13,54],[12,55,13,55],[12,56,13,56],[12,63,13,63],[12,64,13,64],[56,5,56,22],[57,5,57,22],[58,5,58,22],[12,61,13,61],[12,62,13,62],[12,50,13,50],[12,39,13,39],[12,40,13,40],[12,41,13,41],[12,42,13,42],[12,43,13,43],[12,44,13,44],[12,33,13,33],[12,34,13,34]]}
[]
[null,"PRESENSI SISWA MENGIKUTI PELAJARAN",null,null,null,null,null,null,null,null,null,null,null,null,null,null,null,null,null,null,null,null,null,null,null,null,null,null,null,null,null,null,"PETUNJUK PENGGUNAAN :",null,null,null,null,null,null,null,null,null,null,null,null,null,null,{"$f":"SUM(G56:BH56)","v":1}]
[]
[null,"Mata Pelajaran",null,null,"=",{"$f":"IFERROR(VLOOKUP(AC6,KODEMAPEL,2,FALSE),\"Kode Guru Blm Diisi\")","v":"Kimia"},null,null,null,null,null,null,null,null,null,null,null,null,null,null,null,null,null,null,null,"Kelas =",null,null,{"$f":"IF(F15=\"\",\"\",F15)","v":"10-BHS.1"},null,null,null,null,"1. Isikan Kode Mapel dan Kode Guru",null,null,null,null,null,null,null,null,null,null,null,null,null,null,null,null,null,null,null,null,null,null,null,null,null,null,null,null,null,null,"."]
[null,"Tahun Pelajaran dan Semester",null,null,"=",{"$f":"TAHUNPELAJARAN","v":"2013/2014"},null,null,"dan",null,{"$f":"SEMESTER","v":"Ganjil"},null,null,null,"Jumlah Hari Efektif di Semester Ini =",null,null,null,null,null,null,null,null,null,null,null,null,null,103,null,"Hari",null,null,"2. Isikan Jumlah Hari Efektif di Semester ini",null,null,null,null,null,null,null,null,null,null,null,null,null,null,null,null,"S = Sakit  I = Ijin T = Terlambat A = Alpha     .  = Masuk",null,null,null,null,null,null,null,null,null,null,null,null,null,"S"]
[null,"Nama Guru Mata Pelajaran",null,null,"=",{"$f":"IFERROR(VLOOKUP(KODEGURU,DATAGURU,2,FALSE),\"Kode Guru Belum Diisi\")","v":"Drs. Supriyanto"},null,null,null,null,null,null,null,null,null,null,null,"Kode Guru =",null,null,null,null,"AL",null,null,null,null,"Kode Mapel =","009",null,null,null,null,"3. Isikan Alokasi Jam Mengajar per minggunya",null,null,null,null,null,null,null,null,null,null,null,null,null,null,null,null,null,null,null,null,null,null,null,null,null,null,null,null,null,null,"I"]
[null,"Nama File Seharusnya",null,null,"=",{"$f":"IF(OR(W6=\"\",AC6=\"\"),\"\",CONCATENATE(MID(F5,3,2),RIGHT(F5,2),\"-\",VLOOKUP(AC4,KODEKELAS,2,FALSE),\"-\",IF(K5=\"Ganjil\",\"01\",\"02\"),\"-\",AC6,KODEGURU,\".xlsm\"))","v":"1314-10011-01-009AL.xlsm"},null,null,null,null,null,null,null,null,{"$f":"IF(F7=F8,\"Sudah Sama\",\"Nama File Belum Sama\")","v":"Nama File Belum Sama"},null,null,null,null,null,null,null,null,null,null,null,null,"Alokasi Jam Mengajar per Minggunya =",4,"Jam",null,null,null,"4. Rubahlah Nama File sesuai dengan Nama File Seharusnya",null,null,null,null,null,null,null,null,null,null,null,null,null,null,null,null,null,null,null,null,null,null,null,null,null,null,null,null,null,null,"T"]
[null,"Nama File Sebelum Dirubah",null,null,"=",{"$f":"WkbName()","v":"1314-10011Progam_Nilai.xlsm"},null,null,null,null,null,null,null,null,null,null,null,null,null,null,null,null,null,null,null,null,null,"Jumlah Pertemuan Seharusnya dalam semester ini =",25,"Kali",null,null,null,"5. Isikan Tanggal Tatap Muka sesuai Jumlah pertemuannya",null,null,null,null,null,null,null,null,null,null,null,null,null,null,null,null,null,null,null,null,null,null,null,null,null,null,null,null,null,null,"A"]
[]
[null,"No.","NIS","Nama Lengkap Siswa","JK","Kelas","Pertemuan ke               Dan Tanggal Pertemuan",null,null,null,null,null,null,null,null,null,null,null,null,null,null,null,null,null,null,null,null,null,null,null,null,null,null,null,null,null,null,null,null,null,null,null,null,null,null,null,null,null,null,null,null,null,null,null,null,null,null,null,null,null,"JUMLAH"]
[null,null,null,null,null,null,1,{"$f":"IF($AC$7=\"\",\"\",IF(G11<$AC$8,G11+1,\"\"))","v":2},{"$f":"IF($AC$7=\"\",\"\",IF(H11<$AC$8,H11+1,\"\"))","v":3},4,5,6,7,8,9,10,11,12,13,14,15,16,17,18,19,20,21,22,23,24,25,"","","","","","","","","","","","","","","","","","","","","","","","","","","","",""]
[null,null,null,null,null,null,{"$f":"IF(G13=\"\",\"\",LEFT(TEXT(G13,\"ddd\"),3))","v":"Sel"},{"$f":"IF(H13=\"\",\"\",LEFT(TEXT(H13,\"ddd\"),3))","v":"Sen"},"","","","","","","","","","","","","","","","","","","","","","","","","","","","","","","","","","","","","","","","","","","","","","","","","","","",""]
[null,null,null,null,null,null,"2013-07-02","2012-07-02",null,null,null,null,null,null,null,null,null,null,null,null,null,null,null,null,null,null,null,null,null,null,null,null,null,null,null,null,null,null,null,null,null,null,null,null,null,null,null,null,null,null,null,null,null,null,null,null,null,null,null,null,"S","I","T","A","Hadir"]
[]
[null,1,12427,"AGNES MAULIDA YULINAR","P","10-BHS.1","S",null,"I",null,"T",null,"A",null,null,null,null,null,null,null,null,null,null,null,null,null,null,null,null,null,null,null,null,null,null,null,null,null,null,null,null,null,null,null,null,null,null,null,null,null,null,null,null,null,null,null,null,null,null,null,{"$f":"IF(COUNTIF($H15:$BH15,\"S\")=0,\"\",COUNTIF($H15:$BH15,\"S\"))","v":""},{"$f":"IF(COUNTIF($H15:$BH15,\"I\")=0,\"\",COUNTIF($H15:$BH15,\"I\"))","v":1},{"$f":"IF(COUNTIF($H15:$BH15,\"T\")=0,\"\",COUNTIF($H15:$BH15,\"T\"))","v":1},{"$f":"IF(COUNTIF($H15:$BH15,\"A\")=0,\"\",COUNTIF($H15:$BH15,\"A\"))","v":1},{"$f":"IF(COUNTIF($G15:$BH15,\".\")=0,\"\",COUNTIF($G15:$BH15,\".\"))","v":""},null,{"$f":"IDT!K35","v":"001"},{"$f":"IDT!E3","v":"AA"}]
[null,{"$f":"IF(D16=\"\",\"\",B15+1)","v":2},12436,"AKHMAD ZANUAR HIDAYAT","L",{"$f":"IF(D16=\"\",\"\",F15)","v":"10-BHS.1"},null,".",null,null,".",null,null,null,null,null,null,null,null,null,null,null,null,null,null,null,null,null,null,null,null,null,null,null,null,null,null,null,null,null,null,null,null,null,null,null,null,null,null,null,null,null,null,null,null,null,null,null,null,null,{"$f":"IF(COUNTIF($H16:$BH16,\"S\")=0,\"\",COUNTIF($H16:$BH16,\"S\"))","v":""},{"$f":"IF(COUNTIF($H16:$BH16,\"I\")=0,\"\",COUNTIF($H16:$BH16,\"I\"))","v":""},{"$f":"IF(COUNTIF($H16:$BH16,\"T\")=0,\"\",COUNTIF($H16:$BH16,\"T\"))","v":""},{"$f":"IF(COUNTIF($H16:$BH16,\"A\")=0,\"\",COUNTIF($H16:$BH16,\"A\"))","v":""},{"$f":"IF(COUNTIF($G16:$BH16,\".\")=0,\"\",COUNTIF($G16:$BH16,\".\"))","v":2},null,{"$f":"IDT!K36","v":"002"},{"$f":"IDT!E4","v":"AB"}]
[null,{"$f":"IF(D17=\"\",\"\",B16+1)","v":3},12440,"ALFIYAN ANDHI PRATAMA","L",{"$f":"IF(D17=\"\",\"\",F16)","v":"10-BHS.1"},null,null,null,null,null,null,null,null,null,null,null,null,null,null,null,null,null,null,null,null,null,null,null,null,null,null,null,null,null,null,null,null,null,null,null,null,null,null,null,null,null,null,null,null,null,null,null,null,null,null,null,null,null,null,"","","","","",null,{"$f":"IDT!K37","v":"003"},{"$f":"IDT!E5","v":"AC"}]
[null,4,12447,"AMALIA MAJID","P","10-BHS.1",null,null,null,".",null,null,null,null,null,null,null,null,null,null,null,null,null,null,null,null,null,null,null,null,null,null,null,null,null,null,null,null,null,null,null,null,null,null,null,null,null,null,null,null,null,null,null,null,null,null,null,null,null,null,"","","","",1,null,{"$f":"IDT!K38","v":"004"},{"$f":"IDT!E6","v":"AD"}]
[null,5,12454,"ANNISAA PUTRI DESIHANA","P","10-BHS.1",null,null,null,null,null,null,null,null,null,null,null,null,null,null,null,null,null,null,null,null,null,null,null,null,null,null,null,null,null,null,null,null,null,null,null,null,null,null,null,null,null,null,null,null,null,null,null,null,null,null,null,null,null,null,"","","","","",null,{"$f":"IDT!K39","v":"005"},{"$f":"IDT!E7","v":"AE"}]
[null,6,12468,"ASFI MA'RUF FAIRUZZABAD","L","10-BHS.1",null,null,null,null,null,null,null,null,null,null,null,null,null,null,null,null,null,null,null,null,null,null,null,null,null,null,null,null,null,null,null,null,null,null,null,null,null,null,null,null,null,null,null,null,null,null,null,null,null,null,null,null,null,null,"","","","","",null,{"$f":"IDT!K40","v":"006"},{"$f":"IDT!E8","v":"AF"}]
[null,7,12505,"DESY ANISA PURNAMASARI","P","10-BHS.1",null,null,null,null,null,null,null,null,null,null,null,null,null,null,null,null,null,null,null,null,null,null,null,null,null,null,null,null,null,null,null,null,null,null,null,null,null,null,null,null,null,null,null,null,null,null,null,null,null,null,null,null,null,null,"","","","","",null,{"$f":"IDT!K41","v":"007"},{"$f":"IDT!E9","v":"AG"}]
[null,8,12517,"DINA LUTFI HANIFAH","P","10-BHS.1",null,null,null,null,null,null,null,null,null,null,null,null,null,null,null,null,null,null,null,null,null,null,null,null,null,null,null,null,null,null,null,null,null,null,null,null,null,null,null,null,null,null,null,null,null,null,null,null,null,null,null,null,null,null,"","","","","",null,{"$f":"IDT!K42","v":"008"},{"$f":"IDT!E10","v":"AH"}]
[null,9,12524,"DWI SETYONINGSIH","P","10-BHS.1",null,null,null,null,null,null,null,null,null,null,null,null,null,null,null,null,null,null,null,null,null,null,null,null,null,null,null,null,null,null,null,null,null,null,null,null,null,null,null,null,null,null,null,null,null,null,null,null,null,null,null,null,null,null,"","","","","",null,{"$f":"IDT!K43","v":"009"},{"$f":"IDT!E11","v":"AI"}]
[null,10,12531,"EKA PRASETYA","L","10-BHS.1",null,null,null,null,null,null,null,null,null,null,null,null,null,null,null,null,null,null,null,null,null,null,null,null,null,null,null,null,null,null,null,null,null,null,null,null,null,null,null,null,null,null,null,null,null,null,null,null,null,null,null,null,null,null,"","","","","",null,{"$f":"IDT!K44","v":"010"},{"$f":"IDT!E12","v":"AJ"}]
[null,11,12539,"ERLANGGA YUDHANTO WIBOWO","L","10-BHS.1",null,null,null,null,null,null,null,null,null,null,null,null,null,null,null,null,null,null,null,null,null,null,null,null,null,null,null,null,null,null,null,null,null,null,null,null,null,null,null,null,null,null,null,null,null,null,null,null,null,null,null,null,null,null,"","","","","",null,{"$f":"IDT!K45","v":"011"},{"$f":"IDT!E13","v":"AK"}]
[null,12,12546,"FALSAFA LUTHFIANA UMMI SYAHADA","P","10-BHS.1",null,null,null,null,null,null,null,null,null,null,null,null,null,null,null,null,null,null,null,null,null,null,null,null,null,null,null,null,null,null,null,null,null,null,null,null,null,null,null,null,null,null,null,null,null,null,null,null,null,null,null,null,null,null,"","","","","",null,{"$f":"IDT!K46","v":"012"},{"$f":"IDT!E14","v":"AL"}]
[null,13,12548,"FARID HIDAYAT","L","10-BHS.1",null,null,null,null,null,null,null,null,null,null,null,null,null,null,null,null,null,null,null,null,null,null,null,null,null,null,null,null,null,null,null,null,null,null,null,null,null,null,null,null,null,null,null,null,null,null,null,null,null,null,null,null,null,null,"","","","","",null,{"$f":"IDT!K47","v":"013"},{"$f":"IDT!E15","v":"AM"}]
[null,14,12562,"GAYUH ANINDYANINGRUM","P","10-BHS.1",null,null,null,null,null,null,null,null,null,null,null,null,null,null,null,null,null,null,null,null,null,null,null,null,null,null,null,null,null,null,null,null,null,null,null,null,null,null,null,null,null,null,null,null,null,null,null,null,null,null,null,null,null,null,"","","","","",null,{"$f":"IDT!K48","v":"014"},{"$f":"IDT!E16","v":"AN"}]
[null,15,12583,"IHWAN QORIB","L","10-BHS.1",null,null,null,null,null,null,null,null,null,null,null,null,null,null,null,null,null,null,null,null,null,null,null,null,null,null,null,null,null,null,null,null,null,null,null,null,null,null,null,null,null,null,null,null,null,null,null,null,null,null,null,null,null,null,"","","","","",null,{"$f":"IDT!K49","v":"015"},{"$f":"IDT!E17","v":"AO"}]
[null,16,12597,"IRVANI PUTRI","P","10-BHS.1",null,null,null,null,null,null,null,null,null,null,null,null,null,null,null,null,null,null,null,null,null,null,null,null,null,null,null,null,null,null,null,null,null,null,null,null,null,null,null,null,null,null,null,null,null,null,null,null,null,null,null,null,null,null,"","","","","",null,{"$f":"IDT!K50","v":"016"},{"$f":"IDT!E18","v":"AP"}]
[null,17,12607,"KRISTIAN ADI BAWONO","L","10-BHS.1",null,null,null,null,null,null,null,null,null,null,null,null,null,null,null,null,null,null,null,null,null,null,null,null,null,null,null,null,null,null,null,null,null,null,null,null,null,null,null,null,null,null,null,null,null,null,null,null,null,null,null,null,null,null,"","","","","",null,{"$f":"IDT!K51","v":"017"},{"$f":"IDT!E19","v":"AQ"}]
[null,18,12618,"LUTFI IMANIKA VIANTI","P","10-BHS.1",null,null,null,null,null,null,null,null,null,null,null,null,null,null,null,null,null,null,null,null,null,null,null,null,null,null,null,null,null,null,null,null,null,null,null,null,null,null,null,null,null,null,null,null,null,null,null,null,null,null,null,null,null,null,"","","","","",null,{"$f":"IDT!K52","v":"018"},{"$f":"IDT!E20","v":"AR"}]
[null,19,12625,"MEILANI KARTIKA","P","10-BHS.1",null,null,null,null,null,null,null,null,null,null,null,null,null,null,null,null,null,null,null,null,null,null,null,null,null,null,null,null,null,null,null,null,null,null,null,null,null,null,null,null,null,null,null,null,null,null,null,null,null,null,null,null,null,null,"","","","","",null,{"$f":"IDT!K53","v":"019"},{"$f":"IDT!E21","v":"AS"}]
[null,20,12699,"RIESTY WULAN","P","10-BHS.1",null,null,null,null,null,null,null,null,null,null,null,null,null,null,null,null,null,null,null,null,null,null,null,null,null,null,null,null,null,null,null,null,null,null,null,null,null,null,null,null,null,null,null,null,null,null,null,null,null,null,null,null,null,null,"","","","","",null,{"$f":"IDT!K54","v":"020"},{"$f":"IDT!E22","v":"AT"}]
[null,21,12703,"RISA PUSPITARINI","P","10-BHS.1",null,null,null,null,null,null,null,null,null,null,null,null,null,null,null,null,null,null,null,null,null,null,null,null,null,null,null,null,null,null,null,null,null,null,null,null,null,null,null,null,null,null,null,null,null,null,null,null,null,null,null,null,null,null,"","","","","",null,{"$f":"IDT!K55","v":"021"},{"$f":"IDT!E23","v":"AU"}]
[null,22,12707,"RIVAN SETIAWAN","L","10-BHS.1",null,null,null,null,null,null,null,null,null,null,null,null,null,null,null,null,null,null,null,null,null,null,null,null,null,null,null,null,null,null,null,null,null,null,null,null,null,null,null,null,null,null,null,null,null,null,null,null,null,null,null,null,null,null,"","","","","",null,{"$f":"IDT!K56","v":"022"},{"$f":"IDT!E24","v":"AV"}]
[null,23,12724,"SEPTIAN RIZKY HADI","L","10-BHS.1",null,null,null,null,null,null,null,null,null,null,null,null,null,null,null,null,null,null,null,null,null,null,null,null,null,null,null,null,null,null,null,null,null,null,null,null,null,null,null,null,null,null,null,null,null,null,null,null,null,null,null,null,null,null,"","","","","",null,{"$f":"IDT!K57","v":"023"},{"$f":"IDT!E25","v":"AW"}]
[null,24,12751,"TYASTUTI ANJARSARI","P","10-BHS.1",null,null,null,null,null,null,null,null,null,null,null,null,null,null,null,null,null,null,null,null,null,null,null,null,null,null,null,null,null,null,null,null,null,null,null,null,null,null,null,null,null,null,null,null,null,null,null,null,null,null,null,null,null,null,"","","","","",null,{"$f":"IDT!K58","v":"024"},{"$f":"IDT!E26","v":"AX"}]
[null,25,12768,"WILA TRI WAHYUDITA SAVIK ISWARA","L","10-BHS.1",null,null,null,null,null,null,null,null,null,null,null,null,null,null,null,null,null,null,null,null,null,null,null,null,null,null,null,null,null,null,null,null,null,null,null,null,null,null,null,null,null,null,null,null,null,null,null,null,null,null,null,null,null,null,"","","","","",null,{"$f":"IDT!K59","v":"025"},{"$f":"IDT!E27","v":"AY"}]
[null,"",null,null,null,"",null,null,null,null,null,null,null,null,null,null,null,null,null,null,null,null,null,null,null,null,null,null,null,null,null,null,null,null,null,null,null,null,null,null,null,null,null,null,null,null,null,null,null,null,null,null,null,null,null,null,null,null,null,null,"","","","","",null,{"$f":"IDT!K60","v":"026"},{"$f":"IDT!E28","v":"AZ"}]
[null,"",null,null,null,"",null,null,null,null,null,null,null,null,null,null,null,null,null,null,null,null,null,null,null,null,null,null,null,null,null,null,null,null,null,null,null,null,null,null,null,null,null,null,null,null,null,null,null,null,null,null,null,null,null,null,null,null,null,null,"","","","","",null,{"$f":"IDT!K61","v":"027"},{"$f":"IDT!E29","v":"BA"}]
[null,"",null,null,null,"",null,null,null,null,null,null,null,null,null,null,null,null,null,null,null,null,null,null,null,null,null,null,null,null,null,null,null,null,null,null,null,null,null,null,null,null,null,null,null,null,null,null,null,null,null,null,null,null,null,null,null,null,null,null,"","","","","",null,{"$f":"IDT!K62","v":"028"},{"$f":"IDT!E30","v":"BB"}]
[null,"",null,null,null,"",null,null,null,null,null,null,null,null,null,null,null,null,null,null,null,null,null,null,null,null,null,null,null,null,null,null,null,null,null,null,null,null,null,null,null,null,null,null,null,null,null,null,null,null,null,null,null,null,null,null,null,null,null,null,"","","","","",null,{"$f":"IDT!K63","v":"029"},{"$f":"IDT!E31","v":"BC"}]
[null,"",null,null,null,"",null,null,null,null,null,null,null,null,null,null,null,null,null,null,null,null,null,null,null,null,null,null,null,null,null,null,null,null,null,null,null,null,null,null,null,null,null,null,null,null,null,null,null,null,null,null,null,null,null,null,null,null,null,null,"","","","","",null,null,{"$f":"IDT!E32","v":"BD"}]
[null,"",null,null,null,"",null,null,null,null,null,null,null,null,null,null,null,null,null,null,null,null,null,null,null,null,null,null,null,null,null,null,null,null,null,null,null,null,null,null,null,null,null,null,null,null,null,null,null,null,null,null,null,null,null,null,null,null,null,null,"","","","","",null,null,{"$f":"IDT!E33","v":"BE"}]
[null,"",null,null,null,"",null,null,null,null,null,null,null,null,null,null,null,null,null,null,null,null,null,null,null,null,null,null,null,null,null,null,null,null,null,null,null,null,null,null,null,null,null,null,null,null,null,null,null,null,null,null,null,null,null,null,null,null,null,null,"","","","","",null,null,{"$f":"IDT!E34","v":"BF"}]
[null,"",null,null,null,"",null,null,null,null,null,null,null,null,null,null,null,null,null,null,null,null,null,null,null,null,null,null,null,null,null,null,null,null,null,null,null,null,null,null,null,null,null,null,null,null,null,null,null,null,null,null,null,null,null,null,null,null,null,null,"","","","","",null,null,{"$f":"IDT!E35","v":"BG"}]
[null,"",null,null,null,"",null,null,null,null,null,null,null,null,null,null,null,null,null,null,null,null,null,null,null,null,null,null,null,null,null,null,null,null,null,null,null,null,null,null,null,null,null,null,null,null,null,null,null,null,null,null,null,null,null,null,null,null,null,null,"","","","","",null,null,{"$f":"IDT!E36","v":"BH"}]
[null,"",null,null,null,"",null,null,null,null,null,null,null,null,null,null,null,null,null,null,null,null,null,null,null,null,null,null,null,null,null,null,null,null,null,null,null,null,null,null,null,null,null,null,null,null,null,null,null,null,null,null,null,null,null,null,null,null,null,null,"","","","","",null,null,{"$f":"IDT!E37","v":"BI"}]
[null,"",null,null,null,"",null,null,null,null,null,null,null,null,null,null,null,null,null,null,null,null,null,null,null,null,null,null,null,null,null,null,null,null,null,null,null,null,null,null,null,null,null,null,null,null,null,null,null,null,null,null,null,null,null,null,null,null,null,null,"","","","","",null,null,{"$f":"IDT!E38","v":"BJ"}]
[null,"",null,null,null,"",null,null,null,null,null,null,null,null,null,null,null,null,null,null,null,null,null,null,null,null,null,null,null,null,null,null,null,null,null,null,null,null,null,null,null,null,null,null,null,null,null,null,null,null,null,null,null,null,null,null,null,null,null,null,"","","","","",null,null,{"$f":"IDT!E39","v":"BK"}]
[null,"",null,null,null,"",null,null,null,null,null,null,null,null,null,null,null,null,null,null,null,null,null,null,null,null,null,null,null,null,null,null,null,null,null,null,null,null,null,null,null,null,null,null,null,null,null,null,null,null,null,null,null,null,null,null,null,null,null,null,"","","","","",null,null,{"$f":"IDT!E40","v":"BL"}]
[null,"",null,null,null,"",null,null,null,null,null,null,null,null,null,null,null,null,null,null,null,null,null,null,null,null,null,null,null,null,null,null,null,null,null,null,null,null,null,null,null,null,null,null,null,null,null,null,null,null,null,null,null,null,null,null,null,null,null,null,"","","","","",null,null,{"$f":"IDT!E41","v":"BM"}]
[null,"",null,null,null,"",null,null,null,null,null,null,null,null,null,null,null,null,null,null,null,null,null,null,null,null,null,null,null,null,null,null,null,null,null,null,null,null,null,null,null,null,null,null,null,null,null,null,null,null,null,null,null,null,null,null,null,null,null,null,"","","","","",null,null,{"$f":"IDT!E42","v":"BN"}]
[null,null,null,"2013-07-01",null,null,null,null,null,null,null,null,null,null,null,null,null,null,null,null,null,null,null,null,null,null,null,null,null,null,null,null,null,null,null,null,null,null,null,null,null,null,null,null,null,null,null,null,null,null,null,null,null,null,null,null,null,null,null,null,null,null,null,null,null,null,null,{"$f":"IDT!E43","v":"BO"}]
[null,"CATATAN :",null,null,null,null,{"$f":"IF(G11<>\"\",IF(G13>$D$55,1,0),\"\")","v":1},{"$f":"IF(H11<>\"\",IF(H13>$D$55,1,0),\"\")","v":0},0,0,0,0,0,0,0,0,0,0,0,0,0,0,0,0,0,0,0,0,0,0,0,"","","","","","","","","","","","","","","","","","","","","","","","","","","","","",null,null,null,null,null,null,null,{"$f":"IDT!E44","v":"BP"}]
[null,null,1,"Sabtu, 16 Nopemberl 2013 (Pertemuan ke-….)","=","KBM pulang lebih awal karena ada pelantikan Kepala Sekolah Baru",null,null,null,null,null,null,null,null,null,null,null,null,null,null,null,null,null,null,null,null,null,null,null,null,null,null,null,null,null,null,null,null,null,null,null,null,null,null,null,null,null,null,null,null,null,null,null,null,null,null,null,null,null,null,null,null,null,null,null,null,null,{"$f":"IDT!E45","v":"BQ"}]
[null,null,2,null,"=",null,null,null,null,null,null,null,null,null,null,null,null,null,null,null,null,null,null,null,null,null,null,null,null,null,null,null,null,null,null,null,null,null,null,null,null,null,null,null,null,null,null,null,null,null,null,null,null,null,null,null,null,null,null,null,null,null,null,null,null,null,null,{"$f":"IDT!E46","v":"BR"}]
[null,null,3,null,"=",null,null,null,null,null,null,null,null,null,null,null,null,null,null,null,null,null,null,null,null,null,null,null,null,null,null,null,null,null,null,null,null,null,null,null,null,null,null,null,null,null,null,null,null,null,null,null,null,null,null,null,null,null,null,null,null,null,null,null,null,null,null,{"$f":"IDT!E47","v":"BS"}]
[null,null,4,null,"=",null,null,null,null,null,null,null,null,null,null,null,null,null,null,null,null,null,null,null,null,null,null,null,null,null,null,null,null,null,null,null,null,null,null,null,null,null,null,null,null,null,null,null,null,null,null,null,null,null,null,null,null,null,null,null,null,null,null,null,null,null,null,{"$f":"IDT!E48","v":"BT"}]
[null,null,null,null,null,null,null,null,null,null,null,null,null,null,null,null,null,null,null,null,null,null,null,null,null,null,null,null,null,null,null,null,null,null,null,null,null,null,null,null,null,null,null,null,null,null,null,null,null,null,null,null,null,null,null,null,null,null,null,null,null,null,null,null,null,null,null,"BU"]
[null,null,null,null,null,null,null,null,null,null,null,null,null,null,null,null,null,null,null,null,null,null,null,null,null,null,null,null,null,null,null,null,null,null,null,null,null,null,null,null,null,null,null,null,null,null,null,null,null,null,null,null,null,null,null,null,null,null,null,null,null,null,null,null,null,null,null,"BV"]
[null,null,null,null,null,null,null,null,null,null,null,null,null,null,null,null,null,null,null,null,null,null,null,null,null,null,null,null,null,null,null,null,null,null,null,null,null,null,null,null,null,null,null,null,null,null,null,null,null,null,null,null,null,null,null,null,null,null,null,null,null,null,null,null,null,null,null,"BW"]
[null,null,null,null,null,null,null,null,null,null,null,null,null,null,null,null,null,null,null,null,null,null,null,null,null,null,null,null,null,null,null,null,null,null,null,null,null,null,null,null,null,null,null,null,null,null,null,null,null,null,null,null,null,null,null,null,null,null,null,null,null,null,null,null,null,null,null,"BX"]
[null,null,null,null,null,null,null,null,null,null,null,null,null,null,null,null,null,null,null,null,null,null,null,null,null,null,null,null,null,null,null,null,null,null,null,null,null,null,null,null,null,null,null,null,null,null,null,null,null,null,null,null,null,null,null,null,null,null,null,null,null,null,null,null,null,null,null,"BY"]
[null,null,null,null,null,null,null,null,null,null,null,null,null,null,null,null,null,null,null,null,null,null,null,null,null,null,null,null,null,null,null,null,null,null,null,null,null,null,null,null,null,null,null,null,null,null,null,null,null,null,null,null,null,null,null,null,null,null,null,null,null,null,null,null,null,null,null,"BZ"]
[null,null,null,null,null,null,null,null,null,null,null,null,null,null,null,null,null,null,null,null,null,null,null,null,null,null,null,null,null,null,null,null,null,null,null,null,null,null,null,null,null,null,null,null,null,null,null,null,null,null,null,null,null,null,null,null,null,null,null,null,null,null,null,null,null,null,null,"CA"]
[null,null,null,null,null,null,null,null,null,null,null,null,null,null,null,null,null,null,null,null,null,null,null,null,null,null,null,null,null,null,null,null,null,null,null,null,null,null,null,null,null,null,null,null,null,null,null,null,null,null,null,null,null,null,null,null,null,null,null,null,null,null,null,null,null,null,null,"CB"]
[null,null,null,null,null,null,null,null,null,null,null,null,null,null,null,null,null,null,null,null,null,null,null,null,null,null,null,null,null,null,null,null,null,null,null,null,null,null,null,null,null,null,null,null,null,null,null,null,null,null,null,null,null,null,null,null,null,null,null,null,null,null,null,null,null,null,null,"CC"]
[null,null,null,null,null,null,null,null,null,null,null,null,null,null,null,null,null,null,null,null,null,null,null,null,null,null,null,null,null,null,null,null,null,null,null,null,null,null,null,null,null,null,null,null,null,null,null,null,null,null,null,null,null,null,null,null,null,null,null,null,null,null,null,null,null,null,null,"CD"]
[null,null,null,null,null,null,null,null,null,null,null,null,null,null,null,null,null,null,null,null,null,null,null,null,null,null,null,null,null,null,null,null,null,null,null,null,null,null,null,null,null,null,null,null,null,null,null,null,null,null,null,null,null,null,null,null,null,null,null,null,null,null,null,null,null,null,null,"CE"]
[null,null,null,null,null,null,null,null,null,null,null,null,null,null,null,null,null,null,null,null,null,null,null,null,null,null,null,null,null,null,null,null,null,null,null,null,null,null,null,null,null,null,null,null,null,null,null,null,null,null,null,null,null,null,null,null,null,null,null,null,null,null,null,null,null,null,null,"CF"]
[null,null,null,null,null,null,null,null,null,null,null,null,null,null,null,null,null,null,null,null,null,null,null,null,null,null,null,null,null,null,null,null,null,null,null,null,null,null,null,null,null,null,null,null,null,null,null,null,null,null,null,null,null,null,null,null,null,null,null,null,null,null,null,null,null,null,null,"CG"]
[null,null,null,null,null,null,null,null,null,null,null,null,null,null,null,null,null,null,null,null,null,null,null,null,null,null,null,null,null,null,null,null,null,null,null,null,null,null,null,null,null,null,null,null,null,null,null,null,null,null,null,null,null,null,null,null,null,null,null,null,null,null,null,null,null,null,null,"CH"]
[null,null,null,null,null,null,null,null,null,null,null,null,null,null,null,null,null,null,null,null,null,null,null,null,null,null,null,null,null,null,null,null,null,null,null,null,null,null,null,null,null,null,null,null,null,null,null,null,null,null,null,null,null,null,null,null,null,null,null,null,null,null,null,null,null,null,null,"CI"]
[null,null,null,null,null,null,null,null,null,null,null,null,null,null,null,null,null,null,null,null,null,null,null,null,null,null,null,null,null,null,null,null,null,null,null,null,null,null,null,null,null,null,null,null,null,null,null,null,null,null,null,null,null,null,null,null,null,null,null,null,null,null,null,null,null,null,null,"CJ"]
[null,null,null,null,null,null,null,null,null,null,null,null,null,null,null,null,null,null,null,null,null,null,null,null,null,null,null,null,null,null,null,null,null,null,null,null,null,null,null,null,null,null,null,null,null,null,null,null,null,null,null,null,null,null,null,null,null,null,null,null,null,null,null,null,null,null,null,"CK"]
[null,null,null,null,null,null,null,null,null,null,null,null,null,null,null,null,null,null,null,null,null,null,null,null,null,null,null,null,null,null,null,null,null,null,null,null,null,null,null,null,null,null,null,null,null,null,null,null,null,null,null,null,null,null,null,null,null,null,null,null,null,null,null,null,null,null,null,"CL"]
[null,null,null,null,null,null,null,null,null,null,null,null,null,null,null,null,null,null,null,null,null,null,null,null,null,null,null,null,null,null,null,null,null,null,null,null,null,null,null,null,null,null,null,null,null,null,null,null,null,null,null,null,null,null,null,null,null,null,null,null,null,null,null,null,null,null,null,"CM"]
[null,null,null,null,null,null,null,null,null,null,null,null,null,null,null,null,null,null,null,null,null,null,null,null,null,null,null,null,null,null,null,null,null,null,null,null,null,null,null,null,null,null,null,null,null,null,null,null,null,null,null,null,null,null,null,null,null,null,null,null,null,null,null,null,null,null,null,"CN"]
[null,null,null,null,null,null,null,null,null,null,null,null,null,null,null,null,null,null,null,null,null,null,null,null,null,null,null,null,null,null,null,null,null,null,null,null,null,null,null,null,null,null,null,null,null,null,null,null,null,null,null,null,null,null,null,null,null,null,null,null,null,null,null,null,null,null,null,"CO"]
[null,null,null,null,null,null,null,null,null,null,null,null,null,null,null,null,null,null,null,null,null,null,null,null,null,null,null,null,null,null,null,null,null,null,null,null,null,null,null,null,null,null,null,null,null,null,null,null,null,null,null,null,null,null,null,null,null,null,null,null,null,null,null,null,null,null,null,"CP"]
[null,null,null,null,null,null,null,null,null,null,null,null,null,null,null,null,null,null,null,null,null,null,null,null,null,null,null,null,null,null,null,null,null,null,null,null,null,null,null,null,null,null,null,null,null,null,null,null,null,null,null,null,null,null,null,null,null,null,null,null,null,null,null,null,null,null,null,"CQ"]
[null,null,null,null,null,null,null,null,null,null,null,null,null,null,null,null,null,null,null,null,null,null,null,null,null,null,null,null,null,null,null,null,null,null,null,null,null,null,null,null,null,null,null,null,null,null,null,null,null,null,null,null,null,null,null,null,null,null,null,null,null,null,null,null,null,null,null,"CR"]

{"sheet":"DES","index":3,"n_rows":31,"n_cols":18,"rows_kept":31,"cut":false,"hidden":false,"merged":[[2,11,2,13],[3,11,3,13],[4,11,4,13]]}
[]
[null,"KD.1","KD.2","KD.3",null,"Kode",{"$f":"Deskripsi_01","v":"Peran dan Hakekat Ilmu Kimia"},{"$f":"Deskripsi_02","v":"Struktur Atom dan Sistem Periodik Unsur"},{"$f":"Deskripsi_03","v":"Ikatan Kimia"},null,"KI.3 atau\nPokok Bahasan","Deskripsi Untuk Pengetahuan",null,null,null,"Pembacaan","Alternatif","Tampilan Deskripsi Pengetahuan"]
[null,{"$f":"Rerata_KKM-1","v":75},{"$f":"Rerata_KKM-1","v":75},{"$f":"Rerata_KKM-1","v":75},null,1,null,null,null,null,"KI.3.1","Peran dan Hakekat Ilmu Kimia",null,null,null,{"$f":"VALUE(CONCATENATE(IF(B3>=Rerata_KKM,1,0),IF(C3>=Rerata_KKM,1,0),IF(D3>=Rerata_KKM,1,0)))","v":0},1,{"$f":"CONCATENATE(\"Tidak kompeten sama sekali baik pada \",PROPER(Deskripsi_01),\" ; \",PROPER(Deskripsi_02),\" maupun pada \",PROPER(Deskripsi_03),\".\")","v":"Tidak kompeten sama sekali baik pada Peran Dan Hakekat Ilmu Kimia ; Struktur Atom Dan Sistem Periodik Unsur maupun pada Ikatan Kimia."}]
[null,{"$f":"Rerata_KKM-1","v":75},{"$f":"Rerata_KKM-1","v":75},{"$f":"Rerata_KKM","v":76},null,2,null,null,"TTS",null,"KI.3.2","Struktur Atom dan Sistem Periodik Unsur",null,null,null,1,2,{"$f":"CONCATENATE(\"Menguasai kompetensi \",PROPER(Deskripsi_03),\", sedangkan pada \",PROPER(Deskripsi_01),\" maupun \",PROPER(Deskripsi_02),\" belum dikuasai.\")","v":"Menguasai kompetensi Ikatan Kimia, sedangkan pada Peran Dan Hakekat Ilmu Kimia maupun Struktur Atom Dan Sistem Periodik Unsur belum dikuasai."}]
[null,{"$f":"Rerata_KKM-1","v":75},{"$f":"Rerata_KKM","v":76},{"$f":"Rerata_KKM-1","v":75},null,3,null,"TTS",null,null,"KI.3.3","Ikatan Kimia",null,null,null,10,3,{"$f":"CONCATENATE(\"Menguasai kompetensi \",PROPER(Deskripsi_02),\", sedangkan pada \",PROPER(Deskripsi_01),\" maupun \",PROPER(Deskripsi_03),\" belum dikuasai.\")","v":"Menguasai kompetensi Struktur Atom Dan Sistem Periodik Unsur, sedangkan pada Peran Dan Hakekat Ilmu Kimia maupun Ikatan Kimia belum dikuasai."}]
[null,{"$f":"Rerata_KKM-1","v":75},{"$f":"Rerata_KKM","v":76},{"$f":"Rerata_KKM","v":76},null,4,null,"TTS","TTS",null,null,null,null,null,null,11,4,{"$f":"CONCATENATE(\"Menguasai sebagain besar kompetensi yaitu \",PROPER(Deskripsi_02),\" maupun pada \",PROPER(Deskripsi_03),\", tetapi pada \",PROPER(Deskripsi_01),\" belum dikuasai\")","v":"Menguasai sebagain besar kompetensi yaitu Struktur Atom Dan Sistem Periodik Unsur maupun pada Ikatan Kimia, tetapi pada Peran Dan Hakekat Ilmu Kimia belum dikuasai"}]
[null,{"$f":"Rerata_KKM","v":76},{"$f":"Rerata_KKM-1","v":75},{"$f":"Rerata_KKM-1","v":75},null,5,"TTS",null,null,null,null,null,null,null,null,100,5,{"$f":"CONCATENATE(\"Hanya pada \",PROPER(Deskripsi_01),\" yang telah mencapai kompetensi, sedangkan pada \",PROPER(Deskripsi_02),\" maupun \",PROPER(Deskripsi_03),\" belum dikuasai.\")","v":"Hanya pada Peran Dan Hakekat Ilmu Kimia yang telah mencapai kompetensi, sedangkan pada Struktur Atom Dan Sistem Periodik Unsur maupun Ikatan Kimia belum dikuasai."}]
[null,{"$f":"Rerata_KKM","v":76},{"$f":"Rerata_KKM-1","v":75},{"$f":"Rerata_KKM","v":76},null,6,"TTS",null,"TTS",null,null,null,null,null,null,101,6,{"$f":"CONCATENATE(\"Menguasai sebagian besar kompetensi yaitu \",PROPER(Deskripsi_01),\" maupun pada \",PROPER(Deskripsi_03),\", tetapi pada \",PROPER(Deskripsi_02),\" belum dikuasai.\")","v":"Menguasai sebagian besar kompetensi yaitu Peran Dan Hakekat Ilmu Kimia maupun pada Ikatan Kimia, tetapi pada Struktur Atom Dan Sistem Periodik Unsur belum dikuasai."}]
[null,{"$f":"Rerata_KKM","v":76},{"$f":"Rerata_KKM","v":76},{"$f":"Rerata_KKM-1","v":75},null,7,"TTS","TTS",null,null,null,null,null,null,null,110,7,{"$f":"CONCATENATE(\"Menguasai sebagian besar kompetensi yaitu \",PROPER(Deskripsi_01),\" maupun pada \",PROPER(Deskripsi_02),\", tetapi pada \",PROPER(Deskripsi_03),\" belum dikuasai.\")","v":"Menguasai sebagian besar kompetensi yaitu Peran Dan Hakekat Ilmu Kimia maupun pada Struktur Atom Dan Sistem Periodik Unsur, tetapi pada Ikatan Kimia belum dikuasai."}]
[null,{"$f":"Rerata_KKM","v":76},{"$f":"Rerata_KKM","v":76},{"$f":"Rerata_KKM","v":76},null,8,"TTS","TTS","TTS",null,null,null,null,null,null,111,8,{"$f":"CONCATENATE(\"Menguasai seluruh kompetensi baik pada \",PROPER(Deskripsi_01),\" ; \",PROPER(Deskripsi_02),\" maupun pada \",PROPER(Deskripsi_03),\".\")","v":"Menguasai seluruh kompetensi baik pada Peran Dan Hakekat Ilmu Kimia ; Struktur Atom Dan Sistem Periodik Unsur maupun pada Ikatan Kimia."}]
[]
[null,null,null,null,null,null,null,null,null,null,"Predikat","Deskripsi Untuk Ketrampilan",null,null,null,null,"Predikat","Tampilan Deskripsi Ketrampilan"]
[null,null,null,null,null,null,null,null,null,null,"Sangat Baik","Menguasai seluruh ketrampilan","Menganalisis model atom, struktur atom, dan tabel periodik","serta sudah bertindak jujur, disiplin, percaya diri",null,null,"Sangat Baik",{"$f":"PROPER(CONCATENATE(L13,\" \",M13,\" \",N13))","v":"Menguasai Seluruh Ketrampilan Menganalisis Model Atom, Struktur Atom, Dan Tabel Periodik Serta Sudah Bertindak Jujur, Disiplin, Percaya Diri"}]
[null,null,null,null,null,null,null,null,null,null,"Baik","Menguasai ketrampilan minimum","Menganalisis model atom, struktur atom, dan tabel periodik","namun dalam kejujuran dan percaya diri dalam mengikuti ujian masih perlu ditingkatkan",null,null,"Baik",{"$f":"PROPER(CONCATENATE(L14,\" \",M14,\" \",N14))","v":"Menguasai Ketrampilan Minimum Menganalisis Model Atom, Struktur Atom, Dan Tabel Periodik Namun Dalam Kejujuran Dan Percaya Diri Dalam Mengikuti Ujian Masih Perlu Ditingkatkan"}]
[null,null,null,null,null,null,null,null,null,null,"Cukup","Menguasai sebagian ketrampilan","Menganalisis model atom, struktur atom, dan tabel periodik","namun dalam melengkapi tugas yang diberikan guru masih perlu ditingkatkan",null,null,"Cukup",{"$f":"PROPER(CONCATENATE(L15,\" \",M15,\" \",N15))","v":"Menguasai Sebagian Ketrampilan Menganalisis Model Atom, Struktur Atom, Dan Tabel Periodik Namun Dalam Melengkapi Tugas Yang Diberikan Guru Masih Perlu Ditingkatkan"}]
[null,null,null,null,null,null,null,null,null,null,"Kurang","Tidak menguasai ketrampilan","Menganalisis model atom, struktur atom, dan tabel periodik",null,null,null,"Kurang",{"$f":"PROPER(CONCATENATE(L16,\" \",M16,\" \",N16))","v":"Tidak Menguasai Ketrampilan Menganalisis Model Atom, Struktur Atom, Dan Tabel Periodik "}]
[]
[null,null,null,null,null,null,null,null,null,null,"Predikat","Deskripsi Untuk Sikap Spiritual dan Sosial",null,null,null,null,"Predikat","Tampilan Deskripsi Sikap Spiritual dan Sosial"]
[null,null,null,null,null,null,null,null,null,null,"Sangat Baik","Selalu menunjukan","ibadah tepat waktu","jujur, disiplin, percaya diri",null,null,"Sangat Baik",{"$f":"PROPER(CONCATENATE(L19,\" \",M19,\" \",N19,\" - Sudah Konsisten\"))","v":"Selalu Menunjukan Ibadah Tepat Waktu Jujur, Disiplin, Percaya Diri - Sudah Konsisten"}]
[null,null,null,null,null,null,null,null,null,null,"Baik","Sering menunjukan","rasa syukur kepada Allah","tetapi kedisiplinan masih perlu ditingkatkan",null,null,"Baik",{"$f":"PROPER(CONCATENATE(L20,\" \",M20,\" \",N20,\" - mulai konsisten\"))","v":"Sering Menunjukan Rasa Syukur Kepada Allah Tetapi Kedisiplinan Masih Perlu Ditingkatkan - Mulai Konsisten"}]
[null,null,null,null,null,null,null,null,null,null,"Cukup","Kadang-kadang menunjukan","rasa syukur kepada Allah","bahkan masih sering terlambat hadir",null,null,"Cukup",{"$f":"PROPER(CONCATENATE(L21,\" \",M21,\" \",N21,\" - belum konsisten\"))","v":"Kadang-Kadang Menunjukan Rasa Syukur Kepada Allah Bahkan Masih Sering Terlambat Hadir - Belum Konsisten"}]
[null,null,null,null,null,null,null,null,null,null,"Kurang","Tidak pernah menunjukan","rasa syukur kepada Allah","dan tidak disiplin",null,null,"Kurang",{"$f":"PROPER(CONCATENATE(L22,\" \",M22,\" \",N22,\" - tidak konsisten\"))","v":"Tidak Pernah Menunjukan Rasa Syukur Kepada Allah Dan Tidak Disiplin - Tidak Konsisten"}]
[]
[null,null,null,null,null,null,null,null,null,null,"Sikap Spiritual",null,null,"Sikap Sosial"]
[null,null,null,null,null,null,null,null,null,null,"♥ doa sebelum dan sesudah melakukan sesuatu",null,null,"♥ Jujur"]
[null,null,null,null,null,null,null,null,null,null,"♥ rasa syukur setelah berhasil mengerjakan sesuatu",null,null,"♥ Disiplin"]
[null,null,null,null,null,null,null,null,null,null,"♥ salam sebelum dan sesudah menyampaikan pendapat",null,null,"♥ Tanggung Jawab"]
[null,null,null,null,null,null,null,null,null,null,"♥ ibadah tepat waktu",null,null,"♥ Toleransi"]
[null,null,null,null,null,null,null,null,null,null,"♥ rasa keimanan setelah mempelajari Iptek",null,null,"♥ Gotong Royong"]
[null,null,null,null,null,null,null,null,null,null,null,null,null,"♥ Santun"]
[null,null,null,null,null,null,null,null,null,null,null,null,null,"♥ Percaya Diri"]

{"sheet":"KOG","index":4,"n_rows":45,"n_cols":34,"rows_kept":45,"cut":false,"hidden":false,"merged":[[3,3,3,10],[4,11,4,13],[4,14,4,17],[2,28,3,29],[4,18,5,18],[3,11,3,18],[3,19,3,26],[4,19,4,21],[4,22,4,25],[4,26,5,26],[2,33,5,33],[44,0,44,2],[2,0,5,0],[2,1,5,1],[2,2,5,2],[4,3,4,5],[4,6,4,9],[4,30,5,30],[4,31,5,31],[4,32,5,32],[2,30,3,32],[3,27,5,27],[2,3,2,27],[4,10,5,10],[4,28,5,28],[4,29,5,29]]}
["DAFTAR NILAI PENGETAHUAN (Kognitif)"]
[]
["NO","NIS","NAMA SISWA","Nilai Harian (NH)",null,null,null,null,null,null,null,null,null,null,null,null,null,null,null,null,null,null,null,null,null,null,null,null,"Nilai",null,"NILAI RAPOR / (LHB)",null,null,"DESKRIPSI"]
[null,null,null,{"$f":"Deskripsi_01","v":"Peran dan Hakekat Ilmu Kimia"},null,null,null,null,null,null,null,{"$f":"Deskripsi_02","v":"Struktur Atom dan Sistem Periodik Unsur"},null,null,null,null,null,null,null,{"$f":"Deskripsi_03","v":"Ikatan Kimia"},null,null,null,null,null,null,null,"Rerata\nNH"]
[null,null,null,"Ulangan Harian",null,null,"Nilai Tugas (NT)",null,null,null,"Nilai Akhir KD-1","Ulangan Harian",null,null,"Nilai Tugas (NT)",null,null,null,"Nilai Akhir KD-2","Ulangan Harian",null,null,"Nilai Tugas (NT)",null,null,null,"Nilai Akhir KD-3",null,"Tengah Semester","Akhir Semester","Skala 100","Skala 4","Predikat"]
[null,null,null,"UH","Remidi","Rata2",1,2,3,"Rata2",null,"UH","Remidi","Rata2",1,2,3,"Rata2",null,"UH","Remidi","Rata2",1,2,3,"Rata2"]
[{"$f":"IF(ABS!B15=\"\",\"\",ABS!B15)","v":1},{"$f":"IF(ABS!C15=\"\",\"\",ABS!C15)","v":12427},{"$f":"IF(ABS!D15=\"\",\"\",PROPER(ABS!D15))","v":"Agnes Maulida Yulinar"},67,null,{"$f":"IF(CEKFILE<>\"Sudah Sama\",\"\",IF(D7=0,\"\",IF(OR(E7=0,E7=\"\"),D7,AVERAGE(D7:E7))))","v":""},90,98,null,{"$f":"IF(CEKFILE<>\"Sudah Sama\",\"\",IF(G7=0,\"\",IF(AND(I7=0,H7=0),G7,IF(I7=0,AVERAGE(G7:H7),AVERAGE(G7:I7)))))","v":""},{"$f":"IF(CEKFILE<>\"Sudah Sama\",\"\",IF(OR(F7=0,J7=\"\"),\"\",ROUND(SUM((2*F7),J7)/3,0)))","v":""},76,78,{"$f":"IF(CEKFILE<>\"Sudah Sama\",\"\",IF(L7=0,\"\",IF(OR(M7=0,M7=\"\"),L7,AVERAGE(L7:M7))))","v":""},100,null,null,{"$f":"IF(CEKFILE<>\"Sudah Sama\",\"\",IF(O7=0,\"\",IF(AND(Q7=0,P7=0),O7,IF(Q7=0,AVERAGE(O7:P7),AVERAGE(O7:Q7)))))","v":""},{"$f":"IF(CEKFILE<>\"Sudah Sama\",\"\",IF(OR(N7=0,R7=\"\"),\"\",ROUND(SUM((2*N7),R7)/3,0)))","v":""},89,78,{"$f":"IF(CEKFILE<>\"Sudah Sama\",\"\",IF(T7=0,\"\",IF(OR(U7=0,U7=\"\"),T7,AVERAGE(T7:U7))))","v":""},67,80,null,{"$f":"IF(CEKFILE<>\"Sudah Sama\",\"\",IF(W7=0,\"\",IF(AND(Y7=0,X7=0),W7,IF(Y7=0,AVERAGE(W7:X7),AVERAGE(W7:Y7)))))","v":""},{"$f":"IF(CEKFILE<>\"Sudah Sama\",\"\",IF(OR(V7=0,Z7=\"\"),\"\",ROUND(SUM((2*V7),Z7)/3,0)))","v":""},{"$f":"IF(OR(K7=0,K7=\"\"),\"\",IF(AND(S7=0,AA7=0),K7,IF(AA7=0,AVERAGE(K7:S7),AVERAGE(K7:AA7))))","v":""},null,78,{"$f":"IF(CEKFILE<>\"Sudah Sama\",\"\",IF(OR($AB7=0,$AB7=\"\"),\"\",IF(AC7=\"\",((2*AB7)+AD7)/3,ROUND(((2*AB7)+SUM(AC7:AD7))/4,2))))","v":""},{"$f":"IF(CEKFILE<>\"Sudah Sama\",\"\",IF(OR($AB7=0,$AB7=\"\"),\"\",NILAI_KONVERSI(AE7)))","v":""},{"$f":"IF(CEKFILE<>\"Sudah Sama\",\"\",IF(AE7=\"\",\"\",NILAI_PREDIKAT(AF7)))","v":""},{"$f":"IF(CEKFILE<>\"Sudah Sama\",\"\",IFERROR(VLOOKUP(IF(OR(K7=\"\",S7=\"\",AA7=\"\"),\"Ada yg Masih Kosong\",VALUE(CONCATENATE(IF(K7>=Rerata_KKM,1,0),IF(S7>=Rerata_KKM,1,0),IF(AA7>=Rerata_KKM,1,0)))),DESKRIPSITUNTAS,3,FALSE),\"\"))","v":""}]
[{"$f":"IF(ABS!B16=\"\",\"\",ABS!B16)","v":2},{"$f":"IF(ABS!C16=\"\",\"\",ABS!C16)","v":12436},{"$f":"IF(ABS!D16=\"\",\"\",PROPER(ABS!D16))","v":"Akhmad Zanuar Hidayat"},null,null,"",null,null,null,"","",null,null,"",null,null,null,"","",null,null,"",null,null,null,"","",{"$f":"IF(OR(K8=0,K8=\"\"),\"\",IF(AND(S8=0,AA8=0),K8,IF(AA8=0,AVERAGE(K8:S8),AVERAGE(K8:AA8))))","v":""},null,null,"","",{"$f":"IF(CEKFILE<>\"Sudah Sama\",\"\",IF(AE8=\"\",\"\",NILAI_PREDIKAT(AF8)))","v":""},""]
[{"$f":"IF(ABS!B17=\"\",\"\",ABS!B17)","v":3},{"$f":"IF(ABS!C17=\"\",\"\",ABS!C17)","v":12440},{"$f":"IF(ABS!D17=\"\",\"\",PROPER(ABS!D17))","v":"Alfiyan Andhi Pratama"},null,null,"",null,null,null,"","",null,null,"",null,null,null,"","",null,null,"",null,null,null,"","","",null,null,"","",{"$f":"IF(CEKFILE<>\"Sudah Sama\",\"\",IF(AE9=\"\",\"\",NILAI_PREDIKAT(AF9)))","v":""},""]
[{"$f":"IF(ABS!B18=\"\",\"\",ABS!B18)","v":4},{"$f":"IF(ABS!C18=\"\",\"\",ABS!C18)","v":12447},{"$f":"IF(ABS!D18=\"\",\"\",PROPER(ABS!D18))","v":"Amalia Majid"},null,null,"",null,null,null,"","",null,null,"",null,null,null,"","",null,null,"",null,null,null,"","","",null,null,"","",{"$f":"IF(CEKFILE<>\"Sudah Sama\",\"\",IF(AE10=\"\",\"\",NILAI_PREDIKAT(AF10)))","v":""},""]
[{"$f":"IF(ABS!B19=\"\",\"\",ABS!B19)","v":5},{"$f":"IF(ABS!C19=\"\",\"\",ABS!C19)","v":12454},{"$f":"IF(ABS!D19=\"\",\"\",PROPER(ABS!D19))","v":"Annisaa Putri Desihana"},null,null,"",null,null,null,"","",null,null,"",null,null,null,"","",null,null,"",null,null,null,"","","",null,null,"","",{"$f":"IF(CEKFILE<>\"Sudah Sama\",\"\",IF(AE11=\"\",\"\",NILAI_PREDIKAT(AF11)))","v":""},""]
[{"$f":"IF(ABS!B20=\"\",\"\",ABS!B20)","v":6},{"$f":"IF(ABS!C20=\"\",\"\",ABS!C20)","v":12468},{"$f":"IF(ABS!D20=\"\",\"\",PROPER(ABS!D20))","v":"Asfi Ma'Ruf Fairuzzabad"},null,null,"",null,null,null,"","",null,null,"",null,null,null,"","",null,null,"",null,null,null,"","","",null,null,"","",{"$f":"IF(CEKFILE<>\"Sudah Sama\",\"\",IF(AE12=\"\",\"\",NILAI_PREDIKAT(AF12)))","v":""},""]
[{"$f":"IF(ABS!B21=\"\",\"\",ABS!B21)","v":7},{"$f":"IF(ABS!C21=\"\",\"\",ABS!C21)","v":12505},{"$f":"IF(ABS!D21=\"\",\"\",PROPER(ABS!D21))","v":"Desy Anisa Purnamasari"},null,null,"",null,null,null,"","",null,null,"",null,null,null,"","",null,null,"",null,null,null,"","","",null,null,"","",{"$f":"IF(CEKFILE<>\"Sudah Sama\",\"\",IF(AE13=\"\",\"\",NILAI_PREDIKAT(AF13)))","v":""},""]
[{"$f":"IF(ABS!B22=\"\",\"\",ABS!B22)","v":8},{"$f":"IF(ABS!C22=\"\",\"\",ABS!C22)","v":12517},{"$f":"IF(ABS!D22=\"\",\"\",PROPER(ABS!D22))","v":"Dina Lutfi Hanifah"},null,null,"",null,null,null,"","",null,null,"",null,null,null,"","",null,null,"",null,null,null,"","","",null,null,"","",{"$f":"IF(CEKFILE<>\"Sudah Sama\",\"\",IF(AE14=\"\",\"\",NILAI_PREDIKAT(AF14)))","v":""},""]
[{"$f":"IF(ABS!B23=\"\",\"\",ABS!B23)","v":9},{"$f":"IF(ABS!C23=\"\",\"\",ABS!C23)","v":12524},{"$f":"IF(ABS!D23=\"\",\"\",PROPER(ABS!D23))","v":"Dwi Setyoningsih"},null,null,"",null,null,null,"","",null,null,"",null,null,null,"","",null,null,"",null,null,null,"","","",null,null,"","",{"$f":"IF(CEKFILE<>\"Sudah Sama\",\"\",IF(AE15=\"\",\"\",NILAI_PREDIKAT(AF15)))","v":""},""]
[{"$f":"IF(ABS!B24=\"\",\"\",ABS!B24)","v":10},{"$f":"IF(ABS!C24=\"\",\"\",ABS!C24)","v":12531},{"$f":"IF(ABS!D24=\"\",\"\",PROPER(ABS!D24))","v":"Eka Prasetya"},null,null,"",null,null,null,"","",null,null,"",null,null,null,"","",null,null,"",null,null,null,"","","",null,null,"","",{"$f":"IF(CEKFILE<>\"Sudah Sama\",\"\",IF(AE16=\"\",\"\",NILAI_PREDIKAT(AF16)))","v":""},""]
[{"$f":"IF(ABS!B25=\"\",\"\",ABS!B25)","v":11},{"$f":"IF(ABS!C25=\"\",\"\",ABS!C25)","v":12539},{"$f":"IF(ABS!D25=\"\",\"\",PROPER(ABS!D25))","v":"Erlangga Yudhanto Wibowo"},null,null,"",null,null,null,"","",null,null,"",null,null,null,"","",null,null,"",null,null,null,"","","",null,null,"","",{"$f":"IF(CEKFILE<>\"Sudah Sama\",\"\",IF(AE17=\"\",\"\",NILAI_PREDIKAT(AF17)))","v":""},""]
[{"$f":"IF(ABS!B26=\"\",\"\",ABS!B26)","v":12},{"$f":"IF(ABS!C26=\"\",\"\",ABS!C26)","v":12546},{"$f":"IF(ABS!D26=\"\",\"\",PROPER(ABS!D26))","v":"Falsafa Luthfiana Ummi Syahada"},null,null,"",null,null,null,"","",null,null,"",null,null,null,"","",null,null,"",null,null,null,"","","",null,null,"","",{"$f":"IF(CEKFILE<>\"Sudah Sama\",\"\",IF(AE18=\"\",\"\",NILAI_PREDIKAT(AF18)))","v":""},""]
[{"$f":"IF(ABS!B27=\"\",\"\",ABS!B27)","v":13},{"$f":"IF(ABS!C27=\"\",\"\",ABS!C27)","v":12548},{"$f":"IF(ABS!D27=\"\",\"\",PROPER(ABS!D27))","v":"Farid Hidayat"},null,null,"",null,null,null,"","",null,null,"",null,null,null,"","",null,null,"",null,null,null,"","","",null,null,"","",{"$f":"IF(CEKFILE<>\"Sudah Sama\",\"\",IF(AE19=\"\",\"\",NILAI_PREDIKAT(AF19)))","v":""},""]
[{"$f":"IF(ABS!B28=\"\",\"\",ABS!B28)","v":14},{"$f":"IF(ABS!C28=\"\",\"\",ABS!C28)","v":12562},{"$f":"IF(ABS!D28=\"\",\"\",PROPER(ABS!D28))","v":"Gayuh Anindyaningrum"},null,null,"",null,null,null,"","",null,null,"",null,null,null,"","",null,null,"",null,null,null,"","","",null,null,"","",{"$f":"IF(CEKFILE<>\"Sudah Sama\",\"\",IF(AE20=\"\",\"\",NILAI_PREDIKAT(AF20)))","v":""},""]
[{"$f":"IF(ABS!B29=\"\",\"\",ABS!B29)","v":15},{"$f":"IF(ABS!C29=\"\",\"\",ABS!C29)","v":12583},{"$f":"IF(ABS!D29=\"\",\"\",PROPER(ABS!D29))","v":"Ihwan Qorib"},null,null,"",null,null,null,"","",null,null,"",null,null,null,"","",null,null,"",null,null,null,"","","",null,null,"","",{"$f":"IF(CEKFILE<>\"Sudah Sama\",\"\",IF(AE21=\"\",\"\",NILAI_PREDIKAT(AF21)))","v":""},""]
[{"$f":"IF(ABS!B30=\"\",\"\",ABS!B30)","v":16},{"$f":"IF(ABS!C30=\"\",\"\",ABS!C30)","v":12597},{"$f":"IF(ABS!D30=\"\",\"\",PROPER(ABS!D30))","v":"Irvani Putri"},null,null,"",null,null,null,"","",null,null,"",null,null,null,"","",null,null,"",null,null,null,"","","",null,null,"","",{"$f":"IF(CEKFILE<>\"Sudah Sama\",\"\",IF(AE22=\"\",\"\",NILAI_PREDIKAT(AF22)))","v":""},""]
[{"$f":"IF(ABS!B31=\"\",\"\",ABS!B31)","v":17},{"$f":"IF(ABS!C31=\"\",\"\",ABS!C31)","v":12607},{"$f":"IF(ABS!D31=\"\",\"\",PROPER(ABS!D31))","v":"Kristian Adi Bawono"},null,null,"",null,null,null,"","",null,null,"",null,null,null,"","",null,null,"",null,null,null,"","","",null,null,"","",{"$f":"IF(CEKFILE<>\"Sudah Sama\",\"\",IF(AE23=\"\",\"\",NILAI_PREDIKAT(AF23)))","v":""},""]
[{"$f":"IF(ABS!B32=\"\",\"\",ABS!B32)","v":18},{"$f":"IF(ABS!C32=\"\",\"\",ABS!C32)","v":12618},{"$f":"IF(ABS!D32=\"\",\"\",PROPER(ABS!D32))","v":"Lutfi Imanika Vianti"},null,null,"",null,null,null,"","",null,null,"",null,null,null,"","",null,null,"",null,null,null,"","","",null,null,"","",{"$f":"IF(CEKFILE<>\"Sudah Sama\",\"\",IF(AE24=\"\",\"\",NILAI_PREDIKAT(AF24)))","v":""},""]
[{"$f":"IF(ABS!B33=\"\",\"\",ABS!B33)","v":19},{"$f":"IF(ABS!C33=\"\",\"\",ABS!C33)","v":12625},{"$f":"IF(ABS!D33=\"\",\"\",PROPER(ABS!D33))","v":"Meilani Kartika"},null,null,"",null,null,null,"","",null,null,"",null,null,null,"","",null,null,"",null,null,null,"","","",null,null,"","",{"$f":"IF(CEKFILE<>\"Sudah Sama\",\"\",IF(AE25=\"\",\"\",NILAI_PREDIKAT(AF25)))","v":""},""]
[{"$f":"IF(ABS!B34=\"\",\"\",ABS!B34)","v":20},{"$f":"IF(ABS!C34=\"\",\"\",ABS!C34)","v":12699},{"$f":"IF(ABS!D34=\"\",\"\",PROPER(ABS!D34))","v":"Riesty Wulan"},null,null,"",null,null,null,"","",null,null,"",null,null,null,"","",null,null,"",null,null,null,"","","",null,null,"","",{"$f":"IF(CEKFILE<>\"Sudah Sama\",\"\",IF(AE26=\"\",\"\",NILAI_PREDIKAT(AF26)))","v":""},""]
[{"$f":"IF(ABS!B35=\"\",\"\",ABS!B35)","v":21},{"$f":"IF(ABS!C35=\"\",\"\",ABS!C35)","v":12703},{"$f":"IF(ABS!D35=\"\",\"\",PROPER(ABS!D35))","v":"Risa Puspitarini"},null,null,"",null,null,null,"","",null,null,"",null,null,null,"","",null,null,"",null,null,null,"","","",null,null,"","",{"$f":"IF(CEKFILE<>\"Sudah Sama\",\"\",IF(AE27=\"\",\"\",NILAI_PREDIKAT(AF27)))","v":""},""]
[{"$f":"IF(ABS!B36=\"\",\"\",ABS!B36)","v":22},{"$f":"IF(ABS!C36=\"\",\"\",ABS!C36)","v":12707},{"$f":"IF(ABS!D36=\"\",\"\",PROPER(ABS!D36))","v":"Rivan Setiawan"},null,null,"",null,null,null,"","",null,null,"",null,null,null,"","",null,null,"",null,null,null,"","","",null,null,"","",{"$f":"IF(CEKFILE<>\"Sudah Sama\",\"\",IF(AE28=\"\",\"\",NILAI_PREDIKAT(AF28)))","v":""},""]
[{"$f":"IF(ABS!B37=\"\",\"\",ABS!B37)","v":23},{"$f":"IF(ABS!C37=\"\",\"\",ABS!C37)","v":12724},{"$f":"IF(ABS!D37=\"\",\"\",PROPER(ABS!D37))","v":"Septian Rizky Hadi"},null,null,"",null,null,null,"","",null,null,"",null,null,null,"","",null,null,"",null,null,null,"","","",null,null,"","",{"$f":"IF(CEKFILE<>\"Sudah Sama\",\"\",IF(AE29=\"\",\"\",NILAI_PREDIKAT(AF29)))","v":""},""]
[{"$f":"IF(ABS!B38=\"\",\"\",ABS!B38)","v":24},{"$f":"IF(ABS!C38=\"\",\"\",ABS!C38)","v":12751},{"$f":"IF(ABS!D38=\"\",\"\",PROPER(ABS!D38))","v":"Tyastuti Anjarsari"},null,null,"",null,null,null,"","",null,null,"",null,null,null,"","",null,null,"",null,null,null,"","","",null,null,"","",{"$f":"IF(CEKFILE<>\"Sudah Sama\",\"\",IF(AE30=\"\",\"\",NILAI_PREDIKAT(AF30)))","v":""},""]
[{"$f":"IF(ABS!B39=\"\",\"\",ABS!B39)","v":25},{"$f":"IF(ABS!C39=\"\",\"\",ABS!C39)","v":12768},{"$f":"IF(ABS!D39=\"\",\"\",PROPER(ABS!D39))","v":"Wila Tri Wahyudita Savik Iswara"},null,null,"",null,null,null,"","",null,null,"",null,null,null,"","",null,null,"",null,null,null,"","","",null,null,"","",{"$f":"IF(CEKFILE<>\"Sudah Sama\",\"\",IF(AE31=\"\",\"\",NILAI_PREDIKAT(AF31)))","v":""},""]
[{"$f":"IF(ABS!B40=\"\",\"\",ABS!B40)","v":""},{"$f":"IF(ABS!C40=\"\",\"\",ABS!C40)","v":""},{"$f":"IF(ABS!D40=\"\",\"\",PROPER(ABS!D40))","v":""},null,null,"",null,null,null,"","",null,null,"",null,null,null,"","",null,null,"",null,null,null,"","","",null,null,"","",{"$f":"IF(CEKFILE<>\"Sudah Sama\",\"\",IF(AE32=\"\",\"\",NILAI_PREDIKAT(AF32)))","v":""},""]
[{"$f":"IF(ABS!B41=\"\",\"\",ABS!B41)","v":""},{"$f":"IF(ABS!C41=\"\",\"\",ABS!C41)","v":""},{"$f":"IF(ABS!D41=\"\",\"\",PROPER(ABS!D41))","v":""},null,null,"",null,null,null,"","",null,null,"",null,null,null,"","",null,null,"",null,null,null,"","","",null,null,"","",{"$f":"IF(CEKFILE<>\"Sudah Sama\",\"\",IF(AE33=\"\",\"\",NILAI_PREDIKAT(AF33)))","v":""},""]
[{"$f":"IF(ABS!B42=\"\",\"\",ABS!B42)","v":""},{"$f":"IF(ABS!C42=\"\",\"\",ABS!C42)","v":""},{"$f":"IF(ABS!D42=\"\",\"\",PROPER(ABS!D42))","v":""},null,null,"",null,null,null,"","",null,null,"",null,null,null,"","",null,null,"",null,null,null,"","","",null,null,"","",{"$f":"IF(CEKFILE<>\"Sudah Sama\",\"\",IF(AE34=\"\",\"\",NILAI_PREDIKAT(AF34)))","v":""},""]
[{"$f":"IF(ABS!B43=\"\",\"\",ABS!B43)","v":""},{"$f":"IF(ABS!C43=\"\",\"\",ABS!C43)","v":""},{"$f":"IF(ABS!D43=\"\",\"\",PROPER(ABS!D43))","v":""},null,null,"",null,null,null,"","",null,null,"",null,null,null,"","",null,null,"",null,null,null,"","","",null,null,"","",{"$f":"IF(CEKFILE<>\"Sudah Sama\",\"\",IF(AE35=\"\",\"\",NILAI_PREDIKAT(AF35)))","v":""},""]
[{"$f":"IF(ABS!B44=\"\",\"\",ABS!B44)","v":""},{"$f":"IF(ABS!C44=\"\",\"\",ABS!C44)","v":""},{"$f":"IF(ABS!D44=\"\",\"\",PROPER(ABS!D44))","v":""},null,null,"",null,null,null,"","",null,null,"",null,null,null,"","",null,null,"",null,null,null,"","","",null,null,"","",{"$f":"IF(CEKFILE<>\"Sudah Sama\",\"\",IF(AE36=\"\",\"\",NILAI_PREDIKAT(AF36)))","v":""},""]
[{"$f":"IF(ABS!B45=\"\",\"\",ABS!B45)","v":""},{"$f":"IF(ABS!C45=\"\",\"\",ABS!C45)","v":""},{"$f":"IF(ABS!D45=\"\",\"\",PROPER(ABS!D45))","v":""},null,null,"",null,null,null,"","",null,null,"",null,null,null,"","",null,null,"",null,null,null,"","","",null,null,"","",{"$f":"IF(CEKFILE<>\"Sudah Sama\",\"\",IF(AE37=\"\",\"\",NILAI_PREDIKAT(AF37)))","v":""},""]
[{"$f":"IF(ABS!B46=\"\",\"\",ABS!B46)","v":""},{"$f":"IF(ABS!C46=\"\",\"\",ABS!C46)","v":""},{"$f":"IF(ABS!D46=\"\",\"\",PROPER(ABS!D46))","v":""},null,null,"",null,null,null,"","",null,null,"",null,null,null,"","",null,null,"",null,null,null,"","","",null,null,"","",{"$f":"IF(CEKFILE<>\"Sudah Sama\",\"\",IF(AE38=\"\",\"\",NILAI_PREDIKAT(AF38)))","v":""},""]
[{"$f":"IF(ABS!B47=\"\",\"\",ABS!B47)","v":""},{"$f":"IF(ABS!C47=\"\",\"\",ABS!C47)","v":""},{"$f":"IF(ABS!D47=\"\",\"\",PROPER(ABS!D47))","v":""},null,null,"",null,null,null,"","",null,null,"",null,null,null,"","",null,null,"",null,null,null,"","","",null,null,"","",{"$f":"IF(CEKFILE<>\"Sudah Sama\",\"\",IF(AE39=\"\",\"\",NILAI_PREDIKAT(AF39)))","v":""},""]
[{"$f":"IF(ABS!B48=\"\",\"\",ABS!B48)","v":""},{"$f":"IF(ABS!C48=\"\",\"\",ABS!C48)","v":""},{"$f":"IF(ABS!D48=\"\",\"\",PROPER(ABS!D48))","v":""},null,null,"",null,null,null,"","",null,null,"",null,null,null,"","",null,null,"",null,null,null,"","","",null,null,"","",{"$f":"IF(CEKFILE<>\"Sudah Sama\",\"\",IF(AE40=\"\",\"\",NILAI_PREDIKAT(AF40)))","v":""},""]
[{"$f":"IF(ABS!B49=\"\",\"\",ABS!B49)","v":""},{"$f":"IF(ABS!C49=\"\",\"\",ABS!C49)","v":""},{"$f":"IF(ABS!D49=\"\",\"\",PROPER(ABS!D49))","v":""},null,null,"",null,null,null,"","",null,null,"",null,null,null,"","",null,null,"",null,null,null,"","","",null,null,"","",{"$f":"IF(CEKFILE<>\"Sudah Sama\",\"\",IF(AE41=\"\",\"\",NILAI_PREDIKAT(AF41)))","v":""},""]
[{"$f":"IF(ABS!B50=\"\",\"\",ABS!B50)","v":""},{"$f":"IF(ABS!C50=\"\",\"\",ABS!C50)","v":""},{"$f":"IF(ABS!D50=\"\",\"\",PROPER(ABS!D50))","v":""},null,null,"",null,null,null,"","",null,null,"",null,null,null,"","",null,null,"",null,null,null,"","","",null,null,"","",{"$f":"IF(CEKFILE<>\"Sudah Sama\",\"\",IF(AE42=\"\",\"\",NILAI_PREDIKAT(AF42)))","v":""},""]
[{"$f":"IF(ABS!B51=\"\",\"\",ABS!B51)","v":""},{"$f":"IF(ABS!C51=\"\",\"\",ABS!C51)","v":""},{"$f":"IF(ABS!D51=\"\",\"\",PROPER(ABS!D51))","v":""},null,null,"",null,null,null,"","",null,null,"",null,null,null,"","",null,null,"",null,null,null,"","","",null,null,"","",{"$f":"IF(CEKFILE<>\"Sudah Sama\",\"\",IF(AE43=\"\",\"\",NILAI_PREDIKAT(AF43)))","v":""},""]
[{"$f":"IF(ABS!B52=\"\",\"\",ABS!B52)","v":""},{"$f":"IF(ABS!C52=\"\",\"\",ABS!C52)","v":""},{"$f":"IF(ABS!D52=\"\",\"\",PROPER(ABS!D52))","v":""},null,null,"",null,null,null,"","",null,null,"",null,null,null,"","",null,null,"",null,null,null,"","","",null,null,"","",{"$f":"IF(CEKFILE<>\"Sudah Sama\",\"\",IF(AE44=\"\",\"\",NILAI_PREDIKAT(AF44)))","v":""},""]
["RATA-RATA",null,null,{"$f":"IF(SUM(D7:D44)=0,\"\",AVERAGE(D7:D44))","v":67},"","",90,98,"","",{"$f":"IF(SUM(K7:K44)=0,\"\",AVERAGE(K7:K44))","v":""},{"$f":"IF(SUM(L7:L44)=0,\"\",AVERAGE(L7:L44))","v":76},78,"",100,"","","","",89,78,"",67,80,"","","","","",78,{"$f":"IF(OR($AB45=0,$AB45=\"\"),\"\",ROUND(((2*AB45)+SUM(AC45:AD45))/4,2))","v":""},""]

{"sheet":"PSI","index":5,"n_rows":43,"n_cols":19,"rows_kept":43,"cut":false,"hidden":false,"merged":[[42,0,42,2],[2,0,3,0],[2,1,3,1],[2,2,3,2],[2,3,2,5],[2,15,2,17],[2,18,3,18],[2,12,2,14],[2,6,2,8],[2,9,2,11]]}
["DAFTAR NILAI KETRAMPILAN"]
[]
["NO","NIS","NAMA","Nilai Praktik",null,null,"Nilai Projek",null,null,"Nilai Portofolio",null,null,"Rerata Nilai",null,null,"NILAI RAPOR / (LHB)",null,null,"DESKRIPSI"]
[null,null,null,"KD1","KD2","KD3","KD1","KD2","KD3","KD1","KD2","KD3","Praktik","Projek","Porto\nfolio","Skala 100","Skala 4","Predikat"]
[{"$f":"IF(ABS!B15=\"\",\"\",ABS!B15)","v":1},{"$f":"IF(ABS!C15=\"\",\"\",ABS!C15)","v":12427},{"$f":"IF(ABS!D15=\"\",\"\",PROPER(ABS!D15))","v":"Agnes Maulida Yulinar"},98,78,65,45,null,null,56,null,null,{"$f":"IF(OR(D5=0,D5=\"\"),\"\",IF(AND(E5=0,F5=0),D5,IF(F5=0,AVERAGE(D5:E5),AVERAGE(D5:F5))))","v":80.333333333333329},{"$f":"IF(OR(G5=0,G5=\"\"),\"\",IF(AND(H5=0,I5=0),G5,IF(I5=0,AVERAGE(G5:H5),AVERAGE(G5:I5))))","v":45},{"$f":"IF(OR(J5=0,J5=\"\"),\"\",IF(AND(K5=0,L5=0),J5,IF(L5=0,AVERAGE(J5:K5),AVERAGE(J5:L5))))","v":56},{"$f":"IF(OR(M5=0,M5=\"\"),\"\",IF(AND(N5=0,O5=0),M5,IF(O5=0,AVERAGE(M5:N5),AVERAGE(M5:O5))))","v":60.444444444444436},{"$f":"IF(OR($M5=0,$M5=\"\"),\"\",NILAI_KONVERSI(P5))","v":1.66},{"$f":"IF(P5=\"\",\"\",NILAI_PREDIKAT(Q5))","v":"C"},{"$f":"IFERROR(VLOOKUP(Nilai_Predikat2(Q5),DESKRIPSIKETRAMPILAN,2,FALSE),\"\")","v":"Menguasai Sebagian Ketrampilan Menganalisis Model Atom, Struktur Atom, Dan Tabel Periodik Namun Dalam Melengkapi Tugas Yang Diberikan Guru Masih Perlu Ditingkatkan"}]
[{"$f":"IF(ABS!B16=\"\",\"\",ABS!B16)","v":2},{"$f":"IF(ABS!C16=\"\",\"\",ABS!C16)","v":12436},{"$f":"IF(ABS!D16=\"\",\"\",PROPER(ABS!D16))","v":"Akhmad Zanuar Hidayat"},23,null,null,89,null,null,90,null,null,{"$f":"IF(OR(D6=0,D6=\"\"),\"\",IF(AND(E6=0,F6=0),D6,IF(F6=0,AVERAGE(D6:E6),AVERAGE(D6:F6))))","v":23},{"$f":"IF(OR(G6=0,G6=\"\"),\"\",IF(AND(H6=0,I6=0),G6,IF(I6=0,AVERAGE(G6:H6),AVERAGE(G6:I6))))","v":89},{"$f":"IF(OR(J6=0,J6=\"\"),\"\",IF(AND(K6=0,L6=0),J6,IF(L6=0,AVERAGE(J6:K6),AVERAGE(J6:L6))))","v":90},{"$f":"IF(OR(M6=0,M6=\"\"),\"\",IF(AND(N6=0,O6=0),M6,IF(O6=0,AVERAGE(M6:N6),AVERAGE(M6:O6))))","v":67.333333333333329},2,{"$f":"IF(P6=\"\",\"\",NILAI_PREDIKAT(Q6))","v":"C"},{"$f":"IFERROR(VLOOKUP(Nilai_Predikat2(Q6),DESKRIPSIKETRAMPILAN,2,FALSE),\"\")","v":"Menguasai Sebagian Ketrampilan Menganalisis Model Atom, Struktur Atom, Dan Tabel Periodik Namun Dalam Melengkapi Tugas Yang Diberikan Guru Masih Perlu Ditingkatkan"}]
[{"$f":"IF(ABS!B17=\"\",\"\",ABS!B17)","v":3},{"$f":"IF(ABS!C17=\"\",\"\",ABS!C17)","v":12440},{"$f":"IF(ABS!D17=\"\",\"\",PROPER(ABS!D17))","v":"Alfiyan Andhi Pratama"},null,null,null,null,null,null,null,null,null,"","","","","",{"$f":"IF(P7=\"\",\"\",NILAI_PREDIKAT(Q7))","v":""},{"$f":"IFERROR(VLOOKUP(Nilai_Predikat2(Q7),DESKRIPSIKETRAMPILAN,2,FALSE),\"\")","v":""}]
[{"$f":"IF(ABS!B18=\"\",\"\",ABS!B18)","v":4},{"$f":"IF(ABS!C18=\"\",\"\",ABS!C18)","v":12447},{"$f":"IF(ABS!D18=\"\",\"\",PROPER(ABS!D18))","v":"Amalia Majid"},null,null,null,null,null,null,null,null,null,"","","","","",{"$f":"IF(P8=\"\",\"\",NILAI_PREDIKAT(Q8))","v":""},{"$f":"IFERROR(VLOOKUP(Nilai_Predikat2(Q8),DESKRIPSIKETRAMPILAN,2,FALSE),\"\")","v":""}]
[{"$f":"IF(ABS!B19=\"\",\"\",ABS!B19)","v":5},{"$f":"IF(ABS!C19=\"\",\"\",ABS!C19)","v":12454},{"$f":"IF(ABS!D19=\"\",\"\",PROPER(ABS!D19))","v":"Annisaa Putri Desihana"},null,null,null,null,null,null,null,null,null,"","","","","",{"$f":"IF(P9=\"\",\"\",NILAI_PREDIKAT(Q9))","v":""},{"$f":"IFERROR(VLOOKUP(Nilai_Predikat2(Q9),DESKRIPSIKETRAMPILAN,2,FALSE),\"\")","v":""}]
[{"$f":"IF(ABS!B20=\"\",\"\",ABS!B20)","v":6},{"$f":"IF(ABS!C20=\"\",\"\",ABS!C20)","v":12468},{"$f":"IF(ABS!D20=\"\",\"\",PROPER(ABS!D20))","v":"Asfi Ma'Ruf Fairuzzabad"},null,null,null,null,null,null,null,null,null,"","","","","",{"$f":"IF(P10=\"\",\"\",NILAI_PREDIKAT(Q10))","v":""},{"$f":"IFERROR(VLOOKUP(Nilai_Predikat2(Q10),DESKRIPSIKETRAMPILAN,2,FALSE),\"\")","v":""}]
[{"$f":"IF(ABS!B21=\"\",\"\",ABS!B21)","v":7},{"$f":"IF(ABS!C21=\"\",\"\",ABS!C21)","v":12505},{"$f":"IF(ABS!D21=\"\",\"\",PROPER(ABS!D21))","v":"Desy Anisa Purnamasari"},null,null,null,null,null,null,null,null,null,"","","","","",{"$f":"IF(P11=\"\",\"\",NILAI_PREDIKAT(Q11))","v":""},{"$f":"IFERROR(VLOOKUP(Nilai_Predikat2(Q11),DESKRIPSIKETRAMPILAN,2,FALSE),\"\")","v":""}]
[{"$f":"IF(ABS!B22=\"\",\"\",ABS!B22)","v":8},{"$f":"IF(ABS!C22=\"\",\"\",ABS!C22)","v":12517},{"$f":"IF(ABS!D22=\"\",\"\",PROPER(ABS!D22))","v":"Dina Lutfi Hanifah"},null,null,null,null,null,null,null,null,null,"","","","","",{"$f":"IF(P12=\"\",\"\",NILAI_PREDIKAT(Q12))","v":""},{"$f":"IFERROR(VLOOKUP(Nilai_Predikat2(Q12),DESKRIPSIKETRAMPILAN,2,FALSE),\"\")","v":""}]
[{"$f":"IF(ABS!B23=\"\",\"\",ABS!B23)","v":9},{"$f":"IF(ABS!C23=\"\",\"\",ABS!C23)","v":12524},{"$f":"IF(ABS!D23=\"\",\"\",PROPER(ABS!D23))","v":"Dwi Setyoningsih"},null,null,null,null,null,null,null,null,null,"","","","","",{"$f":"IF(P13=\"\",\"\",NILAI_PREDIKAT(Q13))","v":""},{"$f":"IFERROR(VLOOKUP(Nilai_Predikat2(Q13),DESKRIPSIKETRAMPILAN,2,FALSE),\"\")","v":""}]
[{"$f":"IF(ABS!B24=\"\",\"\",ABS!B24)","v":10},{"$f":"IF(ABS!C24=\"\",\"\",ABS!C24)","v":12531},{"$f":"IF(ABS!D24=\"\",\"\",PROPER(ABS!D24))","v":"Eka Prasetya"},null,null,null,null,null,null,null,null,null,"","","","","",{"$f":"IF(P14=\"\",\"\",NILAI_PREDIKAT(Q14))","v":""},{"$f":"IFERROR(VLOOKUP(Nilai_Predikat2(Q14),DESKRIPSIKETRAMPILAN,2,FALSE),\"\")","v":""}]
[{"$f":"IF(ABS!B25=\"\",\"\",ABS!B25)","v":11},{"$f":"IF(ABS!C25=\"\",\"\",ABS!C25)","v":12539},{"$f":"IF(ABS!D25=\"\",\"\",PROPER(ABS!D25))","v":"Erlangga Yudhanto Wibowo"},null,null,null,null,null,null,null,null,null,"","","","","",{"$f":"IF(P15=\"\",\"\",NILAI_PREDIKAT(Q15))","v":""},{"$f":"IFERROR(VLOOKUP(Nilai_Predikat2(Q15),DESKRIPSIKETRAMPILAN,2,FALSE),\"\")","v":""}]
[{"$f":"IF(ABS!B26=\"\",\"\",ABS!B26)","v":12},{"$f":"IF(ABS!C26=\"\",\"\",ABS!C26)","v":12546},{"$f":"IF(ABS!D26=\"\",\"\",PROPER(ABS!D26))","v":"Falsafa Luthfiana Ummi Syahada"},null,null,null,null,null,null,null,null,null,"","","","","",{"$f":"IF(P16=\"\",\"\",NILAI_PREDIKAT(Q16))","v":""},{"$f":"IFERROR(VLOOKUP(Nilai_Predikat2(Q16),DESKRIPSIKETRAMPILAN,2,FALSE),\"\")","v":""}]
[{"$f":"IF(ABS!B27=\"\",\"\",ABS!B27)","v":13},{"$f":"IF(ABS!C27=\"\",\"\",ABS!C27)","v":12548},{"$f":"IF(ABS!D27=\"\",\"\",PROPER(ABS!D27))","v":"Farid Hidayat"},null,null,null,null,null,null,null,null,null,"","","","","",{"$f":"IF(P17=\"\",\"\",NILAI_PREDIKAT(Q17))","v":""},{"$f":"IFERROR(VLOOKUP(Nilai_Predikat2(Q17),DESKRIPSIKETRAMPILAN,2,FALSE),\"\")","v":""}]
[{"$f":"IF(ABS!B28=\"\",\"\",ABS!B28)","v":14},{"$f":"IF(ABS!C28=\"\",\"\",ABS!C28)","v":12562},{"$f":"IF(ABS!D28=\"\",\"\",PROPER(ABS!D28))","v":"Gayuh Anindyaningrum"},null,null,null,null,null,null,null,null,null,"","","","","",{"$f":"IF(P18=\"\",\"\",NILAI_PREDIKAT(Q18))","v":""},{"$f":"IFERROR(VLOOKUP(Nilai_Predikat2(Q18),DESKRIPSIKETRAMPILAN,2,FALSE),\"\")","v":""}]
[{"$f":"IF(ABS!B29=\"\",\"\",ABS!B29)","v":15},{"$f":"IF(ABS!C29=\"\",\"\",ABS!C29)","v":12583},{"$f":"IF(ABS!D29=\"\",\"\",PROPER(ABS!D29))","v":"Ihwan Qorib"},null,null,null,null,null,null,null,null,null,"","","","","",{"$f":"IF(P19=\"\",\"\",NILAI_PREDIKAT(Q19))","v":""},{"$f":"IFERROR(VLOOKUP(Nilai_Predikat2(Q19),DESKRIPSIKETRAMPILAN,2,FALSE),\"\")","v":""}]
[{"$f":"IF(ABS!B30=\"\",\"\",ABS!B30)","v":16},{"$f":"IF(ABS!C30=\"\",\"\",ABS!C30)","v":12597},{"$f":"IF(ABS!D30=\"\",\"\",PROPER(ABS!D30))","v":"Irvani Putri"},null,null,null,null,null,null,null,null,null,"","","","","",{"$f":"IF(P20=\"\",\"\",NILAI_PREDIKAT(Q20))","v":""},{"$f":"IFERROR(VLOOKUP(Nilai_Predikat2(Q20),DESKRIPSIKETRAMPILAN,2,FALSE),\"\")","v":""}]
[{"$f":"IF(ABS!B31=\"\",\"\",ABS!B31)","v":17},{"$f":"IF(ABS!C31=\"\",\"\",ABS!C31)","v":12607},{"$f":"IF(ABS!D31=\"\",\"\",PROPER(ABS!D31))","v":"Kristian Adi Bawono"},null,null,null,null,null,null,null,null,null,"","","","","",{"$f":"IF(P21=\"\",\"\",NILAI_PREDIKAT(Q21))","v":""},{"$f":"IFERROR(VLOOKUP(Nilai_Predikat2(Q21),DESKRIPSIKETRAMPILAN,2,FALSE),\"\")","v":""}]
[{"$f":"IF(ABS!B32=\"\",\"\",ABS!B32)","v":18},{"$f":"IF(ABS!C32=\"\",\"\",ABS!C32)","v":12618},{"$f":"IF(ABS!D32=\"\",\"\",PROPER(ABS!D32))","v":"Lutfi Imanika Vianti"},null,null,null,null,null,null,null,null,null,"","","","","",{"$f":"IF(P22=\"\",\"\",NILAI_PREDIKAT(Q22))","v":""},{"$f":"IFERROR(VLOOKUP(Nilai_Predikat2(Q22),DESKRIPSIKETRAMPILAN,2,FALSE),\"\")","v":""}]
[{"$f":"IF(ABS!B33=\"\",\"\",ABS!B33)","v":19},{"$f":"IF(ABS!C33=\"\",\"\",ABS!C33)","v":12625},{"$f":"IF(ABS!D33=\"\",\"\",PROPER(ABS!D33))","v":"Meilani Kartika"},null,null,null,null,null,null,null,null,null,"","","","","",{"$f":"IF(P23=\"\",\"\",NILAI_PREDIKAT(Q23))","v":""},{"$f":"IFERROR(VLOOKUP(Nilai_Predikat2(Q23),DESKRIPSIKETRAMPILAN,2,FALSE),\"\")","v":""}]
[{"$f":"IF(ABS!B34=\"\",\"\",ABS!B34)","v":20},{"$f":"IF(ABS!C34=\"\",\"\",ABS!C34)","v":12699},{"$f":"IF(ABS!D34=\"\",\"\",PROPER(ABS!D34))","v":"Riesty Wulan"},null,null,null,null,null,null,null,null,null,"","","","","",{"$f":"IF(P24=\"\",\"\",NILAI_PREDIKAT(Q24))","v":""},{"$f":"IFERROR(VLOOKUP(Nilai_Predikat2(Q24),DESKRIPSIKETRAMPILAN,2,FALSE),\"\")","v":""}]
[{"$f":"IF(ABS!B35=\"\",\"\",ABS!B35)","v":21},{"$f":"IF(ABS!C35=\"\",\"\",ABS!C35)","v":12703},{"$f":"IF(ABS!D35=\"\",\"\",PROPER(ABS!D35))","v":"Risa Puspitarini"},null,null,null,null,null,null,null,null,null,"","","","","",{"$f":"IF(P25=\"\",\"\",NILAI_PREDIKAT(Q25))","v":""},{"$f":"IFERROR(VLOOKUP(Nilai_Predikat2(Q25),DESKRIPSIKETRAMPILAN,2,FALSE),\"\")","v":""}]
[{"$f":"IF(ABS!B36=\"\",\"\",ABS!B36)","v":22},{"$f":"IF(ABS!C36=\"\",\"\",ABS!C36)","v":12707},{"$f":"IF(ABS!D36=\"\",\"\",PROPER(ABS!D36))","v":"Rivan Setiawan"},null,null,null,null,null,null,null,null,null,"","","","","",{"$f":"IF(P26=\"\",\"\",NILAI_PREDIKAT(Q26))","v":""},{"$f":"IFERROR(VLOOKUP(Nilai_Predikat2(Q26),DESKRIPSIKETRAMPILAN,2,FALSE),\"\")","v":""}]
[{"$f":"IF(ABS!B37=\"\",\"\",ABS!B37)","v":23},{"$f":"IF(ABS!C37=\"\",\"\",ABS!C37)","v":12724},{"$f":"IF(ABS!D37=\"\",\"\",PROPER(ABS!D37))","v":"Septian Rizky Hadi"},null,null,null,null,null,null,null,null,null,"","","","","",{"$f":"IF(P27=\"\",\"\",NILAI_PREDIKAT(Q27))","v":""},{"$f":"IFERROR(VLOOKUP(Nilai_Predikat2(Q27),DESKRIPSIKETRAMPILAN,2,FALSE),\"\")","v":""}]
[{"$f":"IF(ABS!B38=\"\",\"\",ABS!B38)","v":24},{"$f":"IF(ABS!C38=\"\",\"\",ABS!C38)","v":12751},{"$f":"IF(ABS!D38=\"\",\"\",PROPER(ABS!D38))","v":"Tyastuti Anjarsari"},null,null,null,null,null,null,null,null,null,"","","","","",{"$f":"IF(P28=\"\",\"\",NILAI_PREDIKAT(Q28))","v":""},{"$f":"IFERROR(VLOOKUP(Nilai_Predikat2(Q28),DESKRIPSIKETRAMPILAN,2,FALSE),\"\")","v":""}]
[{"$f":"IF(ABS!B39=\"\",\"\",ABS!B39)","v":25},{"$f":"IF(ABS!C39=\"\",\"\",ABS!C39)","v":12768},{"$f":"IF(ABS!D39=\"\",\"\",PROPER(ABS!D39))","v":"Wila Tri Wahyudita Savik Iswara"},null,null,null,null,null,null,null,null,null,"","","","","",{"$f":"IF(P29=\"\",\"\",NILAI_PREDIKAT(Q29))","v":""},{"$f":"IFERROR(VLOOKUP(Nilai_Predikat2(Q29),DESKRIPSIKETRAMPILAN,2,FALSE),\"\")","v":""}]
[{"$f":"IF(ABS!B40=\"\",\"\",ABS!B40)","v":""},{"$f":"IF(ABS!C40=\"\",\"\",ABS!C40)","v":""},{"$f":"IF(ABS!D40=\"\",\"\",PROPER(ABS!D40))","v":""},null,null,null,null,null,null,null,null,null,"","","","","",{"$f":"IF(P30=\"\",\"\",NILAI_PREDIKAT(Q30))","v":""},{"$f":"IFERROR(VLOOKUP(Nilai_Predikat2(Q30),DESKRIPSIKETRAMPILAN,2,FALSE),\"\")","v":""}]
[{"$f":"IF(ABS!B41=\"\",\"\",ABS!B41)","v":""},{"$f":"IF(ABS!C41=\"\",\"\",ABS!C41)","v":""},{"$f":"IF(ABS!D41=\"\",\"\",PROPER(ABS!D41))","v":""},null,null,null,null,null,null,null,null,null,"","","","","",{"$f":"IF(P31=\"\",\"\",NILAI_PREDIKAT(Q31))","v":""},{"$f":"IFERROR(VLOOKUP(Nilai_Predikat2(Q31),DESKRIPSIKETRAMPILAN,2,FALSE),\"\")","v":""}]
[{"$f":"IF(ABS!B42=\"\",\"\",ABS!B42)","v":""},{"$f":"IF(ABS!C42=\"\",\"\",ABS!C42)","v":""},{"$f":"IF(ABS!D42=\"\",\"\",PROPER(ABS!D42))","v":""},null,null,null,null,null,null,null,null,null,"","","","","",{"$f":"IF(P32=\"\",\"\",NILAI_PREDIKAT(Q32))","v":""},{"$f":"IFERROR(VLOOKUP(Nilai_Predikat2(Q32),DESKRIPSIKETRAMPILAN,2,FALSE),\"\")","v":""}]
[{"$f":"IF(ABS!B43=\"\",\"\",ABS!B43)","v":""},{"$f":"IF(ABS!C43=\"\",\"\",ABS!C43)","v":""},{"$f":"IF(ABS!D43=\"\",\"\",PROPER(ABS!D43))","v":""},null,null,null,null,null,null,null,null,null,"","","","","",{"$f":"IF(P33=\"\",\"\",NILAI_PREDIKAT(Q33))","v":""},{"$f":"IFERROR(VLOOKUP(Nilai_Predikat2(Q33),DESKRIPSIKETRAMPILAN,2,FALSE),\"\")","v":""}]
[{"$f":"IF(ABS!B44=\"\",\"\",ABS!B44)","v":""},{"$f":"IF(ABS!C44=\"\",\"\",ABS!C44)","v":""},{"$f":"IF(ABS!D44=\"\",\"\",PROPER(ABS!D44))","v":""},null,null,null,null,null,null,null,null,null,"","","","","",{"$f":"IF(P34=\"\",\"\",NILAI_PREDIKAT(Q34))","v":""},{"$f":"IFERROR(VLOOKUP(Nilai_Predikat2(Q34),DESKRIPSIKETRAMPILAN,2,FALSE),\"\")","v":""}]
[{"$f":"IF(ABS!B45=\"\",\"\",ABS!B45)","v":""},{"$f":"IF(ABS!C45=\"\",\"\",ABS!C45)","v":""},{"$f":"IF(ABS!D45=\"\",\"\",PROPER(ABS!D45))","v":""},null,null,null,null,null,null,null,null,null,"","","","","",{"$f":"IF(P35=\"\",\"\",NILAI_PREDIKAT(Q35))","v":""},{"$f":"IFERROR(VLOOKUP(Nilai_Predikat2(Q35),DESKRIPSIKETRAMPILAN,2,FALSE),\"\")","v":""}]
[{"$f":"IF(ABS!B46=\"\",\"\",ABS!B46)","v":""},{"$f":"IF(ABS!C46=\"\",\"\",ABS!C46)","v":""},{"$f":"IF(ABS!D46=\"\",\"\",PROPER(ABS!D46))","v":""},null,null,null,null,null,null,null,null,null,"","","","","",{"$f":"IF(P36=\"\",\"\",NILAI_PREDIKAT(Q36))","v":""},{"$f":"IFERROR(VLOOKUP(Nilai_Predikat2(Q36),DESKRIPSIKETRAMPILAN,2,FALSE),\"\")","v":""}]
[{"$f":"IF(ABS!B47=\"\",\"\",ABS!B47)","v":""},{"$f":"IF(ABS!C47=\"\",\"\",ABS!C47)","v":""},{"$f":"IF(ABS!D47=\"\",\"\",PROPER(ABS!D47))","v":""},null,null,null,null,null,null,null,null,null,"","","","","",{"$f":"IF(P37=\"\",\"\",NILAI_PREDIKAT(Q37))","v":""},{"$f":"IFERROR(VLOOKUP(Nilai_Predikat2(Q37),DESKRIPSIKETRAMPILAN,2,FALSE),\"\")","v":""}]
[{"$f":"IF(ABS!B48=\"\",\"\",ABS!B48)","v":""},{"$f":"IF(ABS!C48=\"\",\"\",ABS!C48)","v":""},{"$f":"IF(ABS!D48=\"\",\"\",PROPER(ABS!D48))","v":""},null,null,null,null,null,null,null,null,null,"","","","","",{"$f":"IF(P38=\"\",\"\",NILAI_PREDIKAT(Q38))","v":""},{"$f":"IFERROR(VLOOKUP(Nilai_Predikat2(Q38),DESKRIPSIKETRAMPILAN,2,FALSE),\"\")","v":""}]
[{"$f":"IF(ABS!B49=\"\",\"\",ABS!B49)","v":""},{"$f":"IF(ABS!C49=\"\",\"\",ABS!C49)","v":""},{"$f":"IF(ABS!D49=\"\",\"\",PROPER(ABS!D49))","v":""},null,null,null,null,null,null,null,null,null,"","","","","",{"$f":"IF(P39=\"\",\"\",NILAI_PREDIKAT(Q39))","v":""},{"$f":"IFERROR(VLOOKUP(Nilai_Predikat2(Q39),DESKRIPSIKETRAMPILAN,2,FALSE),\"\")","v":""}]
[{"$f":"IF(ABS!B50=\"\",\"\",ABS!B50)","v":""},{"$f":"IF(ABS!C50=\"\",\"\",ABS!C50)","v":""},{"$f":"IF(ABS!D50=\"\",\"\",PROPER(ABS!D50))","v":""},null,null,null,null,null,null,null,null,null,"","","","","",{"$f":"IF(P40=\"\",\"\",NILAI_PREDIKAT(Q40))","v":""},{"$f":"IFERROR(VLOOKUP(Nilai_Predikat2(Q40),DESKRIPSIKETRAMPILAN,2,FALSE),\"\")","v":""}]
[{"$f":"IF(ABS!B51=\"\",\"\",ABS!B51)","v":""},{"$f":"IF(ABS!C51=\"\",\"\",ABS!C51)","v":""},{"$f":"IF(ABS!D51=\"\",\"\",PROPER(ABS!D51))","v":""},null,null,null,null,null,null,null,null,null,"","","","","",{"$f":"IF(P41=\"\",\"\",NILAI_PREDIKAT(Q41))","v":""},{"$f":"IFERROR(VLOOKUP(Nilai_Predikat2(Q41),DESKRIPSIKETRAMPILAN,2,FALSE),\"\")","v":""}]
[{"$f":"IF(ABS!B52=\"\",\"\",ABS!B52)","v":""},{"$f":"IF(ABS!C52=\"\",\"\",ABS!C52)","v":""},{"$f":"IF(ABS!D52=\"\",\"\",PROPER(ABS!D52))","v":""},null,null,null,null,null,null,null,null,null,"","","","","",{"$f":"IF(P42=\"\",\"\",NILAI_PREDIKAT(Q42))","v":""},{"$f":"IFERROR(VLOOKUP(Nilai_Predikat2(Q42),DESKRIPSIKETRAMPILAN,2,FALSE),\"\")","v":""}]
["RATA-RATA",null,null,{"$f":"IF(SUM(D5:D42)=0,\"\",AVERAGE(D5:D42))","v":60.5},{"$f":"IF(SUM(E5:E42)=0,\"\",AVERAGE(E5:E42))","v":78},65,67,"","",73,"","",51.666666666666664,67,73,63.888888888888886,1.83,""]

{"sheet":"AFE","index":6,"n_rows":50,"n_cols":22,"rows_kept":50,"cut":false,"hidden":false,"merged":[[2,21,3,21],[42,0,42,2],[2,12,2,14],[2,19,2,20],[2,0,3,0],[2,1,3,1],[2,2,3,2],[2,3,2,5],[2,6,2,8],[2,9,2,11],[2,15,2,18]]}
["DAFTAR NILAI SIKAP"]
[]
["NO","NIS","NAMA","Nilai Observasi\n(NOb)",null,null,"Nilai Diri Sendiri \n(NDS)",null,null,"Nilai Antar Teman \n(NAT)",null,null,"Nilai Jurnal (NJr)",null,null,"Rerata Nilai",null,null,null,"NILAI RAPOR / (LHB)",null,"DESKRIPSI"]
[null,null,null,"KD1","KD2","KD3","KD1","KD2","KD3","KD1","KD2","KD3","KD1","KD2","KD3","NOb","NDS","NAT","NJr","Skala 4","Predikat"]
[{"$f":"IF(ABS!B15=\"\",\"\",ABS!B15)","v":1},{"$f":"IF(ABS!C15=\"\",\"\",ABS!C15)","v":12427},{"$f":"IF(ABS!D15=\"\",\"\",PROPER(ABS!D15))","v":"Agnes Maulida Yulinar"},{"$f":"IFERROR(VLOOKUP(OBS!D$54,NILAIOBSERVASI,2,FALSE),\"\")","v":48},90,90,90,null,null,90,90,null,78,null,null,{"$f":"IF(OR(D5=0,D5=\"\"),\"\",IF(AND(E5=0,F5=0),D5,IF(F5=0,AVERAGE(D5:E5),AVERAGE(D5:F5))))","v":76},{"$f":"IF(OR(G5=0,G5=\"\"),\"\",IF(AND(H5=0,I5=0),G5,IF(I5=0,AVERAGE(G5:H5),AVERAGE(G5:I5))))","v":90},{"$f":"IF(OR(J5=0,J5=\"\"),\"\",IF(AND(K5=0,L5=0),J5,IF(L5=0,AVERAGE(J5:K5),AVERAGE(J5:L5))))","v":90},{"$f":"IF(OR(M5=0,M5=\"\"),\"\",IF(AND(N5=0,O5=0),M5,IF(O5=0,AVERAGE(M5:N5),AVERAGE(M5:O5))))","v":78},{"$f":"IF(SUM(P5:S5)=0,\"\",AVERAGE(P5:S5)/100*4)","v":3.34},{"$f":"IF(T5=\"\",\"\",NILAI_SIKAP(T5))","v":"Baik"},{"$f":"IFERROR(VLOOKUP(U5,DESKRIPSISIKAP,2,FALSE),\"\")","v":"Sering Menunjukan Rasa Syukur Kepada Allah Tetapi Kedisiplinan Masih Perlu Ditingkatkan - Mulai Konsisten"}]
[{"$f":"IF(ABS!B16=\"\",\"\",ABS!B16)","v":2},{"$f":"IF(ABS!C16=\"\",\"\",ABS!C16)","v":12436},{"$f":"IF(ABS!D16=\"\",\"\",PROPER(ABS!D16))","v":"Akhmad Zanuar Hidayat"},{"$f":"IFERROR(VLOOKUP(OBS!E$54,NILAIOBSERVASI,2,FALSE),\"\")","v":24},null,null,null,null,null,null,null,null,78,null,null,{"$f":"IF(OR(D6=0,D6=\"\"),\"\",IF(AND(E6=0,F6=0),D6,IF(F6=0,AVERAGE(D6:E6),AVERAGE(D6:F6))))","v":24},{"$f":"IF(OR(G6=0,G6=\"\"),\"\",IF(AND(H6=0,I6=0),G6,IF(I6=0,AVERAGE(G6:H6),AVERAGE(G6:I6))))","v":""},{"$f":"IF(OR(J6=0,J6=\"\"),\"\",IF(AND(K6=0,L6=0),J6,IF(L6=0,AVERAGE(J6:K6),AVERAGE(J6:L6))))","v":""},{"$f":"IF(OR(M6=0,M6=\"\"),\"\",IF(AND(N6=0,O6=0),M6,IF(O6=0,AVERAGE(M6:N6),AVERAGE(M6:O6))))","v":78},{"$f":"IF(SUM(P6:S6)=0,\"\",AVERAGE(P6:S6)/100*4)","v":2.04},{"$f":"IF(T6=\"\",\"\",NILAI_SIKAP(T6))","v":"Cukup"},"Kadang-Kadang Menunjukan Rasa Syukur Kepada Allah Bahkan Masih Sering Terlambat Hadir - Belum Konsisten"]
[{"$f":"IF(ABS!B17=\"\",\"\",ABS!B17)","v":3},{"$f":"IF(ABS!C17=\"\",\"\",ABS!C17)","v":12440},{"$f":"IF(ABS!D17=\"\",\"\",PROPER(ABS!D17))","v":"Alfiyan Andhi Pratama"},{"$f":"IFERROR(VLOOKUP(OBS!F$54,NILAIOBSERVASI,2,FALSE),\"\")","v":24},null,null,null,null,null,null,null,null,98,null,null,24,"","",98,2.44,{"$f":"IF(T7=\"\",\"\",NILAI_SIKAP(T7))","v":"Cukup"},"Kadang-Kadang Menunjukan Rasa Syukur Kepada Allah Bahkan Masih Sering Terlambat Hadir - Belum Konsisten"]
[{"$f":"IF(ABS!B18=\"\",\"\",ABS!B18)","v":4},{"$f":"IF(ABS!C18=\"\",\"\",ABS!C18)","v":12447},{"$f":"IF(ABS!D18=\"\",\"\",PROPER(ABS!D18))","v":"Amalia Majid"},{"$f":"IFERROR(VLOOKUP(OBS!G$54,NILAIOBSERVASI,2,FALSE),\"\")","v":24},null,null,null,null,null,null,null,null,null,null,null,24,"","","",0.96,{"$f":"IF(T8=\"\",\"\",NILAI_SIKAP(T8))","v":"Kurang"},"Tidak Pernah Menunjukan Rasa Syukur Kepada Allah Dan Tidak Disiplin - Tidak Konsisten"]
[{"$f":"IF(ABS!B19=\"\",\"\",ABS!B19)","v":5},{"$f":"IF(ABS!C19=\"\",\"\",ABS!C19)","v":12454},{"$f":"IF(ABS!D19=\"\",\"\",PROPER(ABS!D19))","v":"Annisaa Putri Desihana"},{"$f":"IFERROR(VLOOKUP(OBS!H$54,NILAIOBSERVASI,2,FALSE),\"\")","v":24},null,null,null,null,null,null,null,null,null,null,null,24,"","","",0.96,{"$f":"IF(T9=\"\",\"\",NILAI_SIKAP(T9))","v":"Kurang"},"Tidak Pernah Menunjukan Rasa Syukur Kepada Allah Dan Tidak Disiplin - Tidak Konsisten"]
[{"$f":"IF(ABS!B20=\"\",\"\",ABS!B20)","v":6},{"$f":"IF(ABS!C20=\"\",\"\",ABS!C20)","v":12468},{"$f":"IF(ABS!D20=\"\",\"\",PROPER(ABS!D20))","v":"Asfi Ma'Ruf Fairuzzabad"},{"$f":"IFERROR(VLOOKUP(OBS!I$54,NILAIOBSERVASI,2,FALSE),\"\")","v":24},null,null,null,null,null,null,null,null,null,null,null,24,"","","",0.96,{"$f":"IF(T10=\"\",\"\",NILAI_SIKAP(T10))","v":"Kurang"},"Tidak Pernah Menunjukan Rasa Syukur Kepada Allah Dan Tidak Disiplin - Tidak Konsisten"]
[{"$f":"IF(ABS!B21=\"\",\"\",ABS!B21)","v":7},{"$f":"IF(ABS!C21=\"\",\"\",ABS!C21)","v":12505},{"$f":"IF(ABS!D21=\"\",\"\",PROPER(ABS!D21))","v":"Desy Anisa Purnamasari"},{"$f":"IFERROR(VLOOKUP(OBS!J$54,NILAIOBSERVASI,2,FALSE),\"\")","v":24},null,null,null,null,null,null,null,null,null,null,null,24,"","","",0.96,{"$f":"IF(T11=\"\",\"\",NILAI_SIKAP(T11))","v":"Kurang"},"Tidak Pernah Menunjukan Rasa Syukur Kepada Allah Dan Tidak Disiplin - Tidak Konsisten"]
[{"$f":"IF(ABS!B22=\"\",\"\",ABS!B22)","v":8},{"$f":"IF(ABS!C22=\"\",\"\",ABS!C22)","v":12517},{"$f":"IF(ABS!D22=\"\",\"\",PROPER(ABS!D22))","v":"Dina Lutfi Hanifah"},{"$f":"IFERROR(VLOOKUP(OBS!K$54,NILAIOBSERVASI,2,FALSE),\"\")","v":24},null,null,null,null,null,null,null,null,null,null,null,24,"","","",0.96,{"$f":"IF(T12=\"\",\"\",NILAI_SIKAP(T12))","v":"Kurang"},"Tidak Pernah Menunjukan Rasa Syukur Kepada Allah Dan Tidak Disiplin - Tidak Konsisten"]
[{"$f":"IF(ABS!B23=\"\",\"\",ABS!B23)","v":9},{"$f":"IF(ABS!C23=\"\",\"\",ABS!C23)","v":12524},{"$f":"IF(ABS!D23=\"\",\"\",PROPER(ABS!D23))","v":"Dwi Setyoningsih"},{"$f":"IFERROR(VLOOKUP(OBS!L$54,NILAIOBSERVASI,2,FALSE),\"\")","v":24},null,null,null,null,null,null,null,null,null,null,null,24,"","","",0.96,{"$f":"IF(T13=\"\",\"\",NILAI_SIKAP(T13))","v":"Kurang"},"Tidak Pernah Menunjukan Rasa Syukur Kepada Allah Dan Tidak Disiplin - Tidak Konsisten"]
[{"$f":"IF(ABS!B24=\"\",\"\",ABS!B24)","v":10},{"$f":"IF(ABS!C24=\"\",\"\",ABS!C24)","v":12531},{"$f":"IF(ABS!D24=\"\",\"\",PROPER(ABS!D24))","v":"Eka Prasetya"},{"$f":"IFERROR(VLOOKUP(OBS!M$54,NILAIOBSERVASI,2,FALSE),\"\")","v":24},null,null,null,null,null,null,null,null,null,null,null,24,"","","",0.96,{"$f":"IF(T14=\"\",\"\",NILAI_SIKAP(T14))","v":"Kurang"},"Tidak Pernah Menunjukan Rasa Syukur Kepada Allah Dan Tidak Disiplin - Tidak Konsisten"]
[{"$f":"IF(ABS!B25=\"\",\"\",ABS!B25)","v":11},{"$f":"IF(ABS!C25=\"\",\"\",ABS!C25)","v":12539},{"$f":"IF(ABS!D25=\"\",\"\",PROPER(ABS!D25))","v":"Erlangga Yudhanto Wibowo"},{"$f":"IFERROR(VLOOKUP(OBS!N$54,NILAIOBSERVASI,2,FALSE),\"\")","v":24},null,null,null,null,null,null,null,null,null,null,null,24,"","","",0.96,{"$f":"IF(T15=\"\",\"\",NILAI_SIKAP(T15))","v":"Kurang"},"Tidak Pernah Menunjukan Rasa Syukur Kepada Allah Dan Tidak Disiplin - Tidak Konsisten"]
[{"$f":"IF(ABS!B26=\"\",\"\",ABS!B26)","v":12},{"$f":"IF(ABS!C26=\"\",\"\",ABS!C26)","v":12546},{"$f":"IF(ABS!D26=\"\",\"\",PROPER(ABS!D26))","v":"Falsafa Luthfiana Ummi Syahada"},{"$f":"IFERROR(VLOOKUP(OBS!O$54,NILAIOBSERVASI,2,FALSE),\"\")","v":24},null,null,null,null,null,null,null,null,null,null,null,24,"","","",0.96,{"$f":"IF(T16=\"\",\"\",NILAI_SIKAP(T16))","v":"Kurang"},"Tidak Pernah Menunjukan Rasa Syukur Kepada Allah Dan Tidak Disiplin - Tidak Konsisten"]
[{"$f":"IF(ABS!B27=\"\",\"\",ABS!B27)","v":13},{"$f":"IF(ABS!C27=\"\",\"\",ABS!C27)","v":12548},{"$f":"IF(ABS!D27=\"\",\"\",PROPER(ABS!D27))","v":"Farid Hidayat"},{"$f":"IFERROR(VLOOKUP(OBS!P$54,NILAIOBSERVASI,2,FALSE),\"\")","v":""},null,null,null,null,null,null,null,null,null,null,null,"","","","","",{"$f":"IF(T17=\"\",\"\",NILAI_SIKAP(T17))","v":""},""]
[{"$f":"IF(ABS!B28=\"\",\"\",ABS!B28)","v":14},{"$f":"IF(ABS!C28=\"\",\"\",ABS!C28)","v":12562},{"$f":"IF(ABS!D28=\"\",\"\",PROPER(ABS!D28))","v":"Gayuh Anindyaningrum"},{"$f":"IFERROR(VLOOKUP(OBS!Q$54,NILAIOBSERVASI,2,FALSE),\"\")","v":""},null,null,null,null,null,null,null,null,null,null,null,"","","","","",{"$f":"IF(T18=\"\",\"\",NILAI_SIKAP(T18))","v":""},""]
[{"$f":"IF(ABS!B29=\"\",\"\",ABS!B29)","v":15},{"$f":"IF(ABS!C29=\"\",\"\",ABS!C29)","v":12583},{"$f":"IF(ABS!D29=\"\",\"\",PROPER(ABS!D29))","v":"Ihwan Qorib"},{"$f":"IFERROR(VLOOKUP(OBS!R$54,NILAIOBSERVASI,2,FALSE),\"\")","v":""},null,null,null,null,null,null,null,null,null,null,null,"","","","","",{"$f":"IF(T19=\"\",\"\",NILAI_SIKAP(T19))","v":""},""]
[{"$f":"IF(ABS!B30=\"\",\"\",ABS!B30)","v":16},{"$f":"IF(ABS!C30=\"\",\"\",ABS!C30)","v":12597},{"$f":"IF(ABS!D30=\"\",\"\",PROPER(ABS!D30))","v":"Irvani Putri"},{"$f":"IFERROR(VLOOKUP(OBS!S$54,NILAIOBSERVASI,2,FALSE),\"\")","v":""},null,null,null,null,null,null,null,null,null,null,null,"","","","","",{"$f":"IF(T20=\"\",\"\",NILAI_SIKAP(T20))","v":""},""]
[{"$f":"IF(ABS!B31=\"\",\"\",ABS!B31)","v":17},{"$f":"IF(ABS!C31=\"\",\"\",ABS!C31)","v":12607},{"$f":"IF(ABS!D31=\"\",\"\",PROPER(ABS!D31))","v":"Kristian Adi Bawono"},{"$f":"IFERROR(VLOOKUP(OBS!T$54,NILAIOBSERVASI,2,FALSE),\"\")","v":""},null,null,null,null,null,null,null,null,null,null,null,"","","","","",{"$f":"IF(T21=\"\",\"\",NILAI_SIKAP(T21))","v":""},""]
[{"$f":"IF(ABS!B32=\"\",\"\",ABS!B32)","v":18},{"$f":"IF(ABS!C32=\"\",\"\",ABS!C32)","v":12618},{"$f":"IF(ABS!D32=\"\",\"\",PROPER(ABS!D32))","v":"Lutfi Imanika Vianti"},{"$f":"IFERROR(VLOOKUP(OBS!U$54,NILAIOBSERVASI,2,FALSE),\"\")","v":""},null,null,null,null,null,null,null,null,null,null,null,"","","","","",{"$f":"IF(T22=\"\",\"\",NILAI_SIKAP(T22))","v":""},""]
[{"$f":"IF(ABS!B33=\"\",\"\",ABS!B33)","v":19},{"$f":"IF(ABS!C33=\"\",\"\",ABS!C33)","v":12625},{"$f":"IF(ABS!D33=\"\",\"\",PROPER(ABS!D33))","v":"Meilani Kartika"},{"$f":"IFERROR(VLOOKUP(OBS!V$54,NILAIOBSERVASI,2,FALSE),\"\")","v":""},null,null,null,null,null,null,null,null,null,null,null,"","","","","",{"$f":"IF(T23=\"\",\"\",NILAI_SIKAP(T23))","v":""},""]
[{"$f":"IF(ABS!B34=\"\",\"\",ABS!B34)","v":20},{"$f":"IF(ABS!C34=\"\",\"\",ABS!C34)","v":12699},{"$f":"IF(ABS!D34=\"\",\"\",PROPER(ABS!D34))","v":"Riesty Wulan"},{"$f":"IFERROR(VLOOKUP(OBS!W$54,NILAIOBSERVASI,2,FALSE),\"\")","v":""},null,null,null,null,null,null,null,null,null,null,null,"","","","","",{"$f":"IF(T24=\"\",\"\",NILAI_SIKAP(T24))","v":""},""]
[{"$f":"IF(ABS!B35=\"\",\"\",ABS!B35)","v":21},{"$f":"IF(ABS!C35=\"\",\"\",ABS!C35)","v":12703},{"$f":"IF(ABS!D35=\"\",\"\",PROPER(ABS!D35))","v":"Risa Puspitarini"},{"$f":"IFERROR(VLOOKUP(OBS!X$54,NILAIOBSERVASI,2,FALSE),\"\")","v":""},null,null,null,null,null,null,null,null,null,null,null,"","","","","",{"$f":"IF(T25=\"\",\"\",NILAI_SIKAP(T25))","v":""},""]
[{"$f":"IF(ABS!B36=\"\",\"\",ABS!B36)","v":22},{"$f":"IF(ABS!C36=\"\",\"\",ABS!C36)","v":12707},{"$f":"IF(ABS!D36=\"\",\"\",PROPER(ABS!D36))","v":"Rivan Setiawan"},{"$f":"IFERROR(VLOOKUP(OBS!Y$54,NILAIOBSERVASI,2,FALSE),\"\")","v":""},null,null,null,null,null,null,null,null,null,null,null,"","","","","",{"$f":"IF(T26=\"\",\"\",NILAI_SIKAP(T26))","v":""},""]
[{"$f":"IF(ABS!B37=\"\",\"\",ABS!B37)","v":23},{"$f":"IF(ABS!C37=\"\",\"\",ABS!C37)","v":12724},{"$f":"IF(ABS!D37=\"\",\"\",PROPER(ABS!D37))","v":"Septian Rizky Hadi"},{"$f":"IFERROR(VLOOKUP(OBS!Z$54,NILAIOBSERVASI,2,FALSE),\"\")","v":""},null,null,null,null,null,null,null,null,null,null,null,"","","","","",{"$f":"IF(T27=\"\",\"\",NILAI_SIKAP(T27))","v":""},""]
[{"$f":"IF(ABS!B38=\"\",\"\",ABS!B38)","v":24},{"$f":"IF(ABS!C38=\"\",\"\",ABS!C38)","v":12751},{"$f":"IF(ABS!D38=\"\",\"\",PROPER(ABS!D38))","v":"Tyastuti Anjarsari"},{"$f":"IFERROR(VLOOKUP(OBS!AA$54,NILAIOBSERVASI,2,FALSE),\"\")","v":""},null,null,null,null,null,null,null,null,null,null,null,"","","","","",{"$f":"IF(T28=\"\",\"\",NILAI_SIKAP(T28))","v":""},""]
[{"$f":"IF(ABS!B39=\"\",\"\",ABS!B39)","v":25},{"$f":"IF(ABS!C39=\"\",\"\",ABS!C39)","v":12768},{"$f":"IF(ABS!D39=\"\",\"\",PROPER(ABS!D39))","v":"Wila Tri Wahyudita Savik Iswara"},{"$f":"IFERROR(VLOOKUP(OBS!AB$54,NILAIOBSERVASI,2,FALSE),\"\")","v":""},null,null,null,null,null,null,null,null,null,null,null,"","","","","",{"$f":"IF(T29=\"\",\"\",NILAI_SIKAP(T29))","v":""},""]
[{"$f":"IF(ABS!B40=\"\",\"\",ABS!B40)","v":""},{"$f":"IF(ABS!C40=\"\",\"\",ABS!C40)","v":""},{"$f":"IF(ABS!D40=\"\",\"\",PROPER(ABS!D40))","v":""},{"$f":"IFERROR(VLOOKUP(OBS!AC$54,NILAIOBSERVASI,2,FALSE),\"\")","v":""},null,null,null,null,null,null,null,null,null,null,null,"","","","","",{"$f":"IF(T30=\"\",\"\",NILAI_SIKAP(T30))","v":""},""]
[{"$f":"IF(ABS!B41=\"\",\"\",ABS!B41)","v":""},{"$f":"IF(ABS!C41=\"\",\"\",ABS!C41)","v":""},{"$f":"IF(ABS!D41=\"\",\"\",PROPER(ABS!D41))","v":""},{"$f":"IFERROR(VLOOKUP(OBS!AD$54,NILAIOBSERVASI,2,FALSE),\"\")","v":""},null,null,null,null,null,null,null,null,null,null,null,"","","","","",{"$f":"IF(T31=\"\",\"\",NILAI_SIKAP(T31))","v":""},""]
[{"$f":"IF(ABS!B42=\"\",\"\",ABS!B42)","v":""},{"$f":"IF(ABS!C42=\"\",\"\",ABS!C42)","v":""},{"$f":"IF(ABS!D42=\"\",\"\",PROPER(ABS!D42))","v":""},{"$f":"IFERROR(VLOOKUP(OBS!AE$54,NILAIOBSERVASI,2,FALSE),\"\")","v":""},null,null,null,null,null,null,null,null,null,null,null,"","","","","",{"$f":"IF(T32=\"\",\"\",NILAI_SIKAP(T32))","v":""},""]
[{"$f":"IF(ABS!B43=\"\",\"\",ABS!B43)","v":""},{"$f":"IF(ABS!C43=\"\",\"\",ABS!C43)","v":""},{"$f":"IF(ABS!D43=\"\",\"\",PROPER(ABS!D43))","v":""},{"$f":"IFERROR(VLOOKUP(OBS!AF$54,NILAIOBSERVASI,2,FALSE),\"\")","v":""},null,null,null,null,null,null,null,null,null,null,null,"","","","","",{"$f":"IF(T33=\"\",\"\",NILAI_SIKAP(T33))","v":""},""]
[{"$f":"IF(ABS!B44=\"\",\"\",ABS!B44)","v":""},{"$f":"IF(ABS!C44=\"\",\"\",ABS!C44)","v":""},{"$f":"IF(ABS!D44=\"\",\"\",PROPER(ABS!D44))","v":""},{"$f":"IFERROR(VLOOKUP(OBS!AG$54,NILAIOBSERVASI,2,FALSE),\"\")","v":""},null,null,null,null,null,null,null,null,null,null,null,"","","","","",{"$f":"IF(T34=\"\",\"\",NILAI_SIKAP(T34))","v":""},""]
[{"$f":"IF(ABS!B45=\"\",\"\",ABS!B45)","v":""},{"$f":"IF(ABS!C45=\"\",\"\",ABS!C45)","v":""},{"$f":"IF(ABS!D45=\"\",\"\",PROPER(ABS!D45))","v":""},{"$f":"IFERROR(VLOOKUP(OBS!AH$54,NILAIOBSERVASI,2,FALSE),\"\")","v":""},null,null,null,null,null,null,null,null,null,null,null,"","","","","",{"$f":"IF(T35=\"\",\"\",NILAI_SIKAP(T35))","v":""},""]
[{"$f":"IF(ABS!B46=\"\",\"\",ABS!B46)","v":""},{"$f":"IF(ABS!C46=\"\",\"\",ABS!C46)","v":""},{"$f":"IF(ABS!D46=\"\",\"\",PROPER(ABS!D46))","v":""},{"$f":"IFERROR(VLOOKUP(OBS!AI$54,NILAIOBSERVASI,2,FALSE),\"\")","v":""},null,null,null,null,null,null,null,null,null,null,null,"","","","","",{"$f":"IF(T36=\"\",\"\",NILAI_SIKAP(T36))","v":""},""]
[{"$f":"IF(ABS!B47=\"\",\"\",ABS!B47)","v":""},{"$f":"IF(ABS!C47=\"\",\"\",ABS!C47)","v":""},{"$f":"IF(ABS!D47=\"\",\"\",PROPER(ABS!D47))","v":""},{"$f":"IFERROR(VLOOKUP(OBS!AJ$54,NILAIOBSERVASI,2,FALSE),\"\")","v":""},null,null,null,null,null,null,null,null,null,null,null,"","","","","",{"$f":"IF(T37=\"\",\"\",NILAI_SIKAP(T37))","v":""},""]
[{"$f":"IF(ABS!B48=\"\",\"\",ABS!B48)","v":""},{"$f":"IF(ABS!C48=\"\",\"\",ABS!C48)","v":""},{"$f":"IF(ABS!D48=\"\",\"\",PROPER(ABS!D48))","v":""},{"$f":"IFERROR(VLOOKUP(OBS!AK$54,NILAIOBSERVASI,2,FALSE),\"\")","v":""},null,null,null,null,null,null,null,null,null,null,null,"","","","","",{"$f":"IF(T38=\"\",\"\",NILAI_SIKAP(T38))","v":""},""]
[{"$f":"IF(ABS!B49=\"\",\"\",ABS!B49)","v":""},{"$f":"IF(ABS!C49=\"\",\"\",ABS!C49)","v":""},{"$f":"IF(ABS!D49=\"\",\"\",PROPER(ABS!D49))","v":""},{"$f":"IFERROR(VLOOKUP(OBS!AL$54,NILAIOBSERVASI,2,FALSE),\"\")","v":""},null,null,null,null,null,null,null,null,null,null,null,"","","","","",{"$f":"IF(T39=\"\",\"\",NILAI_SIKAP(T39))","v":""},""]
[{"$f":"IF(ABS!B50=\"\",\"\",ABS!B50)","v":""},{"$f":"IF(ABS!C50=\"\",\"\",ABS!C50)","v":""},{"$f":"IF(ABS!D50=\"\",\"\",PROPER(ABS!D50))","v":""},{"$f":"IFERROR(VLOOKUP(OBS!AM$54,NILAIOBSERVASI,2,FALSE),\"\")","v":""},null,null,null,null,null,null,null,null,null,null,null,"","","","","",{"$f":"IF(T40=\"\",\"\",NILAI_SIKAP(T40))","v":""},""]
[{"$f":"IF(ABS!B51=\"\",\"\",ABS!B51)","v":""},{"$f":"IF(ABS!C51=\"\",\"\",ABS!C51)","v":""},{"$f":"IF(ABS!D51=\"\",\"\",PROPER(ABS!D51))","v":""},{"$f":"IFERROR(VLOOKUP(OBS!AN$54,NILAIOBSERVASI,2,FALSE),\"\")","v":""},null,null,null,null,null,null,null,null,null,null,null,"","","","","",{"$f":"IF(T41=\"\",\"\",NILAI_SIKAP(T41))","v":""},""]
[{"$f":"IF(ABS!B52=\"\",\"\",ABS!B52)","v":""},{"$f":"IF(ABS!C52=\"\",\"\",ABS!C52)","v":""},{"$f":"IF(ABS!D52=\"\",\"\",PROPER(ABS!D52))","v":""},{"$f":"IFERROR(VLOOKUP(OBS!AO$54,NILAIOBSERVASI,2,FALSE),\"\")","v":""},null,null,null,null,null,null,null,null,null,null,null,"","","","","",{"$f":"IF(T42=\"\",\"\",NILAI_SIKAP(T42))","v":""},""]
["RATA-RATA",null,null,{"$f":"IF(SUM(D5:D42)=0,\"\",AVERAGE(D5:D42))","v":26},{"$f":"IF(SUM(E5:E42)=0,\"\",AVERAGE(E5:E42))","v":90},90,90,"","",90,90,"",84.666666666666671,"","",28.333333333333332,90,90,84.666666666666671,1.3716666666666673]
[]
["a.    Untuk penilaian Sikap Spiritual dan Sosial (KI-1 dan KI-2) menggunakan nilai Kualitatif sebagai berikut:"]
[null,null,null,"Skala 100",null,"Skala 4"]
[null,null,"SB     =  Sangat Baik ","91-100","atau","3,66 - 4,00"]
[null,null,"B       =  Baik","75-90","atau","2,66 - 3,65"]
[null,null,"C       =  Cukup","60-74","atau","1,66 - 2,65"]
[null,null,"K       =  Kurang","< 60","atau","0,00 - 1,65"]

{"sheet":"OBS","index":7,"n_rows":54,"n_cols":41,"rows_kept":54,"cut":false,"hidden":false,"merged":[[35,0,39,0],[40,0,45,0],[46,0,51,0],[2,0,7,0],[8,0,13,0],[14,0,22,0],[23,0,28,0],[29,0,34,0]]}
["NILAI OBSERVASI",null,null,{"$f":"IF(ABS!$D$15=\"\",\"\",PROPER(ABS!$D$15))","v":"Agnes Maulida Yulinar"},{"$f":"IF(ABS!$D$16=\"\",\"\",PROPER(ABS!$D$16))","v":"Akhmad Zanuar Hidayat"},{"$f":"IF(ABS!$D$17=\"\",\"\",PROPER(ABS!$D$17))","v":"Alfiyan Andhi Pratama"},{"$f":"IF(ABS!$D$18=\"\",\"\",PROPER(ABS!$D$18))","v":"Amalia Majid"},{"$f":"IF(ABS!$D$19=\"\",\"\",PROPER(ABS!$D$19))","v":"Annisaa Putri Desihana"},{"$f":"IF(ABS!$D$20=\"\",\"\",PROPER(ABS!$D$20))","v":"Asfi Ma'Ruf Fairuzzabad"},{"$f":"IF(ABS!$D$21=\"\",\"\",PROPER(ABS!$D$21))","v":"Desy Anisa Purnamasari"},{"$f":"IF(ABS!$D$22=\"\",\"\",PROPER(ABS!$D$22))","v":"Dina Lutfi Hanifah"},{"$f":"IF(ABS!$D$23=\"\",\"\",PROPER(ABS!$D$23))","v":"Dwi Setyoningsih"},{"$f":"IF(ABS!$D$24=\"\",\"\",PROPER(ABS!$D$24))","v":"Eka Prasetya"},{"$f":"IF(ABS!$D$25=\"\",\"\",PROPER(ABS!$D$25))","v":"Erlangga Yudhanto Wibowo"},{"$f":"IF(ABS!$D$26=\"\",\"\",PROPER(ABS!$D$26))","v":"Falsafa Luthfiana Ummi Syahada"},{"$f":"IF(ABS!$D$27=\"\",\"\",PROPER(ABS!$D$27))","v":"Farid Hidayat"},{"$f":"IF(ABS!$D$28=\"\",\"\",PROPER(ABS!$D$28))","v":"Gayuh Anindyaningrum"},{"$f":"IF(ABS!$D$29=\"\",\"\",PROPER(ABS!$D$29))","v":"Ihwan Qorib"},{"$f":"IF(ABS!$D$30=\"\",\"\",PROPER(ABS!$D$30))","v":"Irvani Putri"},{"$f":"IF(ABS!$D$31=\"\",\"\",PROPER(ABS!$D$31))","v":"Kristian Adi Bawono"},{"$f":"IF(ABS!$D$32=\"\",\"\",PROPER(ABS!$D$32))","v":"Lutfi Imanika Vianti"},{"$f":"IF(ABS!$D$33=\"\",\"\",PROPER(ABS!$D$33))","v":"Meilani Kartika"},{"$f":"IF(ABS!$D$34=\"\",\"\",PROPER(ABS!$D$34))","v":"Riesty Wulan"},{"$f":"IF(ABS!$D$35=\"\",\"\",PROPER(ABS!$D$35))","v":"Risa Puspitarini"},{"$f":"IF(ABS!$D$36=\"\",\"\",PROPER(ABS!$D$36))","v":"Rivan Setiawan"},{"$f":"IF(ABS!$D$37=\"\",\"\",PROPER(ABS!$D$37))","v":"Septian Rizky Hadi"},{"$f":"IF(ABS!$D$38=\"\",\"\",PROPER(ABS!$D$38))","v":"Tyastuti Anjarsari"},{"$f":"IF(ABS!$D$39=\"\",\"\",PROPER(ABS!$D$39))","v":"Wila Tri Wahyudita Savik Iswara"},{"$f":"IF(ABS!$D$40=\"\",\"\",PROPER(ABS!$D$40))","v":""},{"$f":"IF(ABS!$D$41=\"\",\"\",PROPER(ABS!$D$41))","v":""},{"$f":"IF(ABS!$D$42=\"\",\"\",PROPER(ABS!$D$42))","v":""},{"$f":"IF(ABS!$D$43=\"\",\"\",PROPER(ABS!$D$43))","v":""},{"$f":"IF(ABS!$D$44=\"\",\"\",PROPER(ABS!$D$44))","v":""},{"$f":"IF(ABS!$D$45=\"\",\"\",PROPER(ABS!$D$45))","v":""},{"$f":"IF(ABS!$D$46=\"\",\"\",PROPER(ABS!$D$46))","v":""},{"$f":"IF(ABS!$D$47=\"\",\"\",PROPER(ABS!$D$47))","v":""},{"$f":"IF(ABS!$D$48=\"\",\"\",PROPER(ABS!$D$48))","v":""},{"$f":"IF(ABS!$D$49=\"\",\"\",PROPER(ABS!$D$49))","v":""},{"$f":"IF(ABS!$D$50=\"\",\"\",PROPER(ABS!$D$50))","v":""},{"$f":"IF(ABS!$D$51=\"\",\"\",PROPER(ABS!$D$51))","v":""},{"$f":"IF(ABS!$D$52=\"\",\"\",PROPER(ABS!$D$52))","v":""}]
["Sikap","Kode","Aspek Pengamatan",{"$f":"IF(ABS!$B$15=\"\",\"\",PROPER(ABS!$B$15))","v":"1"},{"$f":"IF(ABS!$B$16=\"\",\"\",PROPER(ABS!$B$16))","v":"2"},{"$f":"IF(ABS!$B$17=\"\",\"\",PROPER(ABS!$B$17))","v":"3"},{"$f":"IF(ABS!$B$18=\"\",\"\",PROPER(ABS!$B$18))","v":"4"},{"$f":"IF(ABS!$B$19=\"\",\"\",PROPER(ABS!$B$19))","v":"5"},{"$f":"IF(ABS!$B$20=\"\",\"\",PROPER(ABS!$B$20))","v":"6"},{"$f":"IF(ABS!$B$21=\"\",\"\",PROPER(ABS!$B$21))","v":"7"},{"$f":"IF(ABS!$B$22=\"\",\"\",PROPER(ABS!$B$22))","v":"8"},{"$f":"IF(ABS!$B$23=\"\",\"\",PROPER(ABS!$B$23))","v":"9"},{"$f":"IF(ABS!$B$24=\"\",\"\",PROPER(ABS!$B$24))","v":"10"},{"$f":"IF(ABS!$B$25=\"\",\"\",PROPER(ABS!$B$25))","v":"11"},{"$f":"IF(ABS!$B$26=\"\",\"\",PROPER(ABS!$B$26))","v":"12"},{"$f":"IF(ABS!$B$27=\"\",\"\",PROPER(ABS!$B$27))","v":"13"},{"$f":"IF(ABS!$B$28=\"\",\"\",PROPER(ABS!$B$28))","v":"14"},{"$f":"IF(ABS!$B$29=\"\",\"\",PROPER(ABS!$B$29))","v":"15"},{"$f":"IF(ABS!$B$30=\"\",\"\",PROPER(ABS!$B$30))","v":"16"},{"$f":"IF(ABS!$B$31=\"\",\"\",PROPER(ABS!$B$31))","v":"17"},{"$f":"IF(ABS!$B$32=\"\",\"\",PROPER(ABS!$B$32))","v":"18"},{"$f":"IF(ABS!$B$33=\"\",\"\",PROPER(ABS!$B$33))","v":"19"},{"$f":"IF(ABS!$B$34=\"\",\"\",PROPER(ABS!$B$34))","v":"20"},{"$f":"IF(ABS!$B$35=\"\",\"\",PROPER(ABS!$B$35))","v":"21"},{"$f":"IF(ABS!$B$36=\"\",\"\",PROPER(ABS!$B$36))","v":"22"},{"$f":"IF(ABS!$B$37=\"\",\"\",PROPER(ABS!$B$37))","v":"23"},{"$f":"IF(ABS!$B$38=\"\",\"\",PROPER(ABS!$B$38))","v":"24"},{"$f":"IF(ABS!$B$39=\"\",\"\",PROPER(ABS!$B$39))","v":"25"},{"$f":"IF(ABS!$B$40=\"\",\"\",PROPER(ABS!$B$40))","v":""},{"$f":"IF(ABS!$B$41=\"\",\"\",PROPER(ABS!$B$41))","v":""},{"$f":"IF(ABS!$B$42=\"\",\"\",PROPER(ABS!$B$42))","v":""},{"$f":"IF(ABS!$B$43=\"\",\"\",PROPER(ABS!$B$43))","v":""},{"$f":"IF(ABS!$B$44=\"\",\"\",PROPER(ABS!$B$44))","v":""},{"$f":"IF(ABS!$B$45=\"\",\"\",PROPER(ABS!$B$45))","v":""},{"$f":"IF(ABS!$B$46=\"\",\"\",PROPER(ABS!$B$46))","v":""},{"$f":"IF(ABS!$B$47=\"\",\"\",PROPER(ABS!$B$47))","v":""},{"$f":"IF(ABS!$B$48=\"\",\"\",PROPER(ABS!$B$48))","v":""},{"$f":"IF(ABS!$B$49=\"\",\"\",PROPER(ABS!$B$49))","v":""},{"$f":"IF(ABS!$B$50=\"\",\"\",PROPER(ABS!$B$50))","v":""},{"$f":"IF(ABS!$B$51=\"\",\"\",PROPER(ABS!$B$51))","v":""},{"$f":"IF(ABS!$B$52=\"\",\"\",PROPER(ABS!$B$52))","v":""}]
["Spiritual","A.1","Berdoa sebelum dan sesudah melakukan sesuatu",4,4,4,4,4,4,4,4,4,4,4,4]
[null,"A.2","Mengucapkan rasa syukur setelah berhasil mengerjakan sesuatu",4,4,4,4,4,4,4,4,4,4,4,4]
[null,"A.3","Memberi salam sebelum dan sesudah menyampaikan pendapat",4,4,4,4,4,4,4,4,4,4,4,4]
[null,"A.4","Menjalankan ibadah tepat waktu",3,3,3,3,3,3,3,3,3,3,3,3]
[null,"A.5","Menambah rasa keimanan setelah mempelajari Iptek",2,2,2,2,2,2,2,2,2,2,2,2]
[null,null,null,{"$f":"IF(D$2=\"\",\"\",IF(SUM(D3:D7)=0,\"\",SUM(D3:D7)))","v":17},{"$f":"IF(E$2=\"\",\"\",IF(SUM(E3:E7)=0,\"\",SUM(E3:E7)))","v":17},17,17,17,17,17,17,17,17,17,17,"","","","","","","","","","","","","","","","","","","","","","","","","",""]
["Jujur","B.1","Tidak nyontek dalam mengerjakan ujian",4]
[null,"B.2","Tidak melakukan plagiat dalam mengerjakan setiap tugas",4]
[null,"B.3","Mengemukakan perasaan thd sesuatu apa adanya",3]
[null,"B.4","Melaporkan data atau informasi apa adanya",3]
[null,"B.5","Mengakui kesalahan atau kekurangan yang dimiliki",3]
[null,null,null,{"$f":"IF(D$2=\"\",\"\",IF(SUM(D9:D13)=0,\"\",SUM(D9:D13)))","v":17},{"$f":"IF(E$2=\"\",\"\",IF(SUM(E9:E13)=0,\"\",SUM(E9:E13)))","v":""},{"$f":"IF(F$2=\"\",\"\",IF(SUM(F9:F13)=0,\"\",SUM(F9:F13)))","v":""},{"$f":"IF(G$2=\"\",\"\",IF(SUM(G9:G13)=0,\"\",SUM(G9:G13)))","v":""},{"$f":"IF(H$2=\"\",\"\",IF(SUM(H9:H13)=0,\"\",SUM(H9:H13)))","v":""},{"$f":"IF(I$2=\"\",\"\",IF(SUM(I9:I13)=0,\"\",SUM(I9:I13)))","v":""},{"$f":"IF(J$2=\"\",\"\",IF(SUM(J9:J13)=0,\"\",SUM(J9:J13)))","v":""},{"$f":"IF(K$2=\"\",\"\",IF(SUM(K9:K13)=0,\"\",SUM(K9:K13)))","v":""},{"$f":"IF(L$2=\"\",\"\",IF(SUM(L9:L13)=0,\"\",SUM(L9:L13)))","v":""},{"$f":"IF(M$2=\"\",\"\",IF(SUM(M9:M13)=0,\"\",SUM(M9:M13)))","v":""},{"$f":"IF(N$2=\"\",\"\",IF(SUM(N9:N13)=0,\"\",SUM(N9:N13)))","v":""},{"$f":"IF(O$2=\"\",\"\",IF(SUM(O9:O13)=0,\"\",SUM(O9:O13)))","v":""},{"$f":"IF(P$2=\"\",\"\",IF(SUM(P9:P13)=0,\"\",SUM(P9:P13)))","v":""},{"$f":"IF(Q$2=\"\",\"\",IF(SUM(Q9:Q13)=0,\"\",SUM(Q9:Q13)))","v":""},{"$f":"IF(R$2=\"\",\"\",IF(SUM(R9:R13)=0,\"\",SUM(R9:R13)))","v":""},{"$f":"IF(S$2=\"\",\"\",IF(SUM(S9:S13)=0,\"\",SUM(S9:S13)))","v":""},{"$f":"IF(T$2=\"\",\"\",IF(SUM(T9:T13)=0,\"\",SUM(T9:T13)))","v":""},{"$f":"IF(U$2=\"\",\"\",IF(SUM(U9:U13)=0,\"\",SUM(U9:U13)))","v":""},{"$f":"IF(V$2=\"\",\"\",IF(SUM(V9:V13)=0,\"\",SUM(V9:V13)))","v":""},{"$f":"IF(W$2=\"\",\"\",IF(SUM(W9:W13)=0,\"\",SUM(W9:W13)))","v":""},{"$f":"IF(X$2=\"\",\"\",IF(SUM(X9:X13)=0,\"\",SUM(X9:X13)))","v":""},{"$f":"IF(Y$2=\"\",\"\",IF(SUM(Y9:Y13)=0,\"\",SUM(Y9:Y13)))","v":""},{"$f":"IF(Z$2=\"\",\"\",IF(SUM(Z9:Z13)=0,\"\",SUM(Z9:Z13)))","v":""},{"$f":"IF(AA$2=\"\",\"\",IF(SUM(AA9:AA13)=0,\"\",SUM(AA9:AA13)))","v":""},{"$f":"IF(AB$2=\"\",\"\",IF(SUM(AB9:AB13)=0,\"\",SUM(AB9:AB13)))","v":""},{"$f":"IF(AC$2=\"\",\"\",IF(SUM(AC9:AC13)=0,\"\",SUM(AC9:AC13)))","v":""},{"$f":"IF(AD$2=\"\",\"\",IF(SUM(AD9:AD13)=0,\"\",SUM(AD9:AD13)))","v":""},{"$f":"IF(AE$2=\"\",\"\",IF(SUM(AE9:AE13)=0,\"\",SUM(AE9:AE13)))","v":""},{"$f":"IF(AF$2=\"\",\"\",IF(SUM(AF9:AF13)=0,\"\",SUM(AF9:AF13)))","v":""},{"$f":"IF(AG$2=\"\",\"\",IF(SUM(AG9:AG13)=0,\"\",SUM(AG9:AG13)))","v":""},{"$f":"IF(AH$2=\"\",\"\",IF(SUM(AH9:AH13)=0,\"\",SUM(AH9:AH13)))","v":""},{"$f":"IF(AI$2=\"\",\"\",IF(SUM(AI9:AI13)=0,\"\",SUM(AI9:AI13)))","v":""},{"$f":"IF(AJ$2=\"\",\"\",IF(SUM(AJ9:AJ13)=0,\"\",SUM(AJ9:AJ13)))","v":""},{"$f":"IF(AK$2=\"\",\"\",IF(SUM(AK9:AK13)=0,\"\",SUM(AK9:AK13)))","v":""},{"$f":"IF(AL$2=\"\",\"\",IF(SUM(AL9:AL13)=0,\"\",SUM(AL9:AL13)))","v":""},{"$f":"IF(AM$2=\"\",\"\",IF(SUM(AM9:AM13)=0,\"\",SUM(AM9:AM13)))","v":""},{"$f":"IF(AN$2=\"\",\"\",IF(SUM(AN9:AN13)=0,\"\",SUM(AN9:AN13)))","v":""},{"$f":"IF(AO$2=\"\",\"\",IF(SUM(AO9:AO13)=0,\"\",SUM(AO9:AO13)))","v":""}]
["Disiplin","C.1","Masuk Kelas tepat waktu"]
[null,"C.2","Mengumpulkan tugas tepat waktu"]
[null,"C.3","Memakai seragam sesuai tata tertib"]
[null,"C.4","Mengerjakan tugas yang diberikan"]
[null,"C.5","Tertib dalam mengikuti pembelajaran"]
[null,"C.6","Mengikuti praktikum sesuai dengan langkah yg ditetapkan"]
[null,"C.7","Membawa buku tulis sesuai mapel"]
[null,"C.8","Membawa buku teks mapel"]
[null,null,null,{"$f":"IF(D$2=\"\",\"\",IF(SUM(D15:D22)=0,\"\",SUM(D15:D22)))","v":""},{"$f":"IF(E$2=\"\",\"\",IF(SUM(E15:E22)=0,\"\",SUM(E15:E22)))","v":""},"","","","","","","","","","","","","","","","","","","","","","","","","","","","","","","","","","","",""]
["Tanggung Jawab","D.1","Melaksanakan tugas individu dengan baik"]
[null,"D.2","Menerima resiko dari tindakan yang dilakukan"]
[null,"D.3","Tidak menuduh orang lain tanpa buktu yang akurat"]
[null,"D.4","Mengembalikan barang yang dipinjam"]
[null,"D.5","Meminta maaf atas kesalahan yang dilakukan"]
[null,null,null,{"$f":"IF(D$2=\"\",\"\",IF(SUM(D24:D28)=0,\"\",SUM(D24:D28)))","v":""},{"$f":"IF(E$2=\"\",\"\",IF(SUM(E24:E28)=0,\"\",SUM(E24:E28)))","v":""},{"$f":"IF(F$2=\"\",\"\",IF(SUM(F24:F28)=0,\"\",SUM(F24:F28)))","v":""},{"$f":"IF(G$2=\"\",\"\",IF(SUM(G24:G28)=0,\"\",SUM(G24:G28)))","v":""},{"$f":"IF(H$2=\"\",\"\",IF(SUM(H24:H28)=0,\"\",SUM(H24:H28)))","v":""},{"$f":"IF(I$2=\"\",\"\",IF(SUM(I24:I28)=0,\"\",SUM(I24:I28)))","v":""},{"$f":"IF(J$2=\"\",\"\",IF(SUM(J24:J28)=0,\"\",SUM(J24:J28)))","v":""},{"$f":"IF(K$2=\"\",\"\",IF(SUM(K24:K28)=0,\"\",SUM(K24:K28)))","v":""},{"$f":"IF(L$2=\"\",\"\",IF(SUM(L24:L28)=0,\"\",SUM(L24:L28)))","v":""},{"$f":"IF(M$2=\"\",\"\",IF(SUM(M24:M28)=0,\"\",SUM(M24:M28)))","v":""},{"$f":"IF(N$2=\"\",\"\",IF(SUM(N24:N28)=0,\"\",SUM(N24:N28)))","v":""},{"$f":"IF(O$2=\"\",\"\",IF(SUM(O24:O28)=0,\"\",SUM(O24:O28)))","v":""},{"$f":"IF(P$2=\"\",\"\",IF(SUM(P24:P28)=0,\"\",SUM(P24:P28)))","v":""},{"$f":"IF(Q$2=\"\",\"\",IF(SUM(Q24:Q28)=0,\"\",SUM(Q24:Q28)))","v":""},{"$f":"IF(R$2=\"\",\"\",IF(SUM(R24:R28)=0,\"\",SUM(R24:R28)))","v":""},{"$f":"IF(S$2=\"\",\"\",IF(SUM(S24:S28)=0,\"\",SUM(S24:S28)))","v":""},{"$f":"IF(T$2=\"\",\"\",IF(SUM(T24:T28)=0,\"\",SUM(T24:T28)))","v":""},{"$f":"IF(U$2=\"\",\"\",IF(SUM(U24:U28)=0,\"\",SUM(U24:U28)))","v":""},{"$f":"IF(V$2=\"\",\"\",IF(SUM(V24:V28)=0,\"\",SUM(V24:V28)))","v":""},{"$f":"IF(W$2=\"\",\"\",IF(SUM(W24:W28)=0,\"\",SUM(W24:W28)))","v":""},{"$f":"IF(X$2=\"\",\"\",IF(SUM(X24:X28)=0,\"\",SUM(X24:X28)))","v":""},{"$f":"IF(Y$2=\"\",\"\",IF(SUM(Y24:Y28)=0,\"\",SUM(Y24:Y28)))","v":""},{"$f":"IF(Z$2=\"\",\"\",IF(SUM(Z24:Z28)=0,\"\",SUM(Z24:Z28)))","v":""},{"$f":"IF(AA$2=\"\",\"\",IF(SUM(AA24:AA28)=0,\"\",SUM(AA24:AA28)))","v":""},{"$f":"IF(AB$2=\"\",\"\",IF(SUM(AB24:AB28)=0,\"\",SUM(AB24:AB28)))","v":""},{"$f":"IF(AC$2=\"\",\"\",IF(SUM(AC24:AC28)=0,\"\",SUM(AC24:AC28)))","v":""},{"$f":"IF(AD$2=\"\",\"\",IF(SUM(AD24:AD28)=0,\"\",SUM(AD24:AD28)))","v":""},{"$f":"IF(AE$2=\"\",\"\",IF(SUM(AE24:AE28)=0,\"\",SUM(AE24:AE28)))","v":""},{"$f":"IF(AF$2=\"\",\"\",IF(SUM(AF24:AF28)=0,\"\",SUM(AF24:AF28)))","v":""},{"$f":"IF(AG$2=\"\",\"\",IF(SUM(AG24:AG28)=0,\"\",SUM(AG24:AG28)))","v":""},{"$f":"IF(AH$2=\"\",\"\",IF(SUM(AH24:AH28)=0,\"\",SUM(AH24:AH28)))","v":""},{"$f":"IF(AI$2=\"\",\"\",IF(SUM(AI24:AI28)=0,\"\",SUM(AI24:AI28)))","v":""},{"$f":"IF(AJ$2=\"\",\"\",IF(SUM(AJ24:AJ28)=0,\"\",SUM(AJ24:AJ28)))","v":""},{"$f":"IF(AK$2=\"\",\"\",IF(SUM(AK24:AK28)=0,\"\",SUM(AK24:AK28)))","v":""},{"$f":"IF(AL$2=\"\",\"\",IF(SUM(AL24:AL28)=0,\"\",SUM(AL24:AL28)))","v":""},{"$f":"IF(AM$2=\"\",\"\",IF(SUM(AM24:AM28)=0,\"\",SUM(AM24:AM28)))","v":""},{"$f":"IF(AN$2=\"\",\"\",IF(SUM(AN24:AN28)=0,\"\",SUM(AN24:AN28)))","v":""},{"$f":"IF(AO$2=\"\",\"\",IF(SUM(AO24:AO28)=0,\"\",SUM(AO24:AO28)))","v":""}]
["Toleransi","E.1","Menghargai pendapat teman"]
[null,"E.2","Menghargai teman yang berbeda SARA"]
[null,"E.3","Menerima kesepakatan meskipun berbeda dg pendapatnya"]
[null,"E.4","Menerima kekurangan orang lain"]
[null,"E.5","Memaafkan kesalahan orang lain"]
[null,null,null,{"$f":"IF(D$2=\"\",\"\",IF(SUM(D30:D34)=0,\"\",SUM(D30:D34)))","v":""},{"$f":"IF(E$2=\"\",\"\",IF(SUM(E30:E34)=0,\"\",SUM(E30:E34)))","v":""},{"$f":"IF(F$2=\"\",\"\",IF(SUM(F30:F34)=0,\"\",SUM(F30:F34)))","v":""},{"$f":"IF(G$2=\"\",\"\",IF(SUM(G30:G34)=0,\"\",SUM(G30:G34)))","v":""},{"$f":"IF(H$2=\"\",\"\",IF(SUM(H30:H34)=0,\"\",SUM(H30:H34)))","v":""},{"$f":"IF(I$2=\"\",\"\",IF(SUM(I30:I34)=0,\"\",SUM(I30:I34)))","v":""},{"$f":"IF(J$2=\"\",\"\",IF(SUM(J30:J34)=0,\"\",SUM(J30:J34)))","v":""},{"$f":"IF(K$2=\"\",\"\",IF(SUM(K30:K34)=0,\"\",SUM(K30:K34)))","v":""},{"$f":"IF(L$2=\"\",\"\",IF(SUM(L30:L34)=0,\"\",SUM(L30:L34)))","v":""},{"$f":"IF(M$2=\"\",\"\",IF(SUM(M30:M34)=0,\"\",SUM(M30:M34)))","v":""},{"$f":"IF(N$2=\"\",\"\",IF(SUM(N30:N34)=0,\"\",SUM(N30:N34)))","v":""},{"$f":"IF(O$2=\"\",\"\",IF(SUM(O30:O34)=0,\"\",SUM(O30:O34)))","v":""},{"$f":"IF(P$2=\"\",\"\",IF(SUM(P30:P34)=0,\"\",SUM(P30:P34)))","v":""},{"$f":"IF(Q$2=\"\",\"\",IF(SUM(Q30:Q34)=0,\"\",SUM(Q30:Q34)))","v":""},{"$f":"IF(R$2=\"\",\"\",IF(SUM(R30:R34)=0,\"\",SUM(R30:R34)))","v":""},{"$f":"IF(S$2=\"\",\"\",IF(SUM(S30:S34)=0,\"\",SUM(S30:S34)))","v":""},{"$f":"IF(T$2=\"\",\"\",IF(SUM(T30:T34)=0,\"\",SUM(T30:T34)))","v":""},{"$f":"IF(U$2=\"\",\"\",IF(SUM(U30:U34)=0,\"\",SUM(U30:U34)))","v":""},{"$f":"IF(V$2=\"\",\"\",IF(SUM(V30:V34)=0,\"\",SUM(V30:V34)))","v":""},{"$f":"IF(W$2=\"\",\"\",IF(SUM(W30:W34)=0,\"\",SUM(W30:W34)))","v":""},{"$f":"IF(X$2=\"\",\"\",IF(SUM(X30:X34)=0,\"\",SUM(X30:X34)))","v":""},{"$f":"IF(Y$2=\"\",\"\",IF(SUM(Y30:Y34)=0,\"\",SUM(Y30:Y34)))","v":""},{"$f":"IF(Z$2=\"\",\"\",IF(SUM(Z30:Z34)=0,\"\",SUM(Z30:Z34)))","v":""},{"$f":"IF(AA$2=\"\",\"\",IF(SUM(AA30:AA34)=0,\"\",SUM(AA30:AA34)))","v":""},{"$f":"IF(AB$2=\"\",\"\",IF(SUM(AB30:AB34)=0,\"\",SUM(AB30:AB34)))","v":""},{"$f":"IF(AC$2=\"\",\"\",IF(SUM(AC30:AC34)=0,\"\",SUM(AC30:AC34)))","v":""},{"$f":"IF(AD$2=\"\",\"\",IF(SUM(AD30:AD34)=0,\"\",SUM(AD30:AD34)))","v":""},{"$f":"IF(AE$2=\"\",\"\",IF(SUM(AE30:AE34)=0,\"\",SUM(AE30:AE34)))","v":""},{"$f":"IF(AF$2=\"\",\"\",IF(SUM(AF30:AF34)=0,\"\",SUM(AF30:AF34)))","v":""},{"$f":"IF(AG$2=\"\",\"\",IF(SUM(AG30:AG34)=0,\"\",SUM(AG30:AG34)))","v":""},{"$f":"IF(AH$2=\"\",\"\",IF(SUM(AH30:AH34)=0,\"\",SUM(AH30:AH34)))","v":""},{"$f":"IF(AI$2=\"\",\"\",IF(SUM(AI30:AI34)=0,\"\",SUM(AI30:AI34)))","v":""},{"$f":"IF(AJ$2=\"\",\"\",IF(SUM(AJ30:AJ34)=0,\"\",SUM(AJ30:AJ34)))","v":""},{"$f":"IF(AK$2=\"\",\"\",IF(SUM(AK30:AK34)=0,\"\",SUM(AK30:AK34)))","v":""},{"$f":"IF(AL$2=\"\",\"\",IF(SUM(AL30:AL34)=0,\"\",SUM(AL30:AL34)))","v":""},{"$f":"IF(AM$2=\"\",\"\",IF(SUM(AM30:AM34)=0,\"\",SUM(AM30:AM34)))","v":""},{"$f":"IF(AN$2=\"\",\"\",IF(SUM(AN30:AN34)=0,\"\",SUM(AN30:AN34)))","v":""},{"$f":"IF(AO$2=\"\",\"\",IF(SUM(AO30:AO34)=0,\"\",SUM(AO30:AO34)))","v":""}]
["Gotong Royong","F.1","Aktif dalam kerja kelompok"]
[null,"F.2","Suka menolong teman lain"]
[null,"F.3","Kesediaan melakukan tugas sesuai kesepakatan"]
[null,"F.4","Rela berkorban untuk teman lain"]
[null,null,null,{"$f":"IF(D$2=\"\",\"\",IF(SUM(D36:D39)=0,\"\",SUM(D36:D39)))","v":""},{"$f":"IF(E$2=\"\",\"\",IF(SUM(E36:E39)=0,\"\",SUM(E36:E39)))","v":""},"","","","","","","","","","","","","","","","","","","","","","","","","","","","","","","","","","","",""]
["Santun","G.1","Menghormati orang yang lebih tua"]
[null,"G.2","Mengucapkan terima kasih setelah menerima bantuan orang lain"]
[null,"G.3","Menggunakan bahasa santun saat menyampaikan pendapat"]
[null,"G.4","Menggunakan bahasa santun saat menkritik pendapat teman"]
[null,"G.5","Bersikap 3S (Salam - Senyum - Sapa) kepada orang lain"]
[null,null,null,{"$f":"IF(D$2=\"\",\"\",IF(SUM(D41:D45)=0,\"\",SUM(D41:D45)))","v":""},{"$f":"IF(E$2=\"\",\"\",IF(SUM(E41:E45)=0,\"\",SUM(E41:E45)))","v":""},{"$f":"IF(F$2=\"\",\"\",IF(SUM(F41:F45)=0,\"\",SUM(F41:F45)))","v":""},{"$f":"IF(G$2=\"\",\"\",IF(SUM(G41:G45)=0,\"\",SUM(G41:G45)))","v":""},{"$f":"IF(H$2=\"\",\"\",IF(SUM(H41:H45)=0,\"\",SUM(H41:H45)))","v":""},{"$f":"IF(I$2=\"\",\"\",IF(SUM(I41:I45)=0,\"\",SUM(I41:I45)))","v":""},{"$f":"IF(J$2=\"\",\"\",IF(SUM(J41:J45)=0,\"\",SUM(J41:J45)))","v":""},{"$f":"IF(K$2=\"\",\"\",IF(SUM(K41:K45)=0,\"\",SUM(K41:K45)))","v":""},{"$f":"IF(L$2=\"\",\"\",IF(SUM(L41:L45)=0,\"\",SUM(L41:L45)))","v":""},{"$f":"IF(M$2=\"\",\"\",IF(SUM(M41:M45)=0,\"\",SUM(M41:M45)))","v":""},{"$f":"IF(N$2=\"\",\"\",IF(SUM(N41:N45)=0,\"\",SUM(N41:N45)))","v":""},{"$f":"IF(O$2=\"\",\"\",IF(SUM(O41:O45)=0,\"\",SUM(O41:O45)))","v":""},{"$f":"IF(P$2=\"\",\"\",IF(SUM(P41:P45)=0,\"\",SUM(P41:P45)))","v":""},{"$f":"IF(Q$2=\"\",\"\",IF(SUM(Q41:Q45)=0,\"\",SUM(Q41:Q45)))","v":""},{"$f":"IF(R$2=\"\",\"\",IF(SUM(R41:R45)=0,\"\",SUM(R41:R45)))","v":""},{"$f":"IF(S$2=\"\",\"\",IF(SUM(S41:S45)=0,\"\",SUM(S41:S45)))","v":""},{"$f":"IF(T$2=\"\",\"\",IF(SUM(T41:T45)=0,\"\",SUM(T41:T45)))","v":""},{"$f":"IF(U$2=\"\",\"\",IF(SUM(U41:U45)=0,\"\",SUM(U41:U45)))","v":""},{"$f":"IF(V$2=\"\",\"\",IF(SUM(V41:V45)=0,\"\",SUM(V41:V45)))","v":""},{"$f":"IF(W$2=\"\",\"\",IF(SUM(W41:W45)=0,\"\",SUM(W41:W45)))","v":""},{"$f":"IF(X$2=\"\",\"\",IF(SUM(X41:X45)=0,\"\",SUM(X41:X45)))","v":""},{"$f":"IF(Y$2=\"\",\"\",IF(SUM(Y41:Y45)=0,\"\",SUM(Y41:Y45)))","v":""},{"$f":"IF(Z$2=\"\",\"\",IF(SUM(Z41:Z45)=0,\"\",SUM(Z41:Z45)))","v":""},{"$f":"IF(AA$2=\"\",\"\",IF(SUM(AA41:AA45)=0,\"\",SUM(AA41:AA45)))","v":""},{"$f":"IF(AB$2=\"\",\"\",IF(SUM(AB41:AB45)=0,\"\",SUM(AB41:AB45)))","v":""},{"$f":"IF(AC$2=\"\",\"\",IF(SUM(AC41:AC45)=0,\"\",SUM(AC41:AC45)))","v":""},{"$f":"IF(AD$2=\"\",\"\",IF(SUM(AD41:AD45)=0,\"\",SUM(AD41:AD45)))","v":""},{"$f":"IF(AE$2=\"\",\"\",IF(SUM(AE41:AE45)=0,\"\",SUM(AE41:AE45)))","v":""},{"$f":"IF(AF$2=\"\",\"\",IF(SUM(AF41:AF45)=0,\"\",SUM(AF41:AF45)))","v":""},{"$f":"IF(AG$2=\"\",\"\",IF(SUM(AG41:AG45)=0,\"\",SUM(AG41:AG45)))","v":""},{"$f":"IF(AH$2=\"\",\"\",IF(SUM(AH41:AH45)=0,\"\",SUM(AH41:AH45)))","v":""},{"$f":"IF(AI$2=\"\",\"\",IF(SUM(AI41:AI45)=0,\"\",SUM(AI41:AI45)))","v":""},{"$f":"IF(AJ$2=\"\",\"\",IF(SUM(AJ41:AJ45)=0,\"\",SUM(AJ41:AJ45)))","v":""},{"$f":"IF(AK$2=\"\",\"\",IF(SUM(AK41:AK45)=0,\"\",SUM(AK41:AK45)))","v":""},{"$f":"IF(AL$2=\"\",\"\",IF(SUM(AL41:AL45)=0,\"\",SUM(AL41:AL45)))","v":""},{"$f":"IF(AM$2=\"\",\"\",IF(SUM(AM41:AM45)=0,\"\",SUM(AM41:AM45)))","v":""},{"$f":"IF(AN$2=\"\",\"\",IF(SUM(AN41:AN45)=0,\"\",SUM(AN41:AN45)))","v":""},{"$f":"IF(AO$2=\"\",\"\",IF(SUM(AO41:AO45)=0,\"\",SUM(AO41:AO45)))","v":""}]
["Percaya Diri","H.1","Berani presentasi di depan kelas"]
[null,"H.2","Berani berpendapat, bertanya, dan menjawab pertanyaan"]
[null,"H.3","Berpendapat atau bertindak tanpa ragu-ragu"]
[null,"H.4","Mampu membuat keputusan dengan tepat"]
[null,"H.5","Tidak mudah putus asa"]
[null,null,null,{"$f":"IF(D$2=\"\",\"\",IF(SUM(D47:D51)=0,\"\",SUM(D47:D51)))","v":""},{"$f":"IF(E$2=\"\",\"\",IF(SUM(E47:E51)=0,\"\",SUM(E47:E51)))","v":""},{"$f":"IF(F$2=\"\",\"\",IF(SUM(F47:F51)=0,\"\",SUM(F47:F51)))","v":""},{"$f":"IF(G$2=\"\",\"\",IF(SUM(G47:G51)=0,\"\",SUM(G47:G51)))","v":""},{"$f":"IF(H$2=\"\",\"\",IF(SUM(H47:H51)=0,\"\",SUM(H47:H51)))","v":""},{"$f":"IF(I$2=\"\",\"\",IF(SUM(I47:I51)=0,\"\",SUM(I47:I51)))","v":""},{"$f":"IF(J$2=\"\",\"\",IF(SUM(J47:J51)=0,\"\",SUM(J47:J51)))","v":""},{"$f":"IF(K$2=\"\",\"\",IF(SUM(K47:K51)=0,\"\",SUM(K47:K51)))","v":""},{"$f":"IF(L$2=\"\",\"\",IF(SUM(L47:L51)=0,\"\",SUM(L47:L51)))","v":""},{"$f":"IF(M$2=\"\",\"\",IF(SUM(M47:M51)=0,\"\",SUM(M47:M51)))","v":""},{"$f":"IF(N$2=\"\",\"\",IF(SUM(N47:N51)=0,\"\",SUM(N47:N51)))","v":""},{"$f":"IF(O$2=\"\",\"\",IF(SUM(O47:O51)=0,\"\",SUM(O47:O51)))","v":""},{"$f":"IF(P$2=\"\",\"\",IF(SUM(P47:P51)=0,\"\",SUM(P47:P51)))","v":""},{"$f":"IF(Q$2=\"\",\"\",IF(SUM(Q47:Q51)=0,\"\",SUM(Q47:Q51)))","v":""},{"$f":"IF(R$2=\"\",\"\",IF(SUM(R47:R51)=0,\"\",SUM(R47:R51)))","v":""},{"$f":"IF(S$2=\"\",\"\",IF(SUM(S47:S51)=0,\"\",SUM(S47:S51)))","v":""},{"$f":"IF(T$2=\"\",\"\",IF(SUM(T47:T51)=0,\"\",SUM(T47:T51)))","v":""},{"$f":"IF(U$2=\"\",\"\",IF(SUM(U47:U51)=0,\"\",SUM(U47:U51)))","v":""},{"$f":"IF(V$2=\"\",\"\",IF(SUM(V47:V51)=0,\"\",SUM(V47:V51)))","v":""},{"$f":"IF(W$2=\"\",\"\",IF(SUM(W47:W51)=0,\"\",SUM(W47:W51)))","v":""},{"$f":"IF(X$2=\"\",\"\",IF(SUM(X47:X51)=0,\"\",SUM(X47:X51)))","v":""},{"$f":"IF(Y$2=\"\",\"\",IF(SUM(Y47:Y51)=0,\"\",SUM(Y47:Y51)))","v":""},{"$f":"IF(Z$2=\"\",\"\",IF(SUM(Z47:Z51)=0,\"\",SUM(Z47:Z51)))","v":""},{"$f":"IF(AA$2=\"\",\"\",IF(SUM(AA47:AA51)=0,\"\",SUM(AA47:AA51)))","v":""},{"$f":"IF(AB$2=\"\",\"\",IF(SUM(AB47:AB51)=0,\"\",SUM(AB47:AB51)))","v":""},{"$f":"IF(AC$2=\"\",\"\",IF(SUM(AC47:AC51)=0,\"\",SUM(AC47:AC51)))","v":""},{"$f":"IF(AD$2=\"\",\"\",IF(SUM(AD47:AD51)=0,\"\",SUM(AD47:AD51)))","v":""},{"$f":"IF(AE$2=\"\",\"\",IF(SUM(AE47:AE51)=0,\"\",SUM(AE47:AE51)))","v":""},{"$f":"IF(AF$2=\"\",\"\",IF(SUM(AF47:AF51)=0,\"\",SUM(AF47:AF51)))","v":""},{"$f":"IF(AG$2=\"\",\"\",IF(SUM(AG47:AG51)=0,\"\",SUM(AG47:AG51)))","v":""},{"$f":"IF(AH$2=\"\",\"\",IF(SUM(AH47:AH51)=0,\"\",SUM(AH47:AH51)))","v":""},{"$f":"IF(AI$2=\"\",\"\",IF(SUM(AI47:AI51)=0,\"\",SUM(AI47:AI51)))","v":""},{"$f":"IF(AJ$2=\"\",\"\",IF(SUM(AJ47:AJ51)=0,\"\",SUM(AJ47:AJ51)))","v":""},{"$f":"IF(AK$2=\"\",\"\",IF(SUM(AK47:AK51)=0,\"\",SUM(AK47:AK51)))","v":""},{"$f":"IF(AL$2=\"\",\"\",IF(SUM(AL47:AL51)=0,\"\",SUM(AL47:AL51)))","v":""},{"$f":"IF(AM$2=\"\",\"\",IF(SUM(AM47:AM51)=0,\"\",SUM(AM47:AM51)))","v":""},{"$f":"IF(AN$2=\"\",\"\",IF(SUM(AN47:AN51)=0,\"\",SUM(AN47:AN51)))","v":""},{"$f":"IF(AO$2=\"\",\"\",IF(SUM(AO47:AO51)=0,\"\",SUM(AO47:AO51)))","v":""}]
[]
[null,null,null,{"$f":"IF(D2=\"\",\"\",SUM(D52,D46,D40,D35,D29,D23,D14,D8))","v":34},{"$f":"IF(E2=\"\",\"\",SUM(E52,E46,E40,E35,E29,E23,E14,E8))","v":17},17,17,17,17,17,17,17,17,17,17,0,0,0,0,0,0,0,0,0,0,0,0,0,"","","","","","","","","","","","",""]

{"sheet":"DIR","index":8,"n_rows":54,"n_cols":41,"rows_kept":54,"cut":false,"hidden":false,"merged":[[40,0,45,0],[46,0,51,0],[2,0,7,0],[8,0,13,0],[14,0,22,0],[23,0,28,0],[29,0,34,0],[35,0,39,0]]}
["REKAP PENILAIAN DIRI SENDIRI",null,null,{"$f":"IF(ABS!$D$15=\"\",\"\",PROPER(ABS!$D$15))","v":"Agnes Maulida Yulinar"},{"$f":"IF(ABS!$D$16=\"\",\"\",PROPER(ABS!$D$16))","v":"Akhmad Zanuar Hidayat"},{"$f":"IF(ABS!$D$17=\"\",\"\",PROPER(ABS!$D$17))","v":"Alfiyan Andhi Pratama"},{"$f":"IF(ABS!$D$18=\"\",\"\",PROPER(ABS!$D$18))","v":"Amalia Majid"},{"$f":"IF(ABS!$D$19=\"\",\"\",PROPER(ABS!$D$19))","v":"Annisaa Putri Desihana"},{"$f":"IF(ABS!$D$20=\"\",\"\",PROPER(ABS!$D$20))","v":"Asfi Ma'Ruf Fairuzzabad"},{"$f":"IF(ABS!$D$21=\"\",\"\",PROPER(ABS!$D$21))","v":"Desy Anisa Purnamasari"},{"$f":"IF(ABS!$D$22=\"\",\"\",PROPER(ABS!$D$22))","v":"Dina Lutfi Hanifah"},{"$f":"IF(ABS!$D$23=\"\",\"\",PROPER(ABS!$D$23))","v":"Dwi Setyoningsih"},{"$f":"IF(ABS!$D$24=\"\",\"\",PROPER(ABS!$D$24))","v":"Eka Prasetya"},{"$f":"IF(ABS!$D$25=\"\",\"\",PROPER(ABS!$D$25))","v":"Erlangga Yudhanto Wibowo"},{"$f":"IF(ABS!$D$26=\"\",\"\",PROPER(ABS!$D$26))","v":"Falsafa Luthfiana Ummi Syahada"},{"$f":"IF(ABS!$D$27=\"\",\"\",PROPER(ABS!$D$27))","v":"Farid Hidayat"},{"$f":"IF(ABS!$D$28=\"\",\"\",PROPER(ABS!$D$28))","v":"Gayuh Anindyaningrum"},{"$f":"IF(ABS!$D$29=\"\",\"\",PROPER(ABS!$D$29))","v":"Ihwan Qorib"},{"$f":"IF(ABS!$D$30=\"\",\"\",PROPER(ABS!$D$30))","v":"Irvani Putri"},{"$f":"IF(ABS!$D$31=\"\",\"\",PROPER(ABS!$D$31))","v":"Kristian Adi Bawono"},{"$f":"IF(ABS!$D$32=\"\",\"\",PROPER(ABS!$D$32))","v":"Lutfi Imanika Vianti"},{"$f":"IF(ABS!$D$33=\"\",\"\",PROPER(ABS!$D$33))","v":"Meilani Kartika"},{"$f":"IF(ABS!$D$34=\"\",\"\",PROPER(ABS!$D$34))","v":"Riesty Wulan"},{"$f":"IF(ABS!$D$35=\"\",\"\",PROPER(ABS!$D$35))","v":"Risa Puspitarini"},{"$f":"IF(ABS!$D$36=\"\",\"\",PROPER(ABS!$D$36))","v":"Rivan Setiawan"},{"$f":"IF(ABS!$D$37=\"\",\"\",PROPER(ABS!$D$37))","v":"Septian Rizky Hadi"},{"$f":"IF(ABS!$D$38=\"\",\"\",PROPER(ABS!$D$38))","v":"Tyastuti Anjarsari"},{"$f":"IF(ABS!$D$39=\"\",\"\",PROPER(ABS!$D$39))","v":"Wila Tri Wahyudita Savik Iswara"},{"$f":"IF(ABS!$D$40=\"\",\"\",PROPER(ABS!$D$40))","v":""},{"$f":"IF(ABS!$D$41=\"\",\"\",PROPER(ABS!$D$41))","v":""},{"$f":"IF(ABS!$D$42=\"\",\"\",PROPER(ABS!$D$42))","v":""},{"$f":"IF(ABS!$D$43=\"\",\"\",PROPER(ABS!$D$43))","v":""},{"$f":"IF(ABS!$D$44=\"\",\"\",PROPER(ABS!$D$44))","v":""},{"$f":"IF(ABS!$D$45=\"\",\"\",PROPER(ABS!$D$45))","v":""},{"$f":"IF(ABS!$D$46=\"\",\"\",PROPER(ABS!$D$46))","v":""},{"$f":"IF(ABS!$D$47=\"\",\"\",PROPER(ABS!$D$47))","v":""},{"$f":"IF(ABS!$D$48=\"\",\"\",PROPER(ABS!$D$48))","v":""},{"$f":"IF(ABS!$D$49=\"\",\"\",PROPER(ABS!$D$49))","v":""},{"$f":"IF(ABS!$D$50=\"\",\"\",PROPER(ABS!$D$50))","v":""},{"$f":"IF(ABS!$D$51=\"\",\"\",PROPER(ABS!$D$51))","v":""},{"$f":"IF(ABS!$D$52=\"\",\"\",PROPER(ABS!$D$52))","v":""}]
["Sikap","Kode","Aspek Pengamatan",{"$f":"IF(ABS!$B$15=\"\",\"\",PROPER(ABS!$B$15))","v":"1"},{"$f":"IF(ABS!$B$16=\"\",\"\",PROPER(ABS!$B$16))","v":"2"},{"$f":"IF(ABS!$B$17=\"\",\"\",PROPER(ABS!$B$17))","v":"3"},{"$f":"IF(ABS!$B$18=\"\",\"\",PROPER(ABS!$B$18))","v":"4"},{"$f":"IF(ABS!$B$19=\"\",\"\",PROPER(ABS!$B$19))","v":"5"},{"$f":"IF(ABS!$B$20=\"\",\"\",PROPER(ABS!$B$20))","v":"6"},{"$f":"IF(ABS!$B$21=\"\",\"\",PROPER(ABS!$B$21))","v":"7"},{"$f":"IF(ABS!$B$22=\"\",\"\",PROPER(ABS!$B$22))","v":"8"},{"$f":"IF(ABS!$B$23=\"\",\"\",PROPER(ABS!$B$23))","v":"9"},{"$f":"IF(ABS!$B$24=\"\",\"\",PROPER(ABS!$B$24))","v":"10"},{"$f":"IF(ABS!$B$25=\"\",\"\",PROPER(ABS!$B$25))","v":"11"},{"$f":"IF(ABS!$B$26=\"\",\"\",PROPER(ABS!$B$26))","v":"12"},{"$f":"IF(ABS!$B$27=\"\",\"\",PROPER(ABS!$B$27))","v":"13"},{"$f":"IF(ABS!$B$28=\"\",\"\",PROPER(ABS!$B$28))","v":"14"},{"$f":"IF(ABS!$B$29=\"\",\"\",PROPER(ABS!$B$29))","v":"15"},{"$f":"IF(ABS!$B$30=\"\",\"\",PROPER(ABS!$B$30))","v":"16"},{"$f":"IF(ABS!$B$31=\"\",\"\",PROPER(ABS!$B$31))","v":"17"},{"$f":"IF(ABS!$B$32=\"\",\"\",PROPER(ABS!$B$32))","v":"18"},{"$f":"IF(ABS!$B$33=\"\",\"\",PROPER(ABS!$B$33))","v":"19"},{"$f":"IF(ABS!$B$34=\"\",\"\",PROPER(ABS!$B$34))","v":"20"},{"$f":"IF(ABS!$B$35=\"\",\"\",PROPER(ABS!$B$35))","v":"21"},{"$f":"IF(ABS!$B$36=\"\",\"\",PROPER(ABS!$B$36))","v":"22"},{"$f":"IF(ABS!$B$37=\"\",\"\",PROPER(ABS!$B$37))","v":"23"},{"$f":"IF(ABS!$B$38=\"\",\"\",PROPER(ABS!$B$38))","v":"24"},{"$f":"IF(ABS!$B$39=\"\",\"\",PROPER(ABS!$B$39))","v":"25"},{"$f":"IF(ABS!$B$40=\"\",\"\",PROPER(ABS!$B$40))","v":""},{"$f":"IF(ABS!$B$41=\"\",\"\",PROPER(ABS!$B$41))","v":""},{"$f":"IF(ABS!$B$42=\"\",\"\",PROPER(ABS!$B$42))","v":""},{"$f":"IF(ABS!$B$43=\"\",\"\",PROPER(ABS!$B$43))","v":""},{"$f":"IF(ABS!$B$44=\"\",\"\",PROPER(ABS!$B$44))","v":""},{"$f":"IF(ABS!$B$45=\"\",\"\",PROPER(ABS!$B$45))","v":""},{"$f":"IF(ABS!$B$46=\"\",\"\",PROPER(ABS!$B$46))","v":""},{"$f":"IF(ABS!$B$47=\"\",\"\",PROPER(ABS!$B$47))","v":""},{"$f":"IF(ABS!$B$48=\"\",\"\",PROPER(ABS!$B$48))","v":""},{"$f":"IF(ABS!$B$49=\"\",\"\",PROPER(ABS!$B$49))","v":""},{"$f":"IF(ABS!$B$50=\"\",\"\",PROPER(ABS!$B$50))","v":""},{"$f":"IF(ABS!$B$51=\"\",\"\",PROPER(ABS!$B$51))","v":""},{"$f":"IF(ABS!$B$52=\"\",\"\",PROPER(ABS!$B$52))","v":""}]
["Spiritual","A.1","Berdoa sebelum dan sesudah melakukan sesuatu",4]
[null,"A.2","Mengucapkan rasa syukur setelah berhasil mengerjakan sesuatu",4]
[null,"A.3","Memberi salam sebelum dan sesudah menyampaikan pendapat",4]
[null,"A.4","Menjalankan ibadah tepat waktu",3]
[null,"A.5","Menambah rasa keimanan setelah mempelajari Iptek",2]
[null,null,null,{"$f":"IF(D$2=\"\",\"\",IF(SUM(D3:D7)=0,\"\",SUM(D3:D7)))","v":17},{"$f":"IF(E$2=\"\",\"\",IF(SUM(E3:E7)=0,\"\",SUM(E3:E7)))","v":""},"","","","","","","","","","","","","","","","","","","","","","","","","","","","","","","","","","","",""]
["Jujur","B.1","Tidak nyontek dalam mengerjakan ujian",4]
[null,"B.2","Tidak melakukan plagiat dalam mengerjakan setiap tugas",4]
[null,"B.3","Mengemukakan perasaan thd sesuatu apa adanya",3]
[null,"B.4","Melaporkan data atau informasi apa adanya",3]
[null,"B.5","Mengakui kesalahan atau kekurangan yang dimiliki",3]
[null,null,null,{"$f":"IF(D$2=\"\",\"\",IF(SUM(D9:D13)=0,\"\",SUM(D9:D13)))","v":17},{"$f":"IF(E$2=\"\",\"\",IF(SUM(E9:E13)=0,\"\",SUM(E9:E13)))","v":""},"","","","","","","","","","","","","","","","","","","","","","","","","","","","","","","","","","","",""]
["Disiplin","C.1","Masuk Kelas tepat waktu"]
[null,"C.2","Mengumpulkan tugas tepat waktu"]
[null,"C.3","Memakai seragam sesuai tata tertib"]
[null,"C.4","Mengerjakan tugas yang diberikan"]
[null,"C.5","Tertib dalam mengikuti pembelajaran"]
[null,"C.6","Mengikuti praktikum sesuai dengan langkah yg ditetapkan"]
[null,"C.7","Membawa buku tulis sesuai mapel"]
[null,"C.8","Membawa buku teks mapel"]
[null,null,null,{"$f":"IF(D$2=\"\",\"\",IF(SUM(D15:D22)=0,\"\",SUM(D15:D22)))","v":""},{"$f":"IF(E$2=\"\",\"\",IF(SUM(E15:E22)=0,\"\",SUM(E15:E22)))","v":""},"","","","","","","","","","","","","","","","","","","","","","","","","","","","","","","","","","","",""]
["Tanggung Jawab","D.1","Melaksanakan tugas individu dengan baik"]
[null,"D.2","Menerima resiko dari tindakan yang dilakukan"]
[null,"D.3","Tidak menuduh orang lain tanpa buktu yang akurat"]
[null,"D.4","Mengembalikan barang yang dipinjam"]
[null,"D.5","Meminta maaf atas kesalahan yang dilakukan"]
[null,null,null,{"$f":"IF(D$2=\"\",\"\",IF(SUM(D24:D28)=0,\"\",SUM(D24:D28)))","v":""},{"$f":"IF(E$2=\"\",\"\",IF(SUM(E24:E28)=0,\"\",SUM(E24:E28)))","v":""},"","","","","","","","","","","","","","","","","","","","","","","","","","","","","","","","","","","",""]
["Toleransi","E.1","Menghargai pendapat teman"]
[null,"E.2","Menghargai teman yang berbeda SARA"]
[null,"E.3","Menerima kesepakatan meskipun berbeda dg pendapatnya"]
[null,"E.4","Menerima kekurangan orang lain"]
[null,"E.5","Memaafkan kesalahan orang lain"]
[null,null,null,{"$f":"IF(D$2=\"\",\"\",IF(SUM(D30:D34)=0,\"\",SUM(D30:D34)))","v":""},{"$f":"IF(E$2=\"\",\"\",IF(SUM(E30:E34)=0,\"\",SUM(E30:E34)))","v":""},"","","","","","","","","","","","","","","","","","","","","","","","","","","","","","","","","","","",""]
["Gotong Royong","F.1","Aktif dalam kerja kelompok"]
[null,"F.2","Suka menolong teman lain"]
[null,"F.3","Kesediaan melakukan tugas sesuai kesepakatan"]
[null,"F.4","Rela berkorban untuk teman lain"]
[null,null,null,{"$f":"IF(D$2=\"\",\"\",IF(SUM(D36:D39)=0,\"\",SUM(D36:D39)))","v":""},{"$f":"IF(E$2=\"\",\"\",IF(SUM(E36:E39)=0,\"\",SUM(E36:E39)))","v":""},"","","","","","","","","","","","","","","","","","","","","","","","","","","","","","","","","","","",""]
["Santun","G.1","Menghormati orang yang lebih tua"]
[null,"G.2","Mengucapkan terima kasih setelah menerima bantuan orang lain"]
[null,"G.3","Menggunakan bahasa santun saat menyampaikan pendapat"]
[null,"G.4","Menggunakan bahasa santun saat menkritik pendapat teman"]
[null,"G.5","Bersikap 3S (Salam - Senyum - Sapa) kepada orang lain"]
[null,null,null,{"$f":"IF(D$2=\"\",\"\",IF(SUM(D41:D45)=0,\"\",SUM(D41:D45)))","v":""},{"$f":"IF(E$2=\"\",\"\",IF(SUM(E41:E45)=0,\"\",SUM(E41:E45)))","v":""},"","","","","","","","","","","","","","","","","","","","","","","","","","","","","","","","","","","",""]
["Percaya Diri","H.1","Berani presentasi di depan kelas"]
[null,"H.2","Berani berpendapat, bertanya, dan menjawab pertanyaan"]
[null,"H.3","Berpendapat atau bertindak tanpa ragu-ragu"]
[null,"H.4","Mampu membuat keputusan dengan tepat"]
[null,"H.5","Tidak mudah putus asa"]
[null,null,null,{"$f":"IF(D$2=\"\",\"\",IF(SUM(D47:D51)=0,\"\",SUM(D47:D51)))","v":""},{"$f":"IF(E$2=\"\",\"\",IF(SUM(E47:E51)=0,\"\",SUM(E47:E51)))","v":""},"","","","","","","","","","","","","","","","","","","","","","","","","","","","","","","","","","","",""]
[]
[null,null,null,{"$f":"IF(D2=\"\",\"\",SUM(D52,D46,D40,D35,D29,D23,D14,D8))","v":34},{"$f":"IF(E2=\"\",\"\",SUM(E52,E46,E40,E35,E29,E23,E14,E8))","v":0},0,0,0,0,0,0,0,0,0,0,0,0,0,0,0,0,0,0,0,0,0,0,0,"","","","","","","","","","","","",""]

{"sheet":"TEM","index":9,"n_rows":48,"n_cols":41,"rows_kept":48,"cut":false,"hidden":false,"merged":[[34,0,39,0],[40,0,45,0],[2,0,7,0],[8,0,16,0],[17,0,22,0],[23,0,28,0],[29,0,33,0]]}
["REKAP PENILAIAN ANTARTEMAN",null,null,{"$f":"IF(ABS!$D$15=\"\",\"\",PROPER(ABS!$D$15))","v":"Agnes Maulida Yulinar"},{"$f":"IF(ABS!$D$16=\"\",\"\",PROPER(ABS!$D$16))","v":"Akhmad Zanuar Hidayat"},{"$f":"IF(ABS!$D$17=\"\",\"\",PROPER(ABS!$D$17))","v":"Alfiyan Andhi Pratama"},{"$f":"IF(ABS!$D$18=\"\",\"\",PROPER(ABS!$D$18))","v":"Amalia Majid"},{"$f":"IF(ABS!$D$19=\"\",\"\",PROPER(ABS!$D$19))","v":"Annisaa Putri Desihana"},{"$f":"IF(ABS!$D$20=\"\",\"\",PROPER(ABS!$D$20))","v":"Asfi Ma'Ruf Fairuzzabad"},{"$f":"IF(ABS!$D$21=\"\",\"\",PROPER(ABS!$D$21))","v":"Desy Anisa Purnamasari"},{"$f":"IF(ABS!$D$22=\"\",\"\",PROPER(ABS!$D$22))","v":"Dina Lutfi Hanifah"},{"$f":"IF(ABS!$D$23=\"\",\"\",PROPER(ABS!$D$23))","v":"Dwi Setyoningsih"},{"$f":"IF(ABS!$D$24=\"\",\"\",PROPER(ABS!$D$24))","v":"Eka Prasetya"},{"$f":"IF(ABS!$D$25=\"\",\"\",PROPER(ABS!$D$25))","v":"Erlangga Yudhanto Wibowo"},{"$f":"IF(ABS!$D$26=\"\",\"\",PROPER(ABS!$D$26))","v":"Falsafa Luthfiana Ummi Syahada"},{"$f":"IF(ABS!$D$27=\"\",\"\",PROPER(ABS!$D$27))","v":"Farid Hidayat"},{"$f":"IF(ABS!$D$28=\"\",\"\",PROPER(ABS!$D$28))","v":"Gayuh Anindyaningrum"},{"$f":"IF(ABS!$D$29=\"\",\"\",PROPER(ABS!$D$29))","v":"Ihwan Qorib"},{"$f":"IF(ABS!$D$30=\"\",\"\",PROPER(ABS!$D$30))","v":"Irvani Putri"},{"$f":"IF(ABS!$D$31=\"\",\"\",PROPER(ABS!$D$31))","v":"Kristian Adi Bawono"},{"$f":"IF(ABS!$D$32=\"\",\"\",PROPER(ABS!$D$32))","v":"Lutfi Imanika Vianti"},{"$f":"IF(ABS!$D$33=\"\",\"\",PROPER(ABS!$D$33))","v":"Meilani Kartika"},{"$f":"IF(ABS!$D$34=\"\",\"\",PROPER(ABS!$D$34))","v":"Riesty Wulan"},{"$f":"IF(ABS!$D$35=\"\",\"\",PROPER(ABS!$D$35))","v":"Risa Puspitarini"},{"$f":"IF(ABS!$D$36=\"\",\"\",PROPER(ABS!$D$36))","v":"Rivan Setiawan"},{"$f":"IF(ABS!$D$37=\"\",\"\",PROPER(ABS!$D$37))","v":"Septian Rizky Hadi"},{"$f":"IF(ABS!$D$38=\"\",\"\",PROPER(ABS!$D$38))","v":"Tyastuti Anjarsari"},{"$f":"IF(ABS!$D$39=\"\",\"\",PROPER(ABS!$D$39))","v":"Wila Tri Wahyudita Savik Iswara"},{"$f":"IF(ABS!$D$40=\"\",\"\",PROPER(ABS!$D$40))","v":""},{"$f":"IF(ABS!$D$41=\"\",\"\",PROPER(ABS!$D$41))","v":""},{"$f":"IF(ABS!$D$42=\"\",\"\",PROPER(ABS!$D$42))","v":""},{"$f":"IF(ABS!$D$43=\"\",\"\",PROPER(ABS!$D$43))","v":""},{"$f":"IF(ABS!$D$44=\"\",\"\",PROPER(ABS!$D$44))","v":""},{"$f":"IF(ABS!$D$45=\"\",\"\",PROPER(ABS!$D$45))","v":""},{"$f":"IF(ABS!$D$46=\"\",\"\",PROPER(ABS!$D$46))","v":""},{"$f":"IF(ABS!$D$47=\"\",\"\",PROPER(ABS!$D$47))","v":""},{"$f":"IF(ABS!$D$48=\"\",\"\",PROPER(ABS!$D$48))","v":""},{"$f":"IF(ABS!$D$49=\"\",\"\",PROPER(ABS!$D$49))","v":""},{"$f":"IF(ABS!$D$50=\"\",\"\",PROPER(ABS!$D$50))","v":""},{"$f":"IF(ABS!$D$51=\"\",\"\",PROPER(ABS!$D$51))","v":""},{"$f":"IF(ABS!$D$52=\"\",\"\",PROPER(ABS!$D$52))","v":""}]
["Sikap","Kode","Aspek Pengamatan",{"$f":"IF(ABS!$B$15=\"\",\"\",PROPER(ABS!$B$15))","v":"1"},{"$f":"IF(ABS!$B$16=\"\",\"\",PROPER(ABS!$B$16))","v":"2"},{"$f":"IF(ABS!$B$17=\"\",\"\",PROPER(ABS!$B$17))","v":"3"},{"$f":"IF(ABS!$B$18=\"\",\"\",PROPER(ABS!$B$18))","v":"4"},{"$f":"IF(ABS!$B$19=\"\",\"\",PROPER(ABS!$B$19))","v":"5"},{"$f":"IF(ABS!$B$20=\"\",\"\",PROPER(ABS!$B$20))","v":"6"},{"$f":"IF(ABS!$B$21=\"\",\"\",PROPER(ABS!$B$21))","v":"7"},{"$f":"IF(ABS!$B$22=\"\",\"\",PROPER(ABS!$B$22))","v":"8"},{"$f":"IF(ABS!$B$23=\"\",\"\",PROPER(ABS!$B$23))","v":"9"},{"$f":"IF(ABS!$B$24=\"\",\"\",PROPER(ABS!$B$24))","v":"10"},{"$f":"IF(ABS!$B$25=\"\",\"\",PROPER(ABS!$B$25))","v":"11"},{"$f":"IF(ABS!$B$26=\"\",\"\",PROPER(ABS!$B$26))","v":"12"},{"$f":"IF(ABS!$B$27=\"\",\"\",PROPER(ABS!$B$27))","v":"13"},{"$f":"IF(ABS!$B$28=\"\",\"\",PROPER(ABS!$B$28))","v":"14"},{"$f":"IF(ABS!$B$29=\"\",\"\",PROPER(ABS!$B$29))","v":"15"},{"$f":"IF(ABS!$B$30=\"\",\"\",PROPER(ABS!$B$30))","v":"16"},{"$f":"IF(ABS!$B$31=\"\",\"\",PROPER(ABS!$B$31))","v":"17"},{"$f":"IF(ABS!$B$32=\"\",\"\",PROPER(ABS!$B$32))","v":"18"},{"$f":"IF(ABS!$B$33=\"\",\"\",PROPER(ABS!$B$33))","v":"19"},{"$f":"IF(ABS!$B$34=\"\",\"\",PROPER(ABS!$B$34))","v":"20"},{"$f":"IF(ABS!$B$35=\"\",\"\",PROPER(ABS!$B$35))","v":"21"},{"$f":"IF(ABS!$B$36=\"\",\"\",PROPER(ABS!$B$36))","v":"22"},{"$f":"IF(ABS!$B$37=\"\",\"\",PROPER(ABS!$B$37))","v":"23"},{"$f":"IF(ABS!$B$38=\"\",\"\",PROPER(ABS!$B$38))","v":"24"},{"$f":"IF(ABS!$B$39=\"\",\"\",PROPER(ABS!$B$39))","v":"25"},{"$f":"IF(ABS!$B$40=\"\",\"\",PROPER(ABS!$B$40))","v":""},{"$f":"IF(ABS!$B$41=\"\",\"\",PROPER(ABS!$B$41))","v":""},{"$f":"IF(ABS!$B$42=\"\",\"\",PROPER(ABS!$B$42))","v":""},{"$f":"IF(ABS!$B$43=\"\",\"\",PROPER(ABS!$B$43))","v":""},{"$f":"IF(ABS!$B$44=\"\",\"\",PROPER(ABS!$B$44))","v":""},{"$f":"IF(ABS!$B$45=\"\",\"\",PROPER(ABS!$B$45))","v":""},{"$f":"IF(ABS!$B$46=\"\",\"\",PROPER(ABS!$B$46))","v":""},{"$f":"IF(ABS!$B$47=\"\",\"\",PROPER(ABS!$B$47))","v":""},{"$f":"IF(ABS!$B$48=\"\",\"\",PROPER(ABS!$B$48))","v":""},{"$f":"IF(ABS!$B$49=\"\",\"\",PROPER(ABS!$B$49))","v":""},{"$f":"IF(ABS!$B$50=\"\",\"\",PROPER(ABS!$B$50))","v":""},{"$f":"IF(ABS!$B$51=\"\",\"\",PROPER(ABS!$B$51))","v":""},{"$f":"IF(ABS!$B$52=\"\",\"\",PROPER(ABS!$B$52))","v":""}]
["Jujur","B.1","Tidak nyontek dalam mengerjakan ujian",4]
[null,"B.2","Tidak melakukan plagiat dalam mengerjakan setiap tugas",4]
[null,"B.3","Mengemukakan perasaan thd sesuatu apa adanya",3]
[null,"B.4","Melaporkan data atau informasi apa adanya",3]
[null,"B.5","Mengakui kesalahan atau kekurangan yang dimiliki",3]
[null,null,null,{"$f":"IF(D$2=\"\",\"\",IF(SUM(D3:D7)=0,\"\",SUM(D3:D7)))","v":17},{"$f":"IF(E$2=\"\",\"\",IF(SUM(E3:E7)=0,\"\",SUM(E3:E7)))","v":""},"","","","","","","","","","","","","","","","","","","","","","","","","","","","","","","","","","","",""]
["Disiplin","C.1","Masuk Kelas tepat waktu"]
[null,"C.2","Mengumpulkan tugas tepat waktu"]
[null,"C.3","Memakai seragam sesuai tata tertib"]
[null,"C.4","Mengerjakan tugas yang diberikan"]
[null,"C.5","Tertib dalam mengikuti pembelajaran"]
[null,"C.6","Mengikuti praktikum sesuai dengan langkah yg ditetapkan"]
[null,"C.7","Membawa buku tulis sesuai mapel"]
[null,"C.8","Membawa buku teks mapel"]
[null,null,null,{"$f":"IF(D$2=\"\",\"\",IF(SUM(D9:D16)=0,\"\",SUM(D9:D16)))","v":""},{"$f":"IF(E$2=\"\",\"\",IF(SUM(E9:E16)=0,\"\",SUM(E9:E16)))","v":""},"","","","","","","","","","","","","","","","","","","","","","","","","","","","","","","","","","","",""]
["Tanggung Jawab","D.1","Melaksanakan tugas individu dengan baik"]
[null,"D.2","Menerima resiko dari tindakan yang dilakukan"]
[null,"D.3","Tidak menuduh orang lain tanpa buktu yang akurat"]
[null,"D.4","Mengembalikan barang yang dipinjam"]
[null,"D.5","Meminta maaf atas kesalahan yang dilakukan"]
[null,null,null,{"$f":"IF(D$2=\"\",\"\",IF(SUM(D18:D22)=0,\"\",SUM(D18:D22)))","v":""},{"$f":"IF(E$2=\"\",\"\",IF(SUM(E18:E22)=0,\"\",SUM(E18:E22)))","v":""},"","","","","","","","","","","","","","","","","","","","","","","","","","","","","","","","","","","",""]
["Toleransi","E.1","Menghargai pendapat teman"]
[null,"E.2","Menghargai teman yang berbeda SARA"]
[null,"E.3","Menerima kesepakatan meskipun berbeda dg pendapatnya"]
[null,"E.4","Menerima kekurangan orang lain"]
[null,"E.5","Memaafkan kesalahan orang lain"]
[null,null,null,{"$f":"IF(D$2=\"\",\"\",IF(SUM(D24:D28)=0,\"\",SUM(D24:D28)))","v":""},{"$f":"IF(E$2=\"\",\"\",IF(SUM(E24:E28)=0,\"\",SUM(E24:E28)))","v":""},"","","","","","","","","","","","","","","","","","","","","","","","","","","","","","","","","","","",""]
["Gotong Royong","F.1","Aktif dalam kerja kelompok"]
[null,"F.2","Suka menolong teman lain"]
[null,"F.3","Kesediaan melakukan tugas sesuai kesepakatan"]
[null,"F.4","Rela berkorban untuk teman lain"]
[null,null,null,{"$f":"IF(D$2=\"\",\"\",IF(SUM(D30:D33)=0,\"\",SUM(D30:D33)))","v":""},{"$f":"IF(E$2=\"\",\"\",IF(SUM(E30:E33)=0,\"\",SUM(E30:E33)))","v":""},"","","","","","","","","","","","","","","","","","","","","","","","","","","","","","","","","","","",""]
["Santun","G.1","Menghormati orang yang lebih tua"]
[null,"G.2","Mengucapkan terima kasih setelah menerima bantuan orang lain"]
[null,"G.3","Menggunakan bahasa santun saat menyampaikan pendapat"]
[null,"G.4","Menggunakan bahasa santun saat menkritik pendapat teman"]
[null,"G.5","Bersikap 3S (Salam - Senyum - Sapa) kepada orang lain"]
[null,null,null,{"$f":"IF(D$2=\"\",\"\",IF(SUM(D35:D39)=0,\"\",SUM(D35:D39)))","v":""},{"$f":"IF(E$2=\"\",\"\",IF(SUM(E35:E39)=0,\"\",SUM(E35:E39)))","v":""},"","","","","","","","","","","","","","","","","","","","","","","","","","","","","","","","","","","",""]
["Percaya Diri","H.1","Berani presentasi di depan kelas"]
[null,"H.2","Berani berpendapat, bertanya, dan menjawab pertanyaan"]
[null,"H.3","Berpendapat atau bertindak tanpa ragu-ragu"]
[null,"H.4","Mampu membuat keputusan dengan tepat"]
[null,"H.5","Tidak mudah putus asa"]
[null,null,null,{"$f":"IF(D$2=\"\",\"\",IF(SUM(D41:D45)=0,\"\",SUM(D41:D45)))","v":""},{"$f":"IF(E$2=\"\",\"\",IF(SUM(E41:E45)=0,\"\",SUM(E41:E45)))","v":""},"","","","","","","","","","","","","","","","","","","","","","","","","","","","","","","","","","","",""]
[]
[null,null,null,{"$f":"IF(D2=\"\",\"\",SUM(D46,D40,D34,D29,D23,D17,D8))","v":17},{"$f":"IF(E2=\"\",\"\",SUM(E46,E40,E34,E29,E23,E17,E8))","v":0},0,0,0,0,0,0,0,0,0,0,0,0,0,0,0,0,0,0,0,0,0,0,0,"","","","","","","","","","","","",""]

{"sheet":"JUR","index":10,"n_rows":4,"n_cols":5,"rows_kept":4,"cut":false,"hidden":false,"merged":[]}
["NILAI JURNAL CATATAN GURU"]
["No.","Hari dan Tanggal","Nama Siswa","Kejadian","Aspek Yang Diamati"]
[1,"Senin, 4 Nopember 2013","Arif Kuncoro Aji","Pada ulangan Struktur atom, yang bersangkutan mencontek temannya","Kejujuran"]
[2,"Senin, 11 Nopember 2013","Herlina Herawati","terlambat masuk sekolah untuk ke-3 kalinya","Disiplin"]

{"sheet":"PRA","index":11,"n_rows":65,"n_cols":22,"rows_kept":65,"cut":false,"hidden":false,"merged":[[59,7,59,8],[59,9,59,10],[60,7,60,8],[60,9,60,10],[64,7,64,8],[64,9,64,10],[61,7,61,8],[61,9,61,10],[62,7,62,8],[62,9,62,10],[63,7,63,8],[63,9,63,10],[56,7,56,8],[56,9,56,10],[57,7,57,8],[57,9,57,10],[58,7,58,8],[58,9,58,10],[53,7,53,8],[53,9,53,10],[54,7,54,8],[54,9,54,10],[55,7,55,8],[55,9,55,10],[50,9,50,10],[51,7,51,8],[51,9,51,10],[52,7,52,8],[52,9,52,10],[44,0,46,0],[44,11,46,11],[44,1,46,5],[64,0,64,5],[44,7,44,10],[45,7,45,10],[46,7,46,8],[46,9,46,10],[47,7,47,8],[44,6,45,6],[47,9,47,10],[48,7,48,8],[48,9,48,10],[49,7,49,8],[49,9,49,10],[50,7,50,8],[29,14,30,14],[29,15,29,19],[29,20,30,20],[29,21,30,21],[29,11,30,11],[29,13,30,13],[29,10,30,10],[29,2,29,5],[29,6,29,9],[29,0,30,0],[29,1,30,1],[2,15,2,18],[2,19,3,19],[2,13,3,13],[2,14,3,14],[2,20,3,20],[2,11,3,11],[2,0,3,0],[2,1,3,1],[2,2,2,4],[2,5,2,7],[2,8,2,10]]}
["LEMBAR PENILAIAN PRAKTIK (SENI MUSIK)",null,null,null,null,null,null,null,null,null,null,null,null,"LEMBAR PENILAIAN PRAKTIK (BAHASA)"]
[]
["No ","Nama Siswa ","Penampilan ",null,null,"Harmoni ",null,null,"Teknik Vokal ",null,null,"Hasil akhir ",null,"No","Nama","Skor untuk",null,null,null,"Jumlah Skor","Nilai"]
[null,null,1,2,3,1,2,3,1,2,3,null,null,null,null,"Kelancaran","Ucapan","Intonasi","Pilihan.Kata"]
[1,null,null,null,null,null,null,null,null,null,null,null,null,1]
[2,null,null,null,null,null,null,null,null,null,null,null,null,2]
[3,null,null,null,null,null,null,null,null,null,null,null,null,3]
[]
["Kriteria Penilaian",null,null,null,null,null,null,null,null,null,null,null,null,"Kriteria Penilaian"]
[null,null,null,null,null,null,null,null,null,null,null,null,null,"Kelancaran (fluency)",null,"3 = Lancar"]
["Penampilan",null,null,null,null,null,null,null,null,null,null,null,null,null,null,"2 = Kurang lancar"]
["3.  Ekspresi dan gaya sudah sempurna.",null,null,null,null,null,null,null,null,null,null,null,null,null,null,"1 = Tidak lancar"]
["2.  Ekspresi dan gaya baik tapi masih ragu-ragu."]
["1.  Ekspresi dan gaya kaku.",null,null,null,null,null,null,null,null,null,null,null,null,"Pengucapan (pronunciation)",null,"3 = Baik"]
[null,null,null,null,null,null,null,null,null,null,null,null,null,null,null,"2 = Kurang baik"]
["Harmoni",null,null,null,null,null,null,null,null,null,null,null,null,null,null,"1 = Tidak baik"]
["3.  Vokal dan musik seimbang dan harmonis."]
["2.  Vokal dan musik kadang-kadang tidak senada.",null,null,null,null,null,null,null,null,null,null,null,null,"Intonasi (Intonation)",null,"3 = Sesuai"]
["1.  Vokal dan musik tidak seimbang.",null,null,null,null,null,null,null,null,null,null,null,null,null,null,"2 = Kurang sesuai"]
[null,null,null,null,null,null,null,null,null,null,null,null,null,null,null,"1 = Tidak sesuai"]
["Teknik Vokal"]
["3.  Suara yang keluar sempurna, bagus dan jernih. Pernapasan baik menggunakan diafragma.",null,null,null,null,null,null,null,null,null,null,null,null,"Pilihan kata (Diction)",null,"3 = Tepat"]
["2.  Suara yang keluar dan pernapasan masih ragu-ragu.",null,null,null,null,null,null,null,null,null,null,null,null,null,null,"2 = Kurang tepat"]
["1.  Suara yang keluar dan pernapasan tidak sempurna. ",null,null,null,null,null,null,null,null,null,null,null,null,null,null,"1 = Tidak tepat"]
[]
[]
[]
["LEMBAR PENILAIAN PRAKTIK (Biologi)",null,null,null,null,null,null,null,null,null,null,null,null,"LEMBAR PENILAIAN PRAKTIK (Kimia)"]
[]
["No.","Nama Siswa","Percobaan 1",null,null,null,"Percobaan 2",null,null,null,"Jumlah\nSkor","Nilai",null,"NO","Nama Siswa","Perolehan skor",null,null,null,null,"Jml Skor","Nilai"]
[null,null,1,2,3,4,1,2,3,4,null,null,null,null,null,"Rancangan\nPercobaan","Kelengkapan \nLaporan","Cara Kerja","Anaisis Data","Kesimpulan "]
[1,null,null,null,null,null,null,null,null,null,null,null,null,1]
[2,null,null,null,null,null,null,null,null,null,null,null,null,2]
[3,null,null,null,null,null,null,null,null,null,null,null,null,3]
[]
["Kriteria Penilaian",null,null,null,null,null,null,null,null,null,null,null,null,"Kriteria Penilaian"]
["1 = Kurang, Tidak melakukan percobaan ",null,null,null,null,null,null,null,null,null,null,null,null,"1 =","Kurang"]
["2 = Cukup, Melakukan percobaan dengan prosedur yang salah dan hasil yang salah",null,null,null,null,null,null,null,null,null,null,null,null,"2 =","Cukup"]
["3 = Baik, Melakukan percobaan dengan prosedur yang benar dan hasil yang salah",null,null,null,null,null,null,null,null,null,null,null,null,"3 =","Baik"]
["4 = Baik Sekali, Melakukan percobaan dengan prosedur yang benar dan hasil yang benar",null,null,null,null,null,null,null,null,null,null,null,null,"4 =","Baik Sekali"]
[]
[]
[]
["LEMBAR PENILAIAN PRAKTIK PRESENTASI"]
["No.","Penilaian",null,null,null,null,"Bobot","Skor Penilaian",null,null,null,"Nilai"]
[null,null,null,null,null,null,null,"(0 – 100)"]
[null,null,null,null,null,null,"(B)","Skor (S)",null,"B x S"]
[null,"ASPEK PENAMPILAN",null,null,null,null,10]
["1.","Kerapian",null,null,null,null,5]
["2.","Keserasian",null,null,null,null,5]
[null,"ASPEK MATERI PRESENTASI",null,null,null,null,25]
["3.","Substansi materi",null,null,null,null,10]
["4.","Tampilan Presentasi",null,null,null,null,8]
["5.","Data Pendukung",null,null,null,null,7]
[null,"ASPEK PENYAMPAIAN PRESENTASI",null,null,null,null,25]
["6.","Penguasaan materi",null,null,null,null,12]
["7.","Alur Presentasi",null,null,null,null,8]
["8.","Gaya Presentasi",null,null,null,null,5]
[null,"ASPEK INTERAKSI",null,null,null,null,20]
["9.","Cara menghadapi audiens",null,null,null,null,10]
["10.","Cara menjawab pertanyaan",null,null,null,null,10]
[null,"ASPEK KEMAMPUAN BAHASA",null,null,null,null,10]
["11.","Intonasi, asksentuasi",null,null,null,null,5]
["12.","Perbendaharaan Kata",null,null,null,null,5]
["TOTAL SKOR"]

{"sheet":"PRO","index":12,"n_rows":0,"n_cols":0,"rows_kept":0,"cut":false,"hidden":false,"merged":[]}

{"sheet":"POR","index":13,"n_rows":0,"n_cols":0,"rows_kept":0,"cut":false,"hidden":false,"merged":[]}

{"sheet":"REK","index":14,"n_rows":49,"n_cols":12,"rows_kept":49,"cut":false,"hidden":false,"merged":[[2,10,6,11],[8,7,8,9],[8,10,8,11],[8,1,9,1],[8,2,9,2],[8,3,9,3],[2,7,2,8],[3,7,3,8],[4,7,4,8],[48,1,48,3],[8,4,8,6],[0,1,0,2],[2,4,2,6],[3,4,3,6],[4,4,4,6],[5,4,5,6],[6,4,6,6],[0,3,0,8],[5,7,5,8],[6,7,6,8],[2,1,2,3],[3,1,3,3],[4,1,4,3],[5,1,5,3],[6,1,6,3]]}
[null,null,null,"** REKAP NILAI CAPAIAN KOMPETENSI **\nKURIKULUM SMA 2013",null,null,null,null,null,{"$f":"CONCATENATE(TEXT(TODAY(),\"dddd\"),\", \",TEXT(TODAY(),\"dd mmmm yyyy\"),\"\nWaktu : \",TEXT(NOW(),\"HH:MM:SS\"))","v":"Rabu, 19 Maret 2014\nWaktu : 08:51:36"},"Versi : \n2013.001",{"$f":"CONCATENATE(\"Copyright 2013 by :\n \",IDT!V4)","v":"Copyright 2013 by :\n SMA MUHAMMADIYAH WONOSOBO"}]
[]
[null,"Mata Pelajaran ",null,null,{"$f":"IF(CEK<>\"Siap Diisi\",\"\",ABS!F4)","v":""},null,null,"Kelas",null,{"$f":"IF(CEK<>\"Siap Diisi\",\"\",ABS!AC4)","v":""},{"$f":"IF(ABS!O7=\"Nama File Belum Sama\",\"Cek di Input Presensi\",\"Siap Diisi\")","v":"Cek di Input Presensi"}]
[null,"Nama Guru Mapel",null,null,{"$f":"IF(CEK<>\"Siap Diisi\",\"\",ABS!F6)","v":""},null,null,"Semester",null,{"$f":"IF(CEK<>\"Siap Diisi\",\"\",ABS!K5)","v":""}]
[null,{"$f":"IFERROR(VLOOKUP(ABS!$W$6,DATAGURU,3,FALSE),\"\")","v":"NBM"},null,null,{"$f":"IF(CEK<>\"Siap Diisi\",\"\",IFERROR(VLOOKUP(ABS!$W$6,DATAGURU,4,FALSE),\"\"))","v":""},null,null,"Tahun Pelajaran",null,{"$f":"IF(CEK<>\"Siap Diisi\",\"\",ABS!F5)","v":""}]
[null,"Nama Kepala Sekolah",null,null,{"$f":"IF(CEK<>\"Siap Diisi\",\"\",IDT!F3)","v":""},null,null,"Wali Kelas",null,{"$f":"IF(CEK<>\"Siap Diisi\",\"\",IF(CEK<>\"Siap Diisi\",\"\",VLOOKUP((VLOOKUP(J3,KODEWALI,3,FALSE)),DATAGURU,2,FALSE)))","v":""}]
[null,{"$f":"CONCATENATE(VLOOKUP(\"AA\",DATAGURU,3,FALSE),\" Kepala Sekolah\")","v":"NBM Kepala Sekolah"},null,null,{"$f":"IF(CEK<>\"Siap Diisi\",\"\",IDT!H3)","v":""},null,null,"Nilai KKM",null,{"$f":"IF(CEK<>\"Siap Diisi\",\"\",CONCATENATE(Rerata_KKM,\"    atau    \",IDT!V9))","v":""}]
[]
[null,"NO","NIS","NAMA","Pengetahuan (KI-3)",null,null,"Ketrampilan (KI-4)",null,null,"Sikap Spiritual dan Sosial (KI-1 dan KI-2)"]
[null,null,null,null,"Angka","Predikat","Deskripsi","Angka","Predikat","Deskripsi","Predikat","Deskripsi"]
[null,{"$f":"IF(ABS!B15=\"\",\"\",ABS!B15)","v":1},{"$f":"IF(ABS!C15=\"\",\"\",ABS!C15)","v":12427},{"$f":"IF(ABS!D15=\"\",\"\",PROPER(ABS!D15))","v":"Agnes Maulida Yulinar"},{"$f":"IF(CEK<>\"Siap Diisi\",\"\",IF(KOG!AF7=\"\",\"\",KOG!AF7))","v":""},{"$f":"IF(CEK<>\"Siap Diisi\",\"\",IF(KOG!AG7=\"\",\"\",KOG!AG7))","v":""},{"$f":"IF(CEK<>\"Siap Diisi\",\"\",IF(KOG!AH7=\"\",\"\",KOG!AH7))","v":""},{"$f":"IF(CEK<>\"Siap Diisi\",\"\",IF(PSI!Q5=\"\",\"\",PSI!Q5))","v":""},{"$f":"IF(CEK<>\"Siap Diisi\",\"\",IF(PSI!R5=\"\",\"\",PSI!R5))","v":""},{"$f":"IF(CEK<>\"Siap Diisi\",\"\",IF(PSI!S5=\"\",\"\",PSI!S5))","v":""},{"$f":"IF(CEK<>\"Siap Diisi\",\"\",IF(AFE!U5=\"\",\"\",AFE!U5))","v":""},{"$f":"IF(CEK<>\"Siap Diisi\",\"\",IF(AFE!V5=\"\",\"\",AFE!V5))","v":""}]
[null,{"$f":"IF(ABS!B16=\"\",\"\",ABS!B16)","v":2},{"$f":"IF(ABS!C16=\"\",\"\",ABS!C16)","v":12436},{"$f":"IF(ABS!D16=\"\",\"\",PROPER(ABS!D16))","v":"Akhmad Zanuar Hidayat"},{"$f":"IF(CEK<>\"Siap Diisi\",\"\",IF(KOG!AF8=\"\",\"\",KOG!AF8))","v":""},{"$f":"IF(CEK<>\"Siap Diisi\",\"\",IF(KOG!AG8=\"\",\"\",KOG!AG8))","v":""},{"$f":"IF(CEK<>\"Siap Diisi\",\"\",IF(KOG!AH8=\"\",\"\",KOG!AH8))","v":""},{"$f":"IF(CEK<>\"Siap Diisi\",\"\",IF(PSI!Q6=\"\",\"\",PSI!Q6))","v":""},{"$f":"IF(CEK<>\"Siap Diisi\",\"\",IF(PSI!R6=\"\",\"\",PSI!R6))","v":""},{"$f":"IF(CEK<>\"Siap Diisi\",\"\",IF(PSI!S6=\"\",\"\",PSI!S6))","v":""},{"$f":"IF(CEK<>\"Siap Diisi\",\"\",IF(AFE!U6=\"\",\"\",AFE!U6))","v":""},{"$f":"IF(CEK<>\"Siap Diisi\",\"\",IF(AFE!V6=\"\",\"\",AFE!V6))","v":""}]
[null,{"$f":"IF(ABS!B17=\"\",\"\",ABS!B17)","v":3},{"$f":"IF(ABS!C17=\"\",\"\",ABS!C17)","v":12440},{"$f":"IF(ABS!D17=\"\",\"\",PROPER(ABS!D17))","v":"Alfiyan Andhi Pratama"},{"$f":"IF(CEK<>\"Siap Diisi\",\"\",IF(KOG!AF9=\"\",\"\",KOG!AF9))","v":""},{"$f":"IF(CEK<>\"Siap Diisi\",\"\",IF(KOG!AG9=\"\",\"\",KOG!AG9))","v":""},{"$f":"IF(CEK<>\"Siap Diisi\",\"\",IF(KOG!AH9=\"\",\"\",KOG!AH9))","v":""},{"$f":"IF(CEK<>\"Siap Diisi\",\"\",IF(PSI!Q7=\"\",\"\",PSI!Q7))","v":""},{"$f":"IF(CEK<>\"Siap Diisi\",\"\",IF(PSI!R7=\"\",\"\",PSI!R7))","v":""},{"$f":"IF(CEK<>\"Siap Diisi\",\"\",IF(PSI!S7=\"\",\"\",PSI!S7))","v":""},{"$f":"IF(CEK<>\"Siap Diisi\",\"\",IF(AFE!U7=\"\",\"\",AFE!U7))","v":""},{"$f":"IF(CEK<>\"Siap Diisi\",\"\",IF(AFE!V7=\"\",\"\",AFE!V7))","v":""}]
[null,{"$f":"IF(ABS!B18=\"\",\"\",ABS!B18)","v":4},{"$f":"IF(ABS!C18=\"\",\"\",ABS!C18)","v":12447},{"$f":"IF(ABS!D18=\"\",\"\",PROPER(ABS!D18))","v":"Amalia Majid"},{"$f":"IF(CEK<>\"Siap Diisi\",\"\",IF(KOG!AF10=\"\",\"\",KOG!AF10))","v":""},{"$f":"IF(CEK<>\"Siap Diisi\",\"\",IF(KOG!AG10=\"\",\"\",KOG!AG10))","v":""},{"$f":"IF(CEK<>\"Siap Diisi\",\"\",IF(KOG!AH10=\"\",\"\",KOG!AH10))","v":""},{"$f":"IF(CEK<>\"Siap Diisi\",\"\",IF(PSI!Q8=\"\",\"\",PSI!Q8))","v":""},{"$f":"IF(CEK<>\"Siap Diisi\",\"\",IF(PSI!R8=\"\",\"\",PSI!R8))","v":""},{"$f":"IF(CEK<>\"Siap Diisi\",\"\",IF(PSI!S8=\"\",\"\",PSI!S8))","v":""},{"$f":"IF(CEK<>\"Siap Diisi\",\"\",IF(AFE!U8=\"\",\"\",AFE!U8))","v":""},{"$f":"IF(CEK<>\"Siap Diisi\",\"\",IF(AFE!V8=\"\",\"\",AFE!V8))","v":""}]
[null,{"$f":"IF(ABS!B19=\"\",\"\",ABS!B19)","v":5},{"$f":"IF(ABS!C19=\"\",\"\",ABS!C19)","v":12454},{"$f":"IF(ABS!D19=\"\",\"\",PROPER(ABS!D19))","v":"Annisaa Putri Desihana"},{"$f":"IF(CEK<>\"Siap Diisi\",\"\",IF(KOG!AF11=\"\",\"\",KOG!AF11))","v":""},{"$f":"IF(CEK<>\"Siap Diisi\",\"\",IF(KOG!AG11=\"\",\"\",KOG!AG11))","v":""},{"$f":"IF(CEK<>\"Siap Diisi\",\"\",IF(KOG!AH11=\"\",\"\",KOG!AH11))","v":""},{"$f":"IF(CEK<>\"Siap Diisi\",\"\",IF(PSI!Q9=\"\",\"\",PSI!Q9))","v":""},{"$f":"IF(CEK<>\"Siap Diisi\",\"\",IF(PSI!R9=\"\",\"\",PSI!R9))","v":""},{"$f":"IF(CEK<>\"Siap Diisi\",\"\",IF(PSI!S9=\"\",\"\",PSI!S9))","v":""},{"$f":"IF(CEK<>\"Siap Diisi\",\"\",IF(AFE!U9=\"\",\"\",AFE!U9))","v":""},{"$f":"IF(CEK<>\"Siap Diisi\",\"\",IF(AFE!V9=\"\",\"\",AFE!V9))","v":""}]
[null,{"$f":"IF(ABS!B20=\"\",\"\",ABS!B20)","v":6},{"$f":"IF(ABS!C20=\"\",\"\",ABS!C20)","v":12468},{"$f":"IF(ABS!D20=\"\",\"\",PROPER(ABS!D20))","v":"Asfi Ma'Ruf Fairuzzabad"},{"$f":"IF(CEK<>\"Siap Diisi\",\"\",IF(KOG!AF12=\"\",\"\",KOG!AF12))","v":""},{"$f":"IF(CEK<>\"Siap Diisi\",\"\",IF(KOG!AG12=\"\",\"\",KOG!AG12))","v":""},{"$f":"IF(CEK<>\"Siap Diisi\",\"\",IF(KOG!AH12=\"\",\"\",KOG!AH12))","v":""},{"$f":"IF(CEK<>\"Siap Diisi\",\"\",IF(PSI!Q10=\"\",\"\",PSI!Q10))","v":""},{"$f":"IF(CEK<>\"Siap Diisi\",\"\",IF(PSI!R10=\"\",\"\",PSI!R10))","v":""},{"$f":"IF(CEK<>\"Siap Diisi\",\"\",IF(PSI!S10=\"\",\"\",PSI!S10))","v":""},{"$f":"IF(CEK<>\"Siap Diisi\",\"\",IF(AFE!U10=\"\",\"\",AFE!U10))","v":""},{"$f":"IF(CEK<>\"Siap Diisi\",\"\",IF(AFE!V10=\"\",\"\",AFE!V10))","v":""}]
[null,{"$f":"IF(ABS!B21=\"\",\"\",ABS!B21)","v":7},{"$f":"IF(ABS!C21=\"\",\"\",ABS!C21)","v":12505},{"$f":"IF(ABS!D21=\"\",\"\",PROPER(ABS!D21))","v":"Desy Anisa Purnamasari"},{"$f":"IF(CEK<>\"Siap Diisi\",\"\",IF(KOG!AF13=\"\",\"\",KOG!AF13))","v":""},{"$f":"IF(CEK<>\"Siap Diisi\",\"\",IF(KOG!AG13=\"\",\"\",KOG!AG13))","v":""},{"$f":"IF(CEK<>\"Siap Diisi\",\"\",IF(KOG!AH13=\"\",\"\",KOG!AH13))","v":""},{"$f":"IF(CEK<>\"Siap Diisi\",\"\",IF(PSI!Q11=\"\",\"\",PSI!Q11))","v":""},{"$f":"IF(CEK<>\"Siap Diisi\",\"\",IF(PSI!R11=\"\",\"\",PSI!R11))","v":""},{"$f":"IF(CEK<>\"Siap Diisi\",\"\",IF(PSI!S11=\"\",\"\",PSI!S11))","v":""},{"$f":"IF(CEK<>\"Siap Diisi\",\"\",IF(AFE!U11=\"\",\"\",AFE!U11))","v":""},{"$f":"IF(CEK<>\"Siap Diisi\",\"\",IF(AFE!V11=\"\",\"\",AFE!V11))","v":""}]
[null,{"$f":"IF(ABS!B22=\"\",\"\",ABS!B22)","v":8},{"$f":"IF(ABS!C22=\"\",\"\",ABS!C22)","v":12517},{"$f":"IF(ABS!D22=\"\",\"\",PROPER(ABS!D22))","v":"Dina Lutfi Hanifah"},{"$f":"IF(CEK<>\"Siap Diisi\",\"\",IF(KOG!AF14=\"\",\"\",KOG!AF14))","v":""},{"$f":"IF(CEK<>\"Siap Diisi\",\"\",IF(KOG!AG14=\"\",\"\",KOG!AG14))","v":""},{"$f":"IF(CEK<>\"Siap Diisi\",\"\",IF(KOG!AH14=\"\",\"\",KOG!AH14))","v":""},{"$f":"IF(CEK<>\"Siap Diisi\",\"\",IF(PSI!Q12=\"\",\"\",PSI!Q12))","v":""},{"$f":"IF(CEK<>\"Siap Diisi\",\"\",IF(PSI!R12=\"\",\"\",PSI!R12))","v":""},{"$f":"IF(CEK<>\"Siap Diisi\",\"\",IF(PSI!S12=\"\",\"\",PSI!S12))","v":""},{"$f":"IF(CEK<>\"Siap Diisi\",\"\",IF(AFE!U12=\"\",\"\",AFE!U12))","v":""},{"$f":"IF(CEK<>\"Siap Diisi\",\"\",IF(AFE!V12=\"\",\"\",AFE!V12))","v":""}]
[null,{"$f":"IF(ABS!B23=\"\",\"\",ABS!B23)","v":9},{"$f":"IF(ABS!C23=\"\",\"\",ABS!C23)","v":12524},{"$f":"IF(ABS!D23=\"\",\"\",PROPER(ABS!D23))","v":"Dwi Setyoningsih"},{"$f":"IF(CEK<>\"Siap Diisi\",\"\",IF(KOG!AF15=\"\",\"\",KOG!AF15))","v":""},{"$f":"IF(CEK<>\"Siap Diisi\",\"\",IF(KOG!AG15=\"\",\"\",KOG!AG15))","v":""},{"$f":"IF(CEK<>\"Siap Diisi\",\"\",IF(KOG!AH15=\"\",\"\",KOG!AH15))","v":""},{"$f":"IF(CEK<>\"Siap Diisi\",\"\",IF(PSI!Q13=\"\",\"\",PSI!Q13))","v":""},{"$f":"IF(CEK<>\"Siap Diisi\",\"\",IF(PSI!R13=\"\",\"\",PSI!R13))","v":""},{"$f":"IF(CEK<>\"Siap Diisi\",\"\",IF(PSI!S13=\"\",\"\",PSI!S13))","v":""},{"$f":"IF(CEK<>\"Siap Diisi\",\"\",IF(AFE!U13=\"\",\"\",AFE!U13))","v":""},{"$f":"IF(CEK<>\"Siap Diisi\",\"\",IF(AFE!V13=\"\",\"\",AFE!V13))","v":""}]
[null,{"$f":"IF(ABS!B24=\"\",\"\",ABS!B24)","v":10},{"$f":"IF(ABS!C24=\"\",\"\",ABS!C24)","v":12531},{"$f":"IF(ABS!D24=\"\",\"\",PROPER(ABS!D24))","v":"Eka Prasetya"},{"$f":"IF(CEK<>\"Siap Diisi\",\"\",IF(KOG!AF16=\"\",\"\",KOG!AF16))","v":""},{"$f":"IF(CEK<>\"Siap Diisi\",\"\",IF(KOG!AG16=\"\",\"\",KOG!AG16))","v":""},{"$f":"IF(CEK<>\"Siap Diisi\",\"\",IF(KOG!AH16=\"\",\"\",KOG!AH16))","v":""},{"$f":"IF(CEK<>\"Siap Diisi\",\"\",IF(PSI!Q14=\"\",\"\",PSI!Q14))","v":""},{"$f":"IF(CEK<>\"Siap Diisi\",\"\",IF(PSI!R14=\"\",\"\",PSI!R14))","v":""},{"$f":"IF(CEK<>\"Siap Diisi\",\"\",IF(PSI!S14=\"\",\"\",PSI!S14))","v":""},{"$f":"IF(CEK<>\"Siap Diisi\",\"\",IF(AFE!U14=\"\",\"\",AFE!U14))","v":""},{"$f":"IF(CEK<>\"Siap Diisi\",\"\",IF(AFE!V14=\"\",\"\",AFE!V14))","v":""}]
[null,{"$f":"IF(ABS!B25=\"\",\"\",ABS!B25)","v":11},{"$f":"IF(ABS!C25=\"\",\"\",ABS!C25)","v":12539},{"$f":"IF(ABS!D25=\"\",\"\",PROPER(ABS!D25))","v":"Erlangga Yudhanto Wibowo"},{"$f":"IF(CEK<>\"Siap Diisi\",\"\",IF(KOG!AF17=\"\",\"\",KOG!AF17))","v":""},{"$f":"IF(CEK<>\"Siap Diisi\",\"\",IF(KOG!AG17=\"\",\"\",KOG!AG17))","v":""},{"$f":"IF(CEK<>\"Siap Diisi\",\"\",IF(KOG!AH17=\"\",\"\",KOG!AH17))","v":""},{"$f":"IF(CEK<>\"Siap Diisi\",\"\",IF(PSI!Q15=\"\",\"\",PSI!Q15))","v":""},{"$f":"IF(CEK<>\"Siap Diisi\",\"\",IF(PSI!R15=\"\",\"\",PSI!R15))","v":""},{"$f":"IF(CEK<>\"Siap Diisi\",\"\",IF(PSI!S15=\"\",\"\",PSI!S15))","v":""},{"$f":"IF(CEK<>\"Siap Diisi\",\"\",IF(AFE!U15=\"\",\"\",AFE!U15))","v":""},{"$f":"IF(CEK<>\"Siap Diisi\",\"\",IF(AFE!V15=\"\",\"\",AFE!V15))","v":""}]
[null,{"$f":"IF(ABS!B26=\"\",\"\",ABS!B26)","v":12},{"$f":"IF(ABS!C26=\"\",\"\",ABS!C26)","v":12546},{"$f":"IF(ABS!D26=\"\",\"\",PROPER(ABS!D26))","v":"Falsafa Luthfiana Ummi Syahada"},{"$f":"IF(CEK<>\"Siap Diisi\",\"\",IF(KOG!AF18=\"\",\"\",KOG!AF18))","v":""},{"$f":"IF(CEK<>\"Siap Diisi\",\"\",IF(KOG!AG18=\"\",\"\",KOG!AG18))","v":""},{"$f":"IF(CEK<>\"Siap Diisi\",\"\",IF(KOG!AH18=\"\",\"\",KOG!AH18))","v":""},{"$f":"IF(CEK<>\"Siap Diisi\",\"\",IF(PSI!Q16=\"\",\"\",PSI!Q16))","v":""},{"$f":"IF(CEK<>\"Siap Diisi\",\"\",IF(PSI!R16=\"\",\"\",PSI!R16))","v":""},{"$f":"IF(CEK<>\"Siap Diisi\",\"\",IF(PSI!S16=\"\",\"\",PSI!S16))","v":""},{"$f":"IF(CEK<>\"Siap Diisi\",\"\",IF(AFE!U16=\"\",\"\",AFE!U16))","v":""},{"$f":"IF(CEK<>\"Siap Diisi\",\"\",IF(AFE!V16=\"\",\"\",AFE!V16))","v":""}]
[null,{"$f":"IF(ABS!B27=\"\",\"\",ABS!B27)","v":13},{"$f":"IF(ABS!C27=\"\",\"\",ABS!C27)","v":12548},{"$f":"IF(ABS!D27=\"\",\"\",PROPER(ABS!D27))","v":"Farid Hidayat"},{"$f":"IF(CEK<>\"Siap Diisi\",\"\",IF(KOG!AF19=\"\",\"\",KOG!AF19))","v":""},{"$f":"IF(CEK<>\"Siap Diisi\",\"\",IF(KOG!AG19=\"\",\"\",KOG!AG19))","v":""},{"$f":"IF(CEK<>\"Siap Diisi\",\"\",IF(KOG!AH19=\"\",\"\",KOG!AH19))","v":""},{"$f":"IF(CEK<>\"Siap Diisi\",\"\",IF(PSI!Q17=\"\",\"\",PSI!Q17))","v":""},{"$f":"IF(CEK<>\"Siap Diisi\",\"\",IF(PSI!R17=\"\",\"\",PSI!R17))","v":""},{"$f":"IF(CEK<>\"Siap Diisi\",\"\",IF(PSI!S17=\"\",\"\",PSI!S17))","v":""},{"$f":"IF(CEK<>\"Siap Diisi\",\"\",IF(AFE!U17=\"\",\"\",AFE!U17))","v":""},{"$f":"IF(CEK<>\"Siap Diisi\",\"\",IF(AFE!V17=\"\",\"\",AFE!V17))","v":""}]
[null,{"$f":"IF(ABS!B28=\"\",\"\",ABS!B28)","v":14},{"$f":"IF(ABS!C28=\"\",\"\",ABS!C28)","v":12562},{"$f":"IF(ABS!D28=\"\",\"\",PROPER(ABS!D28))","v":"Gayuh Anindyaningrum"},{"$f":"IF(CEK<>\"Siap Diisi\",\"\",IF(KOG!AF20=\"\",\"\",KOG!AF20))","v":""},{"$f":"IF(CEK<>\"Siap Diisi\",\"\",IF(KOG!AG20=\"\",\"\",KOG!AG20))","v":""},{"$f":"IF(CEK<>\"Siap Diisi\",\"\",IF(KOG!AH20=\"\",\"\",KOG!AH20))","v":""},{"$f":"IF(CEK<>\"Siap Diisi\",\"\",IF(PSI!Q18=\"\",\"\",PSI!Q18))","v":""},{"$f":"IF(CEK<>\"Siap Diisi\",\"\",IF(PSI!R18=\"\",\"\",PSI!R18))","v":""},{"$f":"IF(CEK<>\"Siap Diisi\",\"\",IF(PSI!S18=\"\",\"\",PSI!S18))","v":""},{"$f":"IF(CEK<>\"Siap Diisi\",\"\",IF(AFE!U18=\"\",\"\",AFE!U18))","v":""},{"$f":"IF(CEK<>\"Siap Diisi\",\"\",IF(AFE!V18=\"\",\"\",AFE!V18))","v":""}]
[null,{"$f":"IF(ABS!B29=\"\",\"\",ABS!B29)","v":15},{"$f":"IF(ABS!C29=\"\",\"\",ABS!C29)","v":12583},{"$f":"IF(ABS!D29=\"\",\"\",PROPER(ABS!D29))","v":"Ihwan Qorib"},{"$f":"IF(CEK<>\"Siap Diisi\",\"\",IF(KOG!AF21=\"\",\"\",KOG!AF21))","v":""},{"$f":"IF(CEK<>\"Siap Diisi\",\"\",IF(KOG!AG21=\"\",\"\",KOG!AG21))","v":""},{"$f":"IF(CEK<>\"Siap Diisi\",\"\",IF(KOG!AH21=\"\",\"\",KOG!AH21))","v":""},{"$f":"IF(CEK<>\"Siap Diisi\",\"\",IF(PSI!Q19=\"\",\"\",PSI!Q19))","v":""},{"$f":"IF(CEK<>\"Siap Diisi\",\"\",IF(PSI!R19=\"\",\"\",PSI!R19))","v":""},{"$f":"IF(CEK<>\"Siap Diisi\",\"\",IF(PSI!S19=\"\",\"\",PSI!S19))","v":""},{"$f":"IF(CEK<>\"Siap Diisi\",\"\",IF(AFE!U19=\"\",\"\",AFE!U19))","v":""},{"$f":"IF(CEK<>\"Siap Diisi\",\"\",IF(AFE!V19=\"\",\"\",AFE!V19))","v":""}]
[null,{"$f":"IF(ABS!B30=\"\",\"\",ABS!B30)","v":16},{"$f":"IF(ABS!C30=\"\",\"\",ABS!C30)","v":12597},{"$f":"IF(ABS!D30=\"\",\"\",PROPER(ABS!D30))","v":"Irvani Putri"},{"$f":"IF(CEK<>\"Siap Diisi\",\"\",IF(KOG!AF22=\"\",\"\",KOG!AF22))","v":""},{"$f":"IF(CEK<>\"Siap Diisi\",\"\",IF(KOG!AG22=\"\",\"\",KOG!AG22))","v":""},{"$f":"IF(CEK<>\"Siap Diisi\",\"\",IF(KOG!AH22=\"\",\"\",KOG!AH22))","v":""},{"$f":"IF(CEK<>\"Siap Diisi\",\"\",IF(PSI!Q20=\"\",\"\",PSI!Q20))","v":""},{"$f":"IF(CEK<>\"Siap Diisi\",\"\",IF(PSI!R20=\"\",\"\",PSI!R20))","v":""},{"$f":"IF(CEK<>\"Siap Diisi\",\"\",IF(PSI!S20=\"\",\"\",PSI!S20))","v":""},{"$f":"IF(CEK<>\"Siap Diisi\",\"\",IF(AFE!U20=\"\",\"\",AFE!U20))","v":""},{"$f":"IF(CEK<>\"Siap Diisi\",\"\",IF(AFE!V20=\"\",\"\",AFE!V20))","v":""}]
[null,{"$f":"IF(ABS!B31=\"\",\"\",ABS!B31)","v":17},{"$f":"IF(ABS!C31=\"\",\"\",ABS!C31)","v":12607},{"$f":"IF(ABS!D31=\"\",\"\",PROPER(ABS!D31))","v":"Kristian Adi Bawono"},{"$f":"IF(CEK<>\"Siap Diisi\",\"\",IF(KOG!AF23=\"\",\"\",KOG!AF23))","v":""},{"$f":"IF(CEK<>\"Siap Diisi\",\"\",IF(KOG!AG23=\"\",\"\",KOG!AG23))","v":""},{"$f":"IF(CEK<>\"Siap Diisi\",\"\",IF(KOG!AH23=\"\",\"\",KOG!AH23))","v":""},{"$f":"IF(CEK<>\"Siap Diisi\",\"\",IF(PSI!Q21=\"\",\"\",PSI!Q21))","v":""},{"$f":"IF(CEK<>\"Siap Diisi\",\"\",IF(PSI!R21=\"\",\"\",PSI!R21))","v":""},{"$f":"IF(CEK<>\"Siap Diisi\",\"\",IF(PSI!S21=\"\",\"\",PSI!S21))","v":""},{"$f":"IF(CEK<>\"Siap Diisi\",\"\",IF(AFE!U21=\"\",\"\",AFE!U21))","v":""},{"$f":"IF(CEK<>\"Siap Diisi\",\"\",IF(AFE!V21=\"\",\"\",AFE!V21))","v":""}]
[null,{"$f":"IF(ABS!B32=\"\",\"\",ABS!B32)","v":18},{"$f":"IF(ABS!C32=\"\",\"\",ABS!C32)","v":12618},{"$f":"IF(ABS!D32=\"\",\"\",PROPER(ABS!D32))","v":"Lutfi Imanika Vianti"},{"$f":"IF(CEK<>\"Siap Diisi\",\"\",IF(KOG!AF24=\"\",\"\",KOG!AF24))","v":""},{"$f":"IF(CEK<>\"Siap Diisi\",\"\",IF(KOG!AG24=\"\",\"\",KOG!AG24))","v":""},{"$f":"IF(CEK<>\"Siap Diisi\",\"\",IF(KOG!AH24=\"\",\"\",KOG!AH24))","v":""},{"$f":"IF(CEK<>\"Siap Diisi\",\"\",IF(PSI!Q22=\"\",\"\",PSI!Q22))","v":""},{"$f":"IF(CEK<>\"Siap Diisi\",\"\",IF(PSI!R22=\"\",\"\",PSI!R22))","v":""},{"$f":"IF(CEK<>\"Siap Diisi\",\"\",IF(PSI!S22=\"\",\"\",PSI!S22))","v":""},{"$f":"IF(CEK<>\"Siap Diisi\",\"\",IF(AFE!U22=\"\",\"\",AFE!U22))","v":""},{"$f":"IF(CEK<>\"Siap Diisi\",\"\",IF(AFE!V22=\"\",\"\",AFE!V22))","v":""}]
[null,{"$f":"IF(ABS!B33=\"\",\"\",ABS!B33)","v":19},{"$f":"IF(ABS!C33=\"\",\"\",ABS!C33)","v":12625},{"$f":"IF(ABS!D33=\"\",\"\",PROPER(ABS!D33))","v":"Meilani Kartika"},{"$f":"IF(CEK<>\"Siap Diisi\",\"\",IF(KOG!AF25=\"\",\"\",KOG!AF25))","v":""},{"$f":"IF(CEK<>\"Siap Diisi\",\"\",IF(KOG!AG25=\"\",\"\",KOG!AG25))","v":""},{"$f":"IF(CEK<>\"Siap Diisi\",\"\",IF(KOG!AH25=\"\",\"\",KOG!AH25))","v":""},{"$f":"IF(CEK<>\"Siap Diisi\",\"\",IF(PSI!Q23=\"\",\"\",PSI!Q23))","v":""},{"$f":"IF(CEK<>\"Siap Diisi\",\"\",IF(PSI!R23=\"\",\"\",PSI!R23))","v":""},{"$f":"IF(CEK<>\"Siap Diisi\",\"\",IF(PSI!S23=\"\",\"\",PSI!S23))","v":""},{"$f":"IF(CEK<>\"Siap Diisi\",\"\",IF(AFE!U23=\"\",\"\",AFE!U23))","v":""},{"$f":"IF(CEK<>\"Siap Diisi\",\"\",IF(AFE!V23=\"\",\"\",AFE!V23))","v":""}]
[null,{"$f":"IF(ABS!B34=\"\",\"\",ABS!B34)","v":20},{"$f":"IF(ABS!C34=\"\",\"\",ABS!C34)","v":12699},{"$f":"IF(ABS!D34=\"\",\"\",PROPER(ABS!D34))","v":"Riesty Wulan"},{"$f":"IF(CEK<>\"Siap Diisi\",\"\",IF(KOG!AF26=\"\",\"\",KOG!AF26))","v":""},{"$f":"IF(CEK<>\"Siap Diisi\",\"\",IF(KOG!AG26=\"\",\"\",KOG!AG26))","v":""},{"$f":"IF(CEK<>\"Siap Diisi\",\"\",IF(KOG!AH26=\"\",\"\",KOG!AH26))","v":""},{"$f":"IF(CEK<>\"Siap Diisi\",\"\",IF(PSI!Q24=\"\",\"\",PSI!Q24))","v":""},{"$f":"IF(CEK<>\"Siap Diisi\",\"\",IF(PSI!R24=\"\",\"\",PSI!R24))","v":""},{"$f":"IF(CEK<>\"Siap Diisi\",\"\",IF(PSI!S24=\"\",\"\",PSI!S24))","v":""},{"$f":"IF(CEK<>\"Siap Diisi\",\"\",IF(AFE!U24=\"\",\"\",AFE!U24))","v":""},{"$f":"IF(CEK<>\"Siap Diisi\",\"\",IF(AFE!V24=\"\",\"\",AFE!V24))","v":""}]
[null,{"$f":"IF(ABS!B35=\"\",\"\",ABS!B35)","v":21},{"$f":"IF(ABS!C35=\"\",\"\",ABS!C35)","v":12703},{"$f":"IF(ABS!D35=\"\",\"\",PROPER(ABS!D35))","v":"Risa Puspitarini"},{"$f":"IF(CEK<>\"Siap Diisi\",\"\",IF(KOG!AF27=\"\",\"\",KOG!AF27))","v":""},{"$f":"IF(CEK<>\"Siap Diisi\",\"\",IF(KOG!AG27=\"\",\"\",KOG!AG27))","v":""},{"$f":"IF(CEK<>\"Siap Diisi\",\"\",IF(KOG!AH27=\"\",\"\",KOG!AH27))","v":""},{"$f":"IF(CEK<>\"Siap Diisi\",\"\",IF(PSI!Q25=\"\",\"\",PSI!Q25))","v":""},{"$f":"IF(CEK<>\"Siap Diisi\",\"\",IF(PSI!R25=\"\",\"\",PSI!R25))","v":""},{"$f":"IF(CEK<>\"Siap Diisi\",\"\",IF(PSI!S25=\"\",\"\",PSI!S25))","v":""},{"$f":"IF(CEK<>\"Siap Diisi\",\"\",IF(AFE!U25=\"\",\"\",AFE!U25))","v":""},{"$f":"IF(CEK<>\"Siap Diisi\",\"\",IF(AFE!V25=\"\",\"\",AFE!V25))","v":""}]
[null,{"$f":"IF(ABS!B36=\"\",\"\",ABS!B36)","v":22},{"$f":"IF(ABS!C36=\"\",\"\",ABS!C36)","v":12707},{"$f":"IF(ABS!D36=\"\",\"\",PROPER(ABS!D36))","v":"Rivan Setiawan"},{"$f":"IF(CEK<>\"Siap Diisi\",\"\",IF(KOG!AF28=\"\",\"\",KOG!AF28))","v":""},{"$f":"IF(CEK<>\"Siap Diisi\",\"\",IF(KOG!AG28=\"\",\"\",KOG!AG28))","v":""},{"$f":"IF(CEK<>\"Siap Diisi\",\"\",IF(KOG!AH28=\"\",\"\",KOG!AH28))","v":""},{"$f":"IF(CEK<>\"Siap Diisi\",\"\",IF(PSI!Q26=\"\",\"\",PSI!Q26))","v":""},{"$f":"IF(CEK<>\"Siap Diisi\",\"\",IF(PSI!R26=\"\",\"\",PSI!R26))","v":""},{"$f":"IF(CEK<>\"Siap Diisi\",\"\",IF(PSI!S26=\"\",\"\",PSI!S26))","v":""},{"$f":"IF(CEK<>\"Siap Diisi\",\"\",IF(AFE!U26=\"\",\"\",AFE!U26))","v":""},{"$f":"IF(CEK<>\"Siap Diisi\",\"\",IF(AFE!V26=\"\",\"\",AFE!V26))","v":""}]
[null,{"$f":"IF(ABS!B37=\"\",\"\",ABS!B37)","v":23},{"$f":"IF(ABS!C37=\"\",\"\",ABS!C37)","v":12724},{"$f":"IF(ABS!D37=\"\",\"\",PROPER(ABS!D37))","v":"Septian Rizky Hadi"},{"$f":"IF(CEK<>\"Siap Diisi\",\"\",IF(KOG!AF29=\"\",\"\",KOG!AF29))","v":""},{"$f":"IF(CEK<>\"Siap Diisi\",\"\",IF(KOG!AG29=\"\",\"\",KOG!AG29))","v":""},{"$f":"IF(CEK<>\"Siap Diisi\",\"\",IF(KOG!AH29=\"\",\"\",KOG!AH29))","v":""},{"$f":"IF(CEK<>\"Siap Diisi\",\"\",IF(PSI!Q27=\"\",\"\",PSI!Q27))","v":""},{"$f":"IF(CEK<>\"Siap Diisi\",\"\",IF(PSI!R27=\"\",\"\",PSI!R27))","v":""},{"$f":"IF(CEK<>\"Siap Diisi\",\"\",IF(PSI!S27=\"\",\"\",PSI!S27))","v":""},{"$f":"IF(CEK<>\"Siap Diisi\",\"\",IF(AFE!U27=\"\",\"\",AFE!U27))","v":""},{"$f":"IF(CEK<>\"Siap Diisi\",\"\",IF(AFE!V27=\"\",\"\",AFE!V27))","v":""}]
[null,{"$f":"IF(ABS!B38=\"\",\"\",ABS!B38)","v":24},{"$f":"IF(ABS!C38=\"\",\"\",ABS!C38)","v":12751},{"$f":"IF(ABS!D38=\"\",\"\",PROPER(ABS!D38))","v":"Tyastuti Anjarsari"},{"$f":"IF(CEK<>\"Siap Diisi\",\"\",IF(KOG!AF30=\"\",\"\",KOG!AF30))","v":""},{"$f":"IF(CEK<>\"Siap Diisi\",\"\",IF(KOG!AG30=\"\",\"\",KOG!AG30))","v":""},{"$f":"IF(CEK<>\"Siap Diisi\",\"\",IF(KOG!AH30=\"\",\"\",KOG!AH30))","v":""},{"$f":"IF(CEK<>\"Siap Diisi\",\"\",IF(PSI!Q28=\"\",\"\",PSI!Q28))","v":""},{"$f":"IF(CEK<>\"Siap Diisi\",\"\",IF(PSI!R28=\"\",\"\",PSI!R28))","v":""},{"$f":"IF(CEK<>\"Siap Diisi\",\"\",IF(PSI!S28=\"\",\"\",PSI!S28))","v":""},{"$f":"IF(CEK<>\"Siap Diisi\",\"\",IF(AFE!U28=\"\",\"\",AFE!U28))","v":""},{"$f":"IF(CEK<>\"Siap Diisi\",\"\",IF(AFE!V28=\"\",\"\",AFE!V28))","v":""}]
[null,{"$f":"IF(ABS!B39=\"\",\"\",ABS!B39)","v":25},{"$f":"IF(ABS!C39=\"\",\"\",ABS!C39)","v":12768},{"$f":"IF(ABS!D39=\"\",\"\",PROPER(ABS!D39))","v":"Wila Tri Wahyudita Savik Iswara"},{"$f":"IF(CEK<>\"Siap Diisi\",\"\",IF(KOG!AF31=\"\",\"\",KOG!AF31))","v":""},{"$f":"IF(CEK<>\"Siap Diisi\",\"\",IF(KOG!AG31=\"\",\"\",KOG!AG31))","v":""},{"$f":"IF(CEK<>\"Siap Diisi\",\"\",IF(KOG!AH31=\"\",\"\",KOG!AH31))","v":""},{"$f":"IF(CEK<>\"Siap Diisi\",\"\",IF(PSI!Q29=\"\",\"\",PSI!Q29))","v":""},{"$f":"IF(CEK<>\"Siap Diisi\",\"\",IF(PSI!R29=\"\",\"\",PSI!R29))","v":""},{"$f":"IF(CEK<>\"Siap Diisi\",\"\",IF(PSI!S29=\"\",\"\",PSI!S29))","v":""},{"$f":"IF(CEK<>\"Siap Diisi\",\"\",IF(AFE!U29=\"\",\"\",AFE!U29))","v":""},{"$f":"IF(CEK<>\"Siap Diisi\",\"\",IF(AFE!V29=\"\",\"\",AFE!V29))","v":""}]
[null,{"$f":"IF(ABS!B40=\"\",\"\",ABS!B40)","v":""},{"$f":"IF(ABS!C40=\"\",\"\",ABS!C40)","v":""},{"$f":"IF(ABS!D40=\"\",\"\",PROPER(ABS!D40))","v":""},{"$f":"IF(CEK<>\"Siap Diisi\",\"\",IF(KOG!AF32=\"\",\"\",KOG!AF32))","v":""},{"$f":"IF(CEK<>\"Siap Diisi\",\"\",IF(KOG!AG32=\"\",\"\",KOG!AG32))","v":""},{"$f":"IF(CEK<>\"Siap Diisi\",\"\",IF(KOG!AH32=\"\",\"\",KOG!AH32))","v":""},{"$f":"IF(CEK<>\"Siap Diisi\",\"\",IF(PSI!Q30=\"\",\"\",PSI!Q30))","v":""},{"$f":"IF(CEK<>\"Siap Diisi\",\"\",IF(PSI!R30=\"\",\"\",PSI!R30))","v":""},{"$f":"IF(CEK<>\"Siap Diisi\",\"\",IF(PSI!S30=\"\",\"\",PSI!S30))","v":""},{"$f":"IF(CEK<>\"Siap Diisi\",\"\",IF(AFE!U30=\"\",\"\",AFE!U30))","v":""},{"$f":"IF(CEK<>\"Siap Diisi\",\"\",IF(AFE!V30=\"\",\"\",AFE!V30))","v":""}]
[null,{"$f":"IF(ABS!B41=\"\",\"\",ABS!B41)","v":""},{"$f":"IF(ABS!C41=\"\",\"\",ABS!C41)","v":""},{"$f":"IF(ABS!D41=\"\",\"\",PROPER(ABS!D41))","v":""},{"$f":"IF(CEK<>\"Siap Diisi\",\"\",IF(KOG!AF33=\"\",\"\",KOG!AF33))","v":""},{"$f":"IF(CEK<>\"Siap Diisi\",\"\",IF(KOG!AG33=\"\",\"\",KOG!AG33))","v":""},{"$f":"IF(CEK<>\"Siap Diisi\",\"\",IF(KOG!AH33=\"\",\"\",KOG!AH33))","v":""},{"$f":"IF(CEK<>\"Siap Diisi\",\"\",IF(PSI!Q31=\"\",\"\",PSI!Q31))","v":""},{"$f":"IF(CEK<>\"Siap Diisi\",\"\",IF(PSI!R31=\"\",\"\",PSI!R31))","v":""},{"$f":"IF(CEK<>\"Siap Diisi\",\"\",IF(PSI!S31=\"\",\"\",PSI!S31))","v":""},{"$f":"IF(CEK<>\"Siap Diisi\",\"\",IF(AFE!U31=\"\",\"\",AFE!U31))","v":""},{"$f":"IF(CEK<>\"Siap Diisi\",\"\",IF(AFE!V31=\"\",\"\",AFE!V31))","v":""}]
[null,{"$f":"IF(ABS!B42=\"\",\"\",ABS!B42)","v":""},{"$f":"IF(ABS!C42=\"\",\"\",ABS!C42)","v":""},{"$f":"IF(ABS!D42=\"\",\"\",PROPER(ABS!D42))","v":""},{"$f":"IF(CEK<>\"Siap Diisi\",\"\",IF(KOG!AF34=\"\",\"\",KOG!AF34))","v":""},{"$f":"IF(CEK<>\"Siap Diisi\",\"\",IF(KOG!AG34=\"\",\"\",KOG!AG34))","v":""},{"$f":"IF(CEK<>\"Siap Diisi\",\"\",IF(KOG!AH34=\"\",\"\",KOG!AH34))","v":""},{"$f":"IF(CEK<>\"Siap Diisi\",\"\",IF(PSI!Q32=\"\",\"\",PSI!Q32))","v":""},{"$f":"IF(CEK<>\"Siap Diisi\",\"\",IF(PSI!R32=\"\",\"\",PSI!R32))","v":""},{"$f":"IF(CEK<>\"Siap Diisi\",\"\",IF(PSI!S32=\"\",\"\",PSI!S32))","v":""},{"$f":"IF(CEK<>\"Siap Diisi\",\"\",IF(AFE!U32=\"\",\"\",AFE!U32))","v":""},{"$f":"IF(CEK<>\"Siap Diisi\",\"\",IF(AFE!V32=\"\",\"\",AFE!V32))","v":""}]
[null,{"$f":"IF(ABS!B43=\"\",\"\",ABS!B43)","v":""},{"$f":"IF(ABS!C43=\"\",\"\",ABS!C43)","v":""},{"$f":"IF(ABS!D43=\"\",\"\",PROPER(ABS!D43))","v":""},{"$f":"IF(CEK<>\"Siap Diisi\",\"\",IF(KOG!AF35=\"\",\"\",KOG!AF35))","v":""},{"$f":"IF(CEK<>\"Siap Diisi\",\"\",IF(KOG!AG35=\"\",\"\",KOG!AG35))","v":""},{"$f":"IF(CEK<>\"Siap Diisi\",\"\",IF(KOG!AH35=\"\",\"\",KOG!AH35))","v":""},{"$f":"IF(CEK<>\"Siap Diisi\",\"\",IF(PSI!Q33=\"\",\"\",PSI!Q33))","v":""},{"$f":"IF(CEK<>\"Siap Diisi\",\"\",IF(PSI!R33=\"\",\"\",PSI!R33))","v":""},{"$f":"IF(CEK<>\"Siap Diisi\",\"\",IF(PSI!S33=\"\",\"\",PSI!S33))","v":""},{"$f":"IF(CEK<>\"Siap Diisi\",\"\",IF(AFE!U33=\"\",\"\",AFE!U33))","v":""},{"$f":"IF(CEK<>\"Siap Diisi\",\"\",IF(AFE!V33=\"\",\"\",AFE!V33))","v":""}]
[null,{"$f":"IF(ABS!B44=\"\",\"\",ABS!B44)","v":""},{"$f":"IF(ABS!C44=\"\",\"\",ABS!C44)","v":""},{"$f":"IF(ABS!D44=\"\",\"\",PROPER(ABS!D44))","v":""},{"$f":"IF(CEK<>\"Siap Diisi\",\"\",IF(KOG!AF36=\"\",\"\",KOG!AF36))","v":""},{"$f":"IF(CEK<>\"Siap Diisi\",\"\",IF(KOG!AG36=\"\",\"\",KOG!AG36))","v":""},{"$f":"IF(CEK<>\"Siap Diisi\",\"\",IF(KOG!AH36=\"\",\"\",KOG!AH36))","v":""},{"$f":"IF(CEK<>\"Siap Diisi\",\"\",IF(PSI!Q34=\"\",\"\",PSI!Q34))","v":""},{"$f":"IF(CEK<>\"Siap Diisi\",\"\",IF(PSI!R34=\"\",\"\",PSI!R34))","v":""},{"$f":"IF(CEK<>\"Siap Diisi\",\"\",IF(PSI!S34=\"\",\"\",PSI!S34))","v":""},{"$f":"IF(CEK<>\"Siap Diisi\",\"\",IF(AFE!U34=\"\",\"\",AFE!U34))","v":""},{"$f":"IF(CEK<>\"Siap Diisi\",\"\",IF(AFE!V34=\"\",\"\",AFE!V34))","v":""}]
[null,{"$f":"IF(ABS!B45=\"\",\"\",ABS!B45)","v":""},{"$f":"IF(ABS!C45=\"\",\"\",ABS!C45)","v":""},{"$f":"IF(ABS!D45=\"\",\"\",PROPER(ABS!D45))","v":""},{"$f":"IF(CEK<>\"Siap Diisi\",\"\",IF(KOG!AF37=\"\",\"\",KOG!AF37))","v":""},{"$f":"IF(CEK<>\"Siap Diisi\",\"\",IF(KOG!AG37=\"\",\"\",KOG!AG37))","v":""},{"$f":"IF(CEK<>\"Siap Diisi\",\"\",IF(KOG!AH37=\"\",\"\",KOG!AH37))","v":""},{"$f":"IF(CEK<>\"Siap Diisi\",\"\",IF(PSI!Q35=\"\",\"\",PSI!Q35))","v":""},{"$f":"IF(CEK<>\"Siap Diisi\",\"\",IF(PSI!R35=\"\",\"\",PSI!R35))","v":""},{"$f":"IF(CEK<>\"Siap Diisi\",\"\",IF(PSI!S35=\"\",\"\",PSI!S35))","v":""},{"$f":"IF(CEK<>\"Siap Diisi\",\"\",IF(AFE!U35=\"\",\"\",AFE!U35))","v":""},{"$f":"IF(CEK<>\"Siap Diisi\",\"\",IF(AFE!V35=\"\",\"\",AFE!V35))","v":""}]
[null,{"$f":"IF(ABS!B46=\"\",\"\",ABS!B46)","v":""},{"$f":"IF(ABS!C46=\"\",\"\",ABS!C46)","v":""},{"$f":"IF(ABS!D46=\"\",\"\",PROPER(ABS!D46))","v":""},{"$f":"IF(CEK<>\"Siap Diisi\",\"\",IF(KOG!AF38=\"\",\"\",KOG!AF38))","v":""},{"$f":"IF(CEK<>\"Siap Diisi\",\"\",IF(KOG!AG38=\"\",\"\",KOG!AG38))","v":""},{"$f":"IF(CEK<>\"Siap Diisi\",\"\",IF(KOG!AH38=\"\",\"\",KOG!AH38))","v":""},{"$f":"IF(CEK<>\"Siap Diisi\",\"\",IF(PSI!Q36=\"\",\"\",PSI!Q36))","v":""},{"$f":"IF(CEK<>\"Siap Diisi\",\"\",IF(PSI!R36=\"\",\"\",PSI!R36))","v":""},{"$f":"IF(CEK<>\"Siap Diisi\",\"\",IF(PSI!S36=\"\",\"\",PSI!S36))","v":""},{"$f":"IF(CEK<>\"Siap Diisi\",\"\",IF(AFE!U36=\"\",\"\",AFE!U36))","v":""},{"$f":"IF(CEK<>\"Siap Diisi\",\"\",IF(AFE!V36=\"\",\"\",AFE!V36))","v":""}]
[null,{"$f":"IF(ABS!B47=\"\",\"\",ABS!B47)","v":""},{"$f":"IF(ABS!C47=\"\",\"\",ABS!C47)","v":""},{"$f":"IF(ABS!D47=\"\",\"\",PROPER(ABS!D47))","v":""},{"$f":"IF(CEK<>\"Siap Diisi\",\"\",IF(KOG!AF39=\"\",\"\",KOG!AF39))","v":""},{"$f":"IF(CEK<>\"Siap Diisi\",\"\",IF(KOG!AG39=\"\",\"\",KOG!AG39))","v":""},{"$f":"IF(CEK<>\"Siap Diisi\",\"\",IF(KOG!AH39=\"\",\"\",KOG!AH39))","v":""},{"$f":"IF(CEK<>\"Siap Diisi\",\"\",IF(PSI!Q37=\"\",\"\",PSI!Q37))","v":""},{"$f":"IF(CEK<>\"Siap Diisi\",\"\",IF(PSI!R37=\"\",\"\",PSI!R37))","v":""},{"$f":"IF(CEK<>\"Siap Diisi\",\"\",IF(PSI!S37=\"\",\"\",PSI!S37))","v":""},{"$f":"IF(CEK<>\"Siap Diisi\",\"\",IF(AFE!U37=\"\",\"\",AFE!U37))","v":""},{"$f":"IF(CEK<>\"Siap Diisi\",\"\",IF(AFE!V37=\"\",\"\",AFE!V37))","v":""}]
[null,{"$f":"IF(ABS!B48=\"\",\"\",ABS!B48)","v":""},{"$f":"IF(ABS!C48=\"\",\"\",ABS!C48)","v":""},{"$f":"IF(ABS!D48=\"\",\"\",PROPER(ABS!D48))","v":""},{"$f":"IF(CEK<>\"Siap Diisi\",\"\",IF(KOG!AF40=\"\",\"\",KOG!AF40))","v":""},{"$f":"IF(CEK<>\"Siap Diisi\",\"\",IF(KOG!AG40=\"\",\"\",KOG!AG40))","v":""},{"$f":"IF(CEK<>\"Siap Diisi\",\"\",IF(KOG!AH40=\"\",\"\",KOG!AH40))","v":""},{"$f":"IF(CEK<>\"Siap Diisi\",\"\",IF(PSI!Q38=\"\",\"\",PSI!Q38))","v":""},{"$f":"IF(CEK<>\"Siap Diisi\",\"\",IF(PSI!R38=\"\",\"\",PSI!R38))","v":""},{"$f":"IF(CEK<>\"Siap Diisi\",\"\",IF(PSI!S38=\"\",\"\",PSI!S38))","v":""},{"$f":"IF(CEK<>\"Siap Diisi\",\"\",IF(AFE!U38=\"\",\"\",AFE!U38))","v":""},{"$f":"IF(CEK<>\"Siap Diisi\",\"\",IF(AFE!V38=\"\",\"\",AFE!V38))","v":""}]
[null,{"$f":"IF(ABS!B49=\"\",\"\",ABS!B49)","v":""},{"$f":"IF(ABS!C49=\"\",\"\",ABS!C49)","v":""},{"$f":"IF(ABS!D49=\"\",\"\",PROPER(ABS!D49))","v":""},{"$f":"IF(CEK<>\"Siap Diisi\",\"\",IF(KOG!AF41=\"\",\"\",KOG!AF41))","v":""},{"$f":"IF(CEK<>\"Siap Diisi\",\"\",IF(KOG!AG41=\"\",\"\",KOG!AG41))","v":""},{"$f":"IF(CEK<>\"Siap Diisi\",\"\",IF(KOG!AH41=\"\",\"\",KOG!AH41))","v":""},{"$f":"IF(CEK<>\"Siap Diisi\",\"\",IF(PSI!Q39=\"\",\"\",PSI!Q39))","v":""},{"$f":"IF(CEK<>\"Siap Diisi\",\"\",IF(PSI!R39=\"\",\"\",PSI!R39))","v":""},{"$f":"IF(CEK<>\"Siap Diisi\",\"\",IF(PSI!S39=\"\",\"\",PSI!S39))","v":""},{"$f":"IF(CEK<>\"Siap Diisi\",\"\",IF(AFE!U39=\"\",\"\",AFE!U39))","v":""},{"$f":"IF(CEK<>\"Siap Diisi\",\"\",IF(AFE!V39=\"\",\"\",AFE!V39))","v":""}]
[null,{"$f":"IF(ABS!B50=\"\",\"\",ABS!B50)","v":""},{"$f":"IF(ABS!C50=\"\",\"\",ABS!C50)","v":""},{"$f":"IF(ABS!D50=\"\",\"\",PROPER(ABS!D50))","v":""},{"$f":"IF(CEK<>\"Siap Diisi\",\"\",IF(KOG!AF42=\"\",\"\",KOG!AF42))","v":""},{"$f":"IF(CEK<>\"Siap Diisi\",\"\",IF(KOG!AG42=\"\",\"\",KOG!AG42))","v":""},{"$f":"IF(CEK<>\"Siap Diisi\",\"\",IF(KOG!AH42=\"\",\"\",KOG!AH42))","v":""},{"$f":"IF(CEK<>\"Siap Diisi\",\"\",IF(PSI!Q40=\"\",\"\",PSI!Q40))","v":""},{"$f":"IF(CEK<>\"Siap Diisi\",\"\",IF(PSI!R40=\"\",\"\",PSI!R40))","v":""},{"$f":"IF(CEK<>\"Siap Diisi\",\"\",IF(PSI!S40=\"\",\"\",PSI!S40))","v":""},{"$f":"IF(CEK<>\"Siap Diisi\",\"\",IF(AFE!U40=\"\",\"\",AFE!U40))","v":""},{"$f":"IF(CEK<>\"Siap Diisi\",\"\",IF(AFE!V40=\"\",\"\",AFE!V40))","v":""}]
[null,{"$f":"IF(ABS!B51=\"\",\"\",ABS!B51)","v":""},{"$f":"IF(ABS!C51=\"\",\"\",ABS!C51)","v":""},{"$f":"IF(ABS!D51=\"\",\"\",PROPER(ABS!D51))","v":""},{"$f":"IF(CEK<>\"Siap Diisi\",\"\",IF(KOG!AF43=\"\",\"\",KOG!AF43))","v":""},{"$f":"IF(CEK<>\"Siap Diisi\",\"\",IF(KOG!AG43=\"\",\"\",KOG!AG43))","v":""},{"$f":"IF(CEK<>\"Siap Diisi\",\"\",IF(KOG!AH43=\"\",\"\",KOG!AH43))","v":""},{"$f":"IF(CEK<>\"Siap Diisi\",\"\",IF(PSI!Q41=\"\",\"\",PSI!Q41))","v":""},{"$f":"IF(CEK<>\"Siap Diisi\",\"\",IF(PSI!R41=\"\",\"\",PSI!R41))","v":""},{"$f":"IF(CEK<>\"Siap Diisi\",\"\",IF(PSI!S41=\"\",\"\",PSI!S41))","v":""},{"$f":"IF(CEK<>\"Siap Diisi\",\"\",IF(AFE!U41=\"\",\"\",AFE!U41))","v":""},{"$f":"IF(CEK<>\"Siap Diisi\",\"\",IF(AFE!V41=\"\",\"\",AFE!V41))","v":""}]
[null,{"$f":"IF(ABS!B52=\"\",\"\",ABS!B52)","v":""},{"$f":"IF(ABS!C52=\"\",\"\",ABS!C52)","v":""},{"$f":"IF(ABS!D52=\"\",\"\",PROPER(ABS!D52))","v":""},{"$f":"IF(CEK<>\"Siap Diisi\",\"\",IF(KOG!AF44=\"\",\"\",KOG!AF44))","v":""},{"$f":"IF(CEK<>\"Siap Diisi\",\"\",IF(KOG!AG44=\"\",\"\",KOG!AG44))","v":""},{"$f":"IF(CEK<>\"Siap Diisi\",\"\",IF(KOG!AH44=\"\",\"\",KOG!AH44))","v":""},{"$f":"IF(CEK<>\"Siap Diisi\",\"\",IF(PSI!Q42=\"\",\"\",PSI!Q42))","v":""},{"$f":"IF(CEK<>\"Siap Diisi\",\"\",IF(PSI!R42=\"\",\"\",PSI!R42))","v":""},{"$f":"IF(CEK<>\"Siap Diisi\",\"\",IF(PSI!S42=\"\",\"\",PSI!S42))","v":""},{"$f":"IF(CEK<>\"Siap Diisi\",\"\",IF(AFE!U42=\"\",\"\",AFE!U42))","v":""},{"$f":"IF(CEK<>\"Siap Diisi\",\"\",IF(AFE!V42=\"\",\"\",AFE!V42))","v":""}]
[null,"RATA-RATA"]

{"sheet":"Link","index":15,"n_rows":40,"n_cols":13,"rows_kept":40,"cut":false,"hidden":false,"merged":[[0,11,1,11],[0,12,1,12],[0,3,0,5],[0,0,1,0],[0,1,1,1],[0,2,1,2],[0,6,0,8],[0,9,0,10]]}
["No","NIS","Nama Siswa","Pengetahuan (KI-3)",null,null,"Ketrampilan (KI-4)",null,null,"Sikap Spiritual dan Sosial (KI-1 dan KI-2)",null,"Nama Guru","Kelas"]
[null,null,null,"Angka","Predikat","Deskripsi","Angka","Predikat","Deskripsi","Predikat","Deskripsi"]
[{"$f":"REK!B11","v":1},{"$f":"REK!C11","v":12427},{"$f":"REK!D11","v":"Agnes Maulida Yulinar"},{"$f":"REK!E11","v":""},{"$f":"REK!F11","v":""},{"$f":"REK!G11","v":""},{"$f":"REK!H11","v":""},{"$f":"REK!I11","v":""},{"$f":"REK!J11","v":""},{"$f":"REK!K11","v":""},{"$f":"REK!L11","v":""},{"$f":"REK!E4","v":""},{"$f":"REK!J3","v":""}]
[{"$f":"REK!B12","v":2},{"$f":"REK!C12","v":12436},{"$f":"REK!D12","v":"Akhmad Zanuar Hidayat"},{"$f":"REK!E12","v":""},{"$f":"REK!F12","v":""},{"$f":"REK!G12","v":""},{"$f":"REK!H12","v":""},{"$f":"REK!I12","v":""},{"$f":"REK!J12","v":""},{"$f":"REK!K12","v":""},{"$f":"REK!L12","v":""},{"$f":"L3","v":""},{"$f":"M3","v":""}]
[{"$f":"REK!B13","v":3},{"$f":"REK!C13","v":12440},{"$f":"REK!D13","v":"Alfiyan Andhi Pratama"},{"$f":"REK!E13","v":""},{"$f":"REK!F13","v":""},{"$f":"REK!G13","v":""},{"$f":"REK!H13","v":""},{"$f":"REK!I13","v":""},{"$f":"REK!J13","v":""},{"$f":"REK!K13","v":""},{"$f":"REK!L13","v":""},{"$f":"L4","v":""},{"$f":"M4","v":""}]
[{"$f":"REK!B14","v":4},{"$f":"REK!C14","v":12447},{"$f":"REK!D14","v":"Amalia Majid"},{"$f":"REK!E14","v":""},{"$f":"REK!F14","v":""},{"$f":"REK!G14","v":""},{"$f":"REK!H14","v":""},{"$f":"REK!I14","v":""},{"$f":"REK!J14","v":""},{"$f":"REK!K14","v":""},{"$f":"REK!L14","v":""},"",""]
[{"$f":"REK!B15","v":5},{"$f":"REK!C15","v":12454},{"$f":"REK!D15","v":"Annisaa Putri Desihana"},{"$f":"REK!E15","v":""},{"$f":"REK!F15","v":""},{"$f":"REK!G15","v":""},{"$f":"REK!H15","v":""},{"$f":"REK!I15","v":""},{"$f":"REK!J15","v":""},{"$f":"REK!K15","v":""},{"$f":"REK!L15","v":""},"",""]
[{"$f":"REK!B16","v":6},{"$f":"REK!C16","v":12468},{"$f":"REK!D16","v":"Asfi Ma'Ruf Fairuzzabad"},{"$f":"REK!E16","v":""},{"$f":"REK!F16","v":""},{"$f":"REK!G16","v":""},{"$f":"REK!H16","v":""},{"$f":"REK!I16","v":""},{"$f":"REK!J16","v":""},{"$f":"REK!K16","v":""},{"$f":"REK!L16","v":""},"",""]
[{"$f":"REK!B17","v":7},{"$f":"REK!C17","v":12505},{"$f":"REK!D17","v":"Desy Anisa Purnamasari"},{"$f":"REK!E17","v":""},{"$f":"REK!F17","v":""},{"$f":"REK!G17","v":""},{"$f":"REK!H17","v":""},{"$f":"REK!I17","v":""},{"$f":"REK!J17","v":""},{"$f":"REK!K17","v":""},{"$f":"REK!L17","v":""},"",""]
[{"$f":"REK!B18","v":8},{"$f":"REK!C18","v":12517},{"$f":"REK!D18","v":"Dina Lutfi Hanifah"},{"$f":"REK!E18","v":""},{"$f":"REK!F18","v":""},{"$f":"REK!G18","v":""},{"$f":"REK!H18","v":""},{"$f":"REK!I18","v":""},{"$f":"REK!J18","v":""},{"$f":"REK!K18","v":""},{"$f":"REK!L18","v":""},"",""]
[{"$f":"REK!B19","v":9},{"$f":"REK!C19","v":12524},{"$f":"REK!D19","v":"Dwi Setyoningsih"},{"$f":"REK!E19","v":""},{"$f":"REK!F19","v":""},{"$f":"REK!G19","v":""},{"$f":"REK!H19","v":""},{"$f":"REK!I19","v":""},{"$f":"REK!J19","v":""},{"$f":"REK!K19","v":""},{"$f":"REK!L19","v":""},"",""]
[{"$f":"REK!B20","v":10},{"$f":"REK!C20","v":12531},{"$f":"REK!D20","v":"Eka Prasetya"},{"$f":"REK!E20","v":""},{"$f":"REK!F20","v":""},{"$f":"REK!G20","v":""},{"$f":"REK!H20","v":""},{"$f":"REK!I20","v":""},{"$f":"REK!J20","v":""},{"$f":"REK!K20","v":""},{"$f":"REK!L20","v":""},"",""]
[{"$f":"REK!B21","v":11},{"$f":"REK!C21","v":12539},{"$f":"REK!D21","v":"Erlangga Yudhanto Wibowo"},{"$f":"REK!E21","v":""},{"$f":"REK!F21","v":""},{"$f":"REK!G21","v":""},{"$f":"REK!H21","v":""},{"$f":"REK!I21","v":""},{"$f":"REK!J21","v":""},{"$f":"REK!K21","v":""},{"$f":"REK!L21","v":""},"",""]
[{"$f":"REK!B22","v":12},{"$f":"REK!C22","v":12546},{"$f":"REK!D22","v":"Falsafa Luthfiana Ummi Syahada"},{"$f":"REK!E22","v":""},{"$f":"REK!F22","v":""},{"$f":"REK!G22","v":""},{"$f":"REK!H22","v":""},{"$f":"REK!I22","v":""},{"$f":"REK!J22","v":""},{"$f":"REK!K22","v":""},{"$f":"REK!L22","v":""},"",""]
[{"$f":"REK!B23","v":13},{"$f":"REK!C23","v":12548},{"$f":"REK!D23","v":"Farid Hidayat"},{"$f":"REK!E23","v":""},{"$f":"REK!F23","v":""},{"$f":"REK!G23","v":""},{"$f":"REK!H23","v":""},{"$f":"REK!I23","v":""},{"$f":"REK!J23","v":""},{"$f":"REK!K23","v":""},{"$f":"REK!L23","v":""},"",""]
[{"$f":"REK!B24","v":14},{"$f":"REK!C24","v":12562},{"$f":"REK!D24","v":"Gayuh Anindyaningrum"},{"$f":"REK!E24","v":""},{"$f":"REK!F24","v":""},{"$f":"REK!G24","v":""},{"$f":"REK!H24","v":""},{"$f":"REK!I24","v":""},{"$f":"REK!J24","v":""},{"$f":"REK!K24","v":""},{"$f":"REK!L24","v":""},"",""]
[{"$f":"REK!B25","v":15},{"$f":"REK!C25","v":12583},{"$f":"REK!D25","v":"Ihwan Qorib"},{"$f":"REK!E25","v":""},{"$f":"REK!F25","v":""},{"$f":"REK!G25","v":""},{"$f":"REK!H25","v":""},{"$f":"REK!I25","v":""},{"$f":"REK!J25","v":""},{"$f":"REK!K25","v":""},{"$f":"REK!L25","v":""},"",""]
[{"$f":"REK!B26","v":16},{"$f":"REK!C26","v":12597},{"$f":"REK!D26","v":"Irvani Putri"},{"$f":"REK!E26","v":""},{"$f":"REK!F26","v":""},{"$f":"REK!G26","v":""},{"$f":"REK!H26","v":""},{"$f":"REK!I26","v":""},{"$f":"REK!J26","v":""},{"$f":"REK!K26","v":""},{"$f":"REK!L26","v":""},"",""]
[{"$f":"REK!B27","v":17},{"$f":"REK!C27","v":12607},{"$f":"REK!D27","v":"Kristian Adi Bawono"},{"$f":"REK!E27","v":""},{"$f":"REK!F27","v":""},{"$f":"REK!G27","v":""},{"$f":"REK!H27","v":""},{"$f":"REK!I27","v":""},{"$f":"REK!J27","v":""},{"$f":"REK!K27","v":""},{"$f":"REK!L27","v":""},"",""]
[{"$f":"REK!B28","v":18},{"$f":"REK!C28","v":12618},{"$f":"REK!D28","v":"Lutfi Imanika Vianti"},{"$f":"REK!E28","v":""},{"$f":"REK!F28","v":""},{"$f":"REK!G28","v":""},{"$f":"REK!H28","v":""},{"$f":"REK!I28","v":""},{"$f":"REK!J28","v":""},{"$f":"REK!K28","v":""},{"$f":"REK!L28","v":""},"",""]
[{"$f":"REK!B29","v":19},{"$f":"REK!C29","v":12625},{"$f":"REK!D29","v":"Meilani Kartika"},{"$f":"REK!E29","v":""},{"$f":"REK!F29","v":""},{"$f":"REK!G29","v":""},{"$f":"REK!H29","v":""},{"$f":"REK!I29","v":""},{"$f":"REK!J29","v":""},{"$f":"REK!K29","v":""},{"$f":"REK!L29","v":""},"",""]
[{"$f":"REK!B30","v":20},{"$f":"REK!C30","v":12699},{"$f":"REK!D30","v":"Riesty Wulan"},{"$f":"REK!E30","v":""},{"$f":"REK!F30","v":""},{"$f":"REK!G30","v":""},{"$f":"REK!H30","v":""},{"$f":"REK!I30","v":""},{"$f":"REK!J30","v":""},{"$f":"REK!K30","v":""},{"$f":"REK!L30","v":""},"",""]
[{"$f":"REK!B31","v":21},{"$f":"REK!C31","v":12703},{"$f":"REK!D31","v":"Risa Puspitarini"},{"$f":"REK!E31","v":""},{"$f":"REK!F31","v":""},{"$f":"REK!G31","v":""},{"$f":"REK!H31","v":""},{"$f":"REK!I31","v":""},{"$f":"REK!J31","v":""},{"$f":"REK!K31","v":""},{"$f":"REK!L31","v":""},"",""]
[{"$f":"REK!B32","v":22},{"$f":"REK!C32","v":12707},{"$f":"REK!D32","v":"Rivan Setiawan"},{"$f":"REK!E32","v":""},{"$f":"REK!F32","v":""},{"$f":"REK!G32","v":""},{"$f":"REK!H32","v":""},{"$f":"REK!I32","v":""},{"$f":"REK!J32","v":""},{"$f":"REK!K32","v":""},{"$f":"REK!L32","v":""},"",""]
[{"$f":"REK!B33","v":23},{"$f":"REK!C33","v":12724},{"$f":"REK!D33","v":"Septian Rizky Hadi"},{"$f":"REK!E33","v":""},{"$f":"REK!F33","v":""},{"$f":"REK!G33","v":""},{"$f":"REK!H33","v":""},{"$f":"REK!I33","v":""},{"$f":"REK!J33","v":""},{"$f":"REK!K33","v":""},{"$f":"REK!L33","v":""},"",""]
[{"$f":"REK!B34","v":24},{"$f":"REK!C34","v":12751},{"$f":"REK!D34","v":"Tyastuti Anjarsari"},{"$f":"REK!E34","v":""},{"$f":"REK!F34","v":""},{"$f":"REK!G34","v":""},{"$f":"REK!H34","v":""},{"$f":"REK!I34","v":""},{"$f":"REK!J34","v":""},{"$f":"REK!K34","v":""},{"$f":"REK!L34","v":""},"",""]
[{"$f":"REK!B35","v":25},{"$f":"REK!C35","v":12768},{"$f":"REK!D35","v":"Wila Tri Wahyudita Savik Iswara"},{"$f":"REK!E35","v":""},{"$f":"REK!F35","v":""},{"$f":"REK!G35","v":""},{"$f":"REK!H35","v":""},{"$f":"REK!I35","v":""},{"$f":"REK!J35","v":""},{"$f":"REK!K35","v":""},{"$f":"REK!L35","v":""},"",""]
[{"$f":"REK!B36","v":""},{"$f":"REK!C36","v":""},{"$f":"REK!D36","v":""},{"$f":"REK!E36","v":""},{"$f":"REK!F36","v":""},{"$f":"REK!G36","v":""},{"$f":"REK!H36","v":""},{"$f":"REK!I36","v":""},{"$f":"REK!J36","v":""},{"$f":"REK!K36","v":""},{"$f":"REK!L36","v":""},"",""]
[{"$f":"REK!B37","v":""},{"$f":"REK!C37","v":""},{"$f":"REK!D37","v":""},{"$f":"REK!E37","v":""},{"$f":"REK!F37","v":""},{"$f":"REK!G37","v":""},{"$f":"REK!H37","v":""},{"$f":"REK!I37","v":""},{"$f":"REK!J37","v":""},{"$f":"REK!K37","v":""},{"$f":"REK!L37","v":""},"",""]
[{"$f":"REK!B38","v":""},{"$f":"REK!C38","v":""},{"$f":"REK!D38","v":""},{"$f":"REK!E38","v":""},{"$f":"REK!F38","v":""},{"$f":"REK!G38","v":""},{"$f":"REK!H38","v":""},{"$f":"REK!I38","v":""},{"$f":"REK!J38","v":""},{"$f":"REK!K38","v":""},{"$f":"REK!L38","v":""},"",""]
[{"$f":"REK!B39","v":""},{"$f":"REK!C39","v":""},{"$f":"REK!D39","v":""},{"$f":"REK!E39","v":""},{"$f":"REK!F39","v":""},{"$f":"REK!G39","v":""},{"$f":"REK!H39","v":""},{"$f":"REK!I39","v":""},{"$f":"REK!J39","v":""},{"$f":"REK!K39","v":""},{"$f":"REK!L39","v":""},"",""]
[{"$f":"REK!B40","v":""},{"$f":"REK!C40","v":""},{"$f":"REK!D40","v":""},{"$f":"REK!E40","v":""},{"$f":"REK!F40","v":""},{"$f":"REK!G40","v":""},{"$f":"REK!H40","v":""},{"$f":"REK!I40","v":""},{"$f":"REK!J40","v":""},{"$f":"REK!K40","v":""},{"$f":"REK!L40","v":""},"",""]
[{"$f":"REK!B41","v":""},{"$f":"REK!C41","v":""},{"$f":"REK!D41","v":""},{"$f":"REK!E41","v":""},{"$f":"REK!F41","v":""},{"$f":"REK!G41","v":""},{"$f":"REK!H41","v":""},{"$f":"REK!I41","v":""},{"$f":"REK!J41","v":""},{"$f":"REK!K41","v":""},{"$f":"REK!L41","v":""},"",""]
[{"$f":"REK!B42","v":""},{"$f":"REK!C42","v":""},{"$f":"REK!D42","v":""},{"$f":"REK!E42","v":""},{"$f":"REK!F42","v":""},{"$f":"REK!G42","v":""},{"$f":"REK!H42","v":""},{"$f":"REK!I42","v":""},{"$f":"REK!J42","v":""},{"$f":"REK!K42","v":""},{"$f":"REK!L42","v":""},"",""]
[{"$f":"REK!B43","v":""},{"$f":"REK!C43","v":""},{"$f":"REK!D43","v":""},{"$f":"REK!E43","v":""},{"$f":"REK!F43","v":""},{"$f":"REK!G43","v":""},{"$f":"REK!H43","v":""},{"$f":"REK!I43","v":""},{"$f":"REK!J43","v":""},{"$f":"REK!K43","v":""},{"$f":"REK!L43","v":""},"",""]
[{"$f":"REK!B44","v":""},{"$f":"REK!C44","v":""},{"$f":"REK!D44","v":""},{"$f":"REK!E44","v":""},{"$f":"REK!F44","v":""},{"$f":"REK!G44","v":""},{"$f":"REK!H44","v":""},{"$f":"REK!I44","v":""},{"$f":"REK!J44","v":""},{"$f":"REK!K44","v":""},{"$f":"REK!L44","v":""},"",""]
[{"$f":"REK!B45","v":""},{"$f":"REK!C45","v":""},{"$f":"REK!D45","v":""},{"$f":"REK!E45","v":""},{"$f":"REK!F45","v":""},{"$f":"REK!G45","v":""},{"$f":"REK!H45","v":""},{"$f":"REK!I45","v":""},{"$f":"REK!J45","v":""},{"$f":"REK!K45","v":""},{"$f":"REK!L45","v":""},"",""]
[{"$f":"REK!B46","v":""},{"$f":"REK!C46","v":""},{"$f":"REK!D46","v":""},{"$f":"REK!E46","v":""},{"$f":"REK!F46","v":""},{"$f":"REK!G46","v":""},{"$f":"REK!H46","v":""},{"$f":"REK!I46","v":""},{"$f":"REK!J46","v":""},{"$f":"REK!K46","v":""},{"$f":"REK!L46","v":""},"",""]
[{"$f":"REK!B47","v":""},{"$f":"REK!C47","v":""},{"$f":"REK!D47","v":""},{"$f":"REK!E47","v":""},{"$f":"REK!F47","v":""},{"$f":"REK!G47","v":""},{"$f":"REK!H47","v":""},{"$f":"REK!I47","v":""},{"$f":"REK!J47","v":""},{"$f":"REK!K47","v":""},{"$f":"REK!L47","v":""},"",""]
[{"$f":"REK!B48","v":""},{"$f":"REK!C48","v":""},{"$f":"REK!D48","v":""},{"$f":"REK!E48","v":""},{"$f":"REK!F48","v":""},{"$f":"REK!G48","v":""},{"$f":"REK!H48","v":""},{"$f":"REK!I48","v":""},{"$f":"REK!J48","v":""},{"$f":"REK!K48","v":""},{"$f":"REK!L48","v":""},"",""]

{"sheet":"PET","index":16,"n_rows":75,"n_cols":10,"rows_kept":75,"cut":false,"hidden":false,"merged":[[1,1,1,12],[31,4,31,12],[32,4,32,12],[33,4,33,12],[74,0,74,13],[38,4,38,12],[39,4,39,12],[40,4,40,12],[72,2,73,12]]}
[null,"PETUNJUK PENGGUNAAN"]
[null,"Aplikasi ini gratis, silahkan dipakai, dimodifikasi, maupun diklaim buatan sekolah anda\nyang penting sebarkan ilmu ini ke sekolah-sekolah lainnya yang membutuhkan.\n(jika kesulitan silahkan hubungi admin sekolah atau website sekolah)"]
[]
[null,"1.","Pada saat pertama kali dibuka, maka akan muncul tampilan sbb:"]
[]
[]
[null,null,"klik pada tulisan Options, kemudian berikan pilihan pada Enable this content, dan terakhir klik OK"]
[]
[]
[]
[]
[]
[]
[]
[]
[]
[]
[]
[]
[]
[]
[null,"2.","Isikan identitas Sekolah dan Data Guru melalui menu"]
[null,null,"Isikan kolom-kolom yang berwarna biru muda untuk:"]
[null,null,"a. Identitas Sekolah"]
[null,null,"b. Nama guru mata pelajaran"]
[null,null,"c. Nama kelas dan wali kelasnya"]
[null,null,"d. Nama mata pelajaran"]
[]
[null,"3.","Isikan Deskripsi melalui menu"]
[null,null,"a. Deskripsi untuk Pengetahuan yang diambilkan dari KI-3"]
[null,null,null,"Isikan secara garis besar dari KI-3 tersebut, misalnya: dalam Kimia SMA untuk KI-3 tertulis sbb:"]
[null,null,null,"3.2","Menganalisis perkembangan model atom."]
[null,null,null,"3.3","Menganalisis struktur atom berdasarkan teori atom Bohr dan teori mekanika kuantum."]
[null,null,null,"3.4","Menganalisis hubungan konfigurasi elektron dan diagram orbital untuk menentukan letak unsur dalam tabel periodik dan sifat-sifat periodik unsur."]
[null,null,null,"Garis besar dari KI-3 tersebut adalah \" Model Atom dan Struktur Atom\""]
[]
[null,null,"b. Deskripsi untuk Ketrampilan yang diambilkan dari KI-4"]
[null,null,null,"Isikan secara garis besar dari KI-4 tersebut, misalnya: dalam Kimia SMA untuk KI-4 tertulis sbb:"]
[null,null,null,"4.2","Mengolah dan menganalisis perkembangan model atom."]
[null,null,null,"4.3","Mengolah dan menganalisis struktur atom berdasarkan teori atom Bohr dan teori mekanika kuantum."]
[null,null,null,"4.4","Menyajikan hasil analisis hubungan konfigurasi elektron dan diagram orbital untuk menentukan  letak unsur dalam tabel periodik dan sifat-sifat periodik unsur."]
[null,null,null,"Garis besar dari KI-4 tersebut adalah \" Menganalisis model atom, struktur atom, dan tabel periodik\""]
[]
[null,null,"c. Deskripsi untuk Sikap Spiritual dan Sikap Sosial yang diambilkan dari KI-1 dan KI-2"]
[null,null,null,"Sikap Spiritual",null,null,null,null,null,"Sikap Sosial"]
[null,null,null,"♥ doa sebelum dan sesudah melakukan sesuatu",null,null,null,null,null,"♥ Jujur"]
[null,null,null,"♥ rasa syukur setelah berhasil mengerjakan sesuatu",null,null,null,null,null,"♥ Disiplin"]
[null,null,null,"♥ salam sebelum dan sesudah menyampaikan pendapat",null,null,null,null,null,"♥ Tanggung Jawab"]
[null,null,null,"♥ ibadah tepat waktu",null,null,null,null,null,"♥ Toleransi"]
[null,null,null,"♥ rasa keimanan setelah mempelajari Iptek",null,null,null,null,null,"♥ Gotong Royong"]
[null,null,null,null,null,null,null,null,null,"♥ Santun"]
[null,null,null,null,null,null,null,null,null,"♥ Percaya Diri"]
[]
[null,"4.","Isikan Data Siswa melalui menu"]
[null,null,"a. Copykan data siswa dari file excel lain, dimulai dari NIS, Nama dan Jenis Kelamin"]
[null,null,"b. Letakan pada cell yang sesuai, kemudian klik \"PASTE VALUES\""]
[null,null,"c. Ketikan secara manual kelasnya di Cell F15 (hanya Sekali saja lainnya akan terisi otomatis)"]
[null,null,"d. Isikan jumlah hari efektif dalam semester ini"]
[null,null,"e. Pilih Kode guru"]
[null,null,"f. Pilih kode mapel"]
[null,null,"g. Isikan alokasi jam mengajar per minggunya"]
[null,null,"h. Isikan jumlah pertemuan seharusnya dalam semester ini"]
[null,null,"PERHATIKAN :"]
[null,null,null,"Pada Nama File seharusnya dan Nama File Sebelum dirubah apakah sudah sama atau tidak. Jika tidak"]
[null,null,null,"maka program ini tidak akan bisa dipakai secara otomatis."]
[]
[null,null,"Cara menyamakan:"]
[null,null,"a. Catat pada selembar kertas nama file seharusnya."]
[null,null,"b. Tutup dan keluarkan file excel yang saat ini anda buka"]
[null,null,"c. Gunakan dengan windows explorer, kemudian rubah nama file sesuai catatan di langkah (a)"]
[null,null,"d. Buka kembali file tersebut. Jika Benar, maka tulisan disampingnya akan berbunyi \"Sudah Sama\""]
[]
[null,null,"Langkah lainnya anda tinggal masuk menu utama, \nkemudian pilih atau klik tombol menu yang akan anda isikan"]
[]
["Copyright 2013 by Drs. SUPRIYANTO (SMA Muhammadiyah Wonosobo) 30 Nopember 2013"]

{"sheet":"FormNDS","index":17,"n_rows":79,"n_cols":7,"rows_kept":79,"cut":false,"hidden":false,"merged":[[23,4,23,6],[24,4,24,6],[25,4,25,6],[26,4,26,6],[27,4,27,6],[28,4,28,6],[62,4,62,6],[63,4,63,6],[64,4,64,6],[65,4,65,6],[34,5,34,6],[35,5,35,6],[36,5,36,6],[37,5,37,6],[38,5,38,6],[39,5,39,6],[41,5,41,6],[42,5,42,6],[43,5,43,6],[44,5,44,6],[66,4,66,6],[67,4,67,6],[46,4,46,6],[47,4,47,6],[48,4,48,6],[49,4,49,6],[50,4,50,6],[51,4,51,6],[30,1,31,1],[30,2,31,2],[30,3,30,4],[53,1,54,1],[53,2,54,2],[53,3,53,6],[30,5,31,6],[32,5,32,6],[33,5,33,6],[41,1,41,2],[42,1,42,2],[43,1,43,2],[44,1,44,2]]}
[null,"FORMULIR PENILAIAN DIRI "]
[]
[]
[]
[]
[]
[]
[]
[]
[null,"No","Pernyataan","TP","KD","SR","SL"]
[null,1,"Saya tambah yakin dengan keberadaan Tuhan setelah mempelajari ilmu pengetahuan"]
[null,2,"Saya berdoa sebelum dan sesudah melakukan sesuatu kegiatan"]
[null,3,"Saya mengucapkan rasa syukur atas segala karunia Tuhan sesuai dengan agama saya"]
[null,4,"Saya memberi salam sebelum dan sesudah mengungkapkan pendapat di depan umum sesuai dengan agama saya"]
[null,5,"Saya mengungkapkan keagungan Tuhan apabila melihat kebesaranNya sesuai dengan agama saya"]
[]
[null,"No","Pernyataan","TP","KD","SR","SL"]
[null,1,"Saya menyontek pada saat mengerjakan Ulangan"]
[null,2,"Saya menyalin karya orang lain tanpa menyebutkan sumbernya pada saat mengerjakan tugas"]
[null,3,"Saya melaporkan kepada yang berwenang jika menemukan barang"]
[null,4,"Saya berani mengakui kesalahan yang dilakukan"]
[null,5,"Saya mengerjakan soal ujian tanpa melihat jawaban teman yang lain"]
[]
[null,"No","Pernyataan","Sikap","Alasan"]
[null,1,"Sebagai siswa saya melakukan tugas- tugas dengan baik"]
[null,2,"Saya berani menerima resiko atas tindakan yang dilakukan"]
[null,3,"Saya menuduh orang lain tanpa bukti"]
[null,4,"Saya mau mengembalikan barang yang dipinjam dari orang lain"]
[null,5,"Saya berani meminta maaf jika melakukan kesalahan yang merugikan orang lain"]
[]
[null,"No","Pernyataan","Melakukan",null,"Keterangan"]
[null,null,null,"Ya","Tidak"]
[null,1,"Saya masuk kelas tepat waktu"]
[null,2,"Saya mengumpulkan tugas tepat waktu"]
[null,3,"Saya memakai seragam sesuai tata tertib"]
[null,4,"Saya mengerjakan tugas yang diberikan"]
[null,5,"Saya tertib dalam mengikuti pembelajaran"]
[null,6,"Saya mengikuti praktikum sesuai dengan langkah yang ditetapkan"]
[null,7,"Saya membawa buku tulis sesuai mata pelajaran"]
[null,8,"Saya membawa buku teks mata pelajaran"]
[]
[null,"Rela berbagi",null,null,null,"Pelit"]
[null,"Aktif",null,null,null,"Pasif"]
[null,"Bekerja sama",null,null,null,"Egois"]
[null,"Iklas",null,null,null,"Pamrih"]
[]
[null,"No","Pernyataan","Sikap","Alasan"]
[null,1,"Saya marah dengan teman yang berbeda pendapat"]
[null,2,"Saya menghormati teman yang berbeda agama, ras, gender, budaya, suku"]
[null,3,"Saya mau melakukan apa yang sudah menjadi kesepakatan bersama"]
[null,4,"Saya menerima dan menghargai kekurangan orang lain"]
[null,5,"Saya memaafkan kesalahan orang lain dengan iklas"]
[]
[null,"No","Pernyataan","Penilaian"]
[null,null,null,"STS","TS","S","SS"]
[null,1,"Saya menghormasti orang yang lebih tua"]
[null,2,"Saya tidak berkata kata kotor, kasardan takabur"]
[null,3,"Saya meludah di tempatsembarangan"]
[null,4,"Saya tidak menyela pembicaraan"]
[null,5,"Saya mengucapkan terima kasih saat menerima bantuan dari orang lain"]
[null,6,"Saya tersenyum, menyapa, memberi salam kepada orang yang ada di sekitar kita"]
[]
[null,"No","Pernyataan","Sikap","Alasan"]
[null,1,"Saya melakukan segala sesuatu tanpa ragu-ragu"]
[null,2,"Saya berani mengambil keputusan secara cepat dan bisa dipertanggungjawabkan"]
[null,3,"Saya tidak mudah putus asa"]
[null,4,"Saya berani menunjukkan kemampuan yang dimiliki di depan orang banyak"]
[null,5,"Saya berani mencoba hal-hal yang baru"]
[]
[null,"KETERANGAN:"]
[null,"SL","= Selalu, apabila selalu melakukan sesuai pernyataan"]
[null,"SR ","= Sering, apabila sering melakukan sesuai pernyataan dan kadang- kadang tidak melakukan"]
[null,"KD ","= Kadang-kadang, apabila kadang-kadang melakukan dan sering tidak melakukan"]
[null,"TP ","= Tidak Pernah, apabila tidak pernah melakukan"]
[]
[null,"STS","= Sangat Tidak Setuju"]
[null,"TS","= Tidak Setuju"]
[null,"S","= Setuju"]
[null,"SS","= Sangat Setuju"]

{"sheet":"FormNAT","index":18,"n_rows":55,"n_cols":6,"rows_kept":55,"cut":false,"hidden":false,"merged":[[8,0,9,0],[8,1,9,1],[8,2,8,5]]}
["FORMULIR PENILAIAN ANTAR TEMAN"]
[]
[null,null,null,"4 = Selalu"]
[null,null,null,"3 = Sering"]
[null,null,null,"2 = Jarang"]
[null,null,null,"1 = Tidak Pernah"]
[]
["Berilah tanda cek pada kolom pilihan berikut dengan"]
["No","Aspek yang Diamati","Skor"]
[null,null,1,2,3,4]
[]
[1,"Tidak nyontek dalam mengerjakan ujian/ulangan"]
[2,"Tidak melakukan plagiat (mengambil /menyalin karya orang lain tanpa menyebutkan sumber) dalam mengerjakan setiap tugas"]
[3,"Mengemukakan perasaan terhadap sesuatu apa adanya"]
[4,"Melaporkan data atau informasi apa adanya"]
[]
[1,"Mengakui kesalahan atau kekurangan yang dimiliki"]
[2,"Masuk kelas tepat waktu"]
[3,"Mengumpulkan tugas tepat waktu"]
[4,"Memakai seragam sesuai tata tertib"]
[5,"Mengerjakan tugas yang diberikan"]
[6,"Tertib dalam mengikuti pembelajaran"]
[7,"Mengikuti praktikum sesuai dengan langkah yang ditetapkan"]
[8,"Membawa buku tulis sesuai mata pelajaran"]
[9,"Membawa buku teks mata pelajaran"]
[]
[1,"Melaksanakan tugas individu dengan baik"]
[2,"Menerima resiko dari tindakan yang dilakukan"]
[3,"Tidak menuduh orang lain tanpa bukti yang akurat"]
[4,"Mengembalikan barang yang dipinjam"]
[5,"Meminta maaf atas kesalahan yang dilakukan"]
[]
[1,"Menghormati pendapat teman"]
[2,"Menghormati teman yang berbeda suku, agama, ras, budaya, dan gender"]
[3,"Menerima kesepakatan meskipun berbeda dengan pendapatnya"]
[4,"Menerima kekurangan orang lain"]
[5,"Memaafkan kesalahan orang lain"]
[]
[1,"Aktif dalam kerja kelompok"]
[2,"Suka menolong teman/orang lain"]
[3,"Kesediaan melakukan tugas sesuai kesepakatan"]
[4,"Rela berkorban untuk orang lain"]
[]
[1,"Menghormati orang yang lebih tua"]
[2,"Mengucapkan terima kasih setelah menerima bantuan orang lain"]
[3,"Menggunakan bahasa santun saat menyampaikan pendapat"]
[4,"Menggunakan bahasa santun saat mengkritik pendapat teman"]
[5,"Bersikap 3S (salam, senyum, sapa) saat bertemu orang lain"]
[]
[1,"Berani presentasi di depan kelas"]
[2,"Berani berpendapat, bertanya, dan menjawab pertanyaan"]
[3,"Berpendapat atau melakukan kegiatan tanpa ragu-ragu"]
[4,"Mampu membuat keputusan dengan cepat"]
[5,"Tidak mudah putus asa/pantang menyerah"]
[null,"JUMLAH"]