{"text_format":"1","workbook":"xlsx","n_sheets":14,"sheets":["DATASK","RUMUS","SK1516","LPT1516","LPJ1516","DTPERSON1516","SK1617","LPJ1617","LPT1617","DTPERSON1617","DTPERSON1718","SK1718","LPT1718","LPJ1718"],"not_rendered":{"charts":0,"images":1,"macros":1,"external_links":1,"defined_names":12,"comments":0,"pivot_tables":0},"unopened":[],"bounds":{"document_bytes":16777216,"sheet_cells":100000,"rows_first":2000,"rows_last":500,"rows_between":2000,"halvings":0,"cell_chars":16384,"cell_head_chars":4096},"cells_cut":0,"cells_raw":0,"read":"whole","date_system":"1900"}

{"sheet":"DATASK","index":0,"n_rows":28,"n_cols":5,"rows_kept":28,"cut":false,"hidden":false,"merged":[]}
["Tahun Pelajaran",":","2017/2018"]
[]
["Nama Sekolah",null,"MI NURUL ISLAM LABRUK KIDUL"]
[]
["Nama KS",null,"SAHRONI,S.Pd.I"]
[]
["JABATAN YANG DI SK",null,"Kepala Tata Usaha","No. SK","004/MINI.L-Kid/ 30.02.02/SK/VII/2017"]
[]
[null,null,"Staff Tata Usaha",null,"004/MINI.L-Kid/ 30.02.02/SK/VII/2017"]
[]
[null,null,"PKM. Kurikulum",null,"004/MINI.L-Kid/ 30.02.02/SK/VII/2017"]
[]
[null,null,"Bendahara Madrasah",null,"004/MINI.L-Kid/ 30.02.02/SK/VII/2017"]
[]
[null,null,"PKM. Kesiswaan",null,"004/MINI.L-Kid/ 30.02.02/SK/VII/2017"]
{"$rows_left_out":14}
{"sheet":"RUMUS","index":1,"n_rows":19,"n_cols":9,"rows_kept":19,"cut":false,"hidden":false,"merged":[[2,2,2,4]]}
[]
[]
[null,null,"TAHUN PELAJARAN",null,null,null,null,"Guru","Kegiatan Belajar Mengajar perlu ditetapkan"]
[null,null,"2007","2008",{"$f":"C4&\"/\"&D4","v":"2007/2008"},null,null,"Ka TU","Administrasi Kegiatan Belajar Mengajar perlu ditetapkan"]
[null,null,"2008","2009",{"$f":"C5&\"/\"&D5","v":"2008/2009"},null,null,"Staff TU","Administrasi Kegiatan Belajar Mengajar perlu ditetapkan"]
[null,null,"2009","2010","2009/2010",null,null,"sarpras","Sarana dan Prasarana Belajar Mengajar perlu ditetapkan"]
[null,null,"2010","2011","2010/2011",null,null,"kesiswaan","Ketertiban dan kedisiplinan Belajar Mengajar perlu ditetapkan"]
[null,null,"2011","2012","2011/2012",null,null,"keuangan","pengelolahan Keuangan BOS perlu ditetapkan"]
[null,null,"2012","2013","2012/2013",null,null,"Humas","Hubungan Kegiatan Madrasah dan Masyarakat perlu ditetapkan"]
[null,null,"2013","2014","2013/2014",null,null,"ko tilwt","Kegiatan Belajar Mengajar Alquran Metode tilawati perlu ditetapkan"]
[null,null,"2014","2015","2014/2015"]
[null,null,"2015","2016","2015/2016"]
[null,null,"2016","2017","2016/2017"]
[null,null,"2017","2018","2017/2018"]
[null,null,"2018","2019","2018/2019"]
{"$rows_left_out":5}
{"sheet":"SK1516","index":2,"n_rows":49,"n_cols":8,"rows_kept":49,"cut":false,"hidden":false,"merged":[[17,3,17,5],[18,3,18,5],[23,3,23,5],[30,0,30,5],[37,3,37,5],[14,0,14,5],[8,0,8,5],[9,0,9,5],[11,0,11,5],[12,0,12,5],[13,0,13,5]]}
[]
[]
[]
[]
[]
[]
[]
[null,null,null,null,null,null,null,5]
["SURAT KEPUTUSAN KEPALA MI.NURUL ISLAM LABRUK KIDUL"]
[{"$f":"\"NOMOR : \"&VLOOKUP('SK1516'!H8,DTPERSON1516!A5:I44,8)&VLOOKUP('SK1516'!H8,DTPERSON1516!A5:I44,9)","v":"NOMOR : 008/MINI.L-Kid/ 30.02.02/SK/VII/2015"},null,null,null,null,null,null,{"$f":"VLOOKUP('SK1516'!H8,DTPERSON1516!A5:I44,7)","v":"Guru"}]
[]
["TENTANG"]
[{"$f":"\"PENGANGKATAN \"&UPPER(VLOOKUP('SK1516'!H8,DTPERSON1516!A5:I44,6))","v":"PENGANGKATAN TENAGA PENDIDIK"}]
["DI LINGKUNGAN LEMBAGA PENDIDIKAN MA’ARIF NU"]
[{"$f":"\"Tahun Pelajaran \"&DTPERSON1516!C45","v":"Tahun Pelajaran 2015/2016"}]
{"$rows_left_out":35}
{"sheet":"LPT1516","index":3,"n_rows":55,"n_cols":9,"rows_kept":55,"cut":false,"hidden":false,"merged":[[35,5,35,6],[16,5,16,6],[18,5,29,6],[30,5,30,6],[31,5,31,6],[32,5,32,6],[33,5,33,6],[9,5,15,6],[4,0,5,0],[4,1,5,2],[4,3,5,4],[4,5,5,6],[6,5,7,6]]}
["Lampiran 1 ",null,": SK Kepala MIS. Nurul Islam Labruk Kidul"]
["Nomor",null,": 001/MINI.L-Kid/30.02.02/SK.S.1-0/VII/2017"]
["Tanggal",null,{"$f":"\": \"&\"15 Juli 2017\"","v":": 15 Juli 2017"},null,null,null,null,null,"2016-06-11"]
[]
["NO","N A M A",null,"JENIS TUGAS",null,"KETERANGAN"]
[]
["01","KEPALA MADRASAH"]
[null,"1. SAHRONI,S.Pd.I",null,"Ø","Kepala Madrasah"]
["02","PEMBANTU KEPALA MADRASAH"]
[null,"2.1.AZAN TUDHONI, S.Pd",null,"Ø","PKM Kesiswaan","Membantu Kepala Madrasah"]
[null,"2.2. NURUL HIDAYAH, S.Pd.I. MA",null,"Ø","PKM Tenaga Kependidikan"]
[null,"2.3. NUR RATNA PRIHATININGSIH, S.Pd",null,"Ø","PKM Kurikulum"]
[null,"2.4. KHUSNUL ADIBAH, S.Pd.I",null,"Ø","PKM Sarana Prasarana"]
[null,"2.5. AHMAD SHODIQ, SH",null,"Ø","PKM. Humas"]
["03","BENDAHARA"]
{"$rows_left_out":41}
{"sheet":"LPJ1516","index":4,"n_rows":166,"n_cols":21,"rows_kept":166,"cut":false,"hidden":false,"merged":[[157,0,157,4],[151,0,152,0],[151,1,152,2],[151,3,152,3],[151,20,152,20],[153,0,154,0],[153,1,154,2],[153,3,154,3],[153,20,154,20],[148,3,150,3],[148,20,150,20],[129,0,138,0],[129,3,138,3],[129,20,138,20],[132,1,132,2],[133,1,133,2],[134,1,134,2],[139,0,147,0],[139,3,147,3],[139,20,147,20],[143,1,143,2],[144,1,144,2],[109,0,118,0],[109,3,118,3],[109,20,118,20],[113,1,113,2],[119,0,128,0],[119,3,128,3],[119,20,128,20],[124,1,124,2],[89,0,98,0],[89,20,98,20],[93,1,93,2],[99,0,108,0],[99,3,108,3],[99,20,108,20],[103,1,103,2],[104,1,104,2],[67,0,77,0],[67,3,77,3],[67,20,77,20],[72,1,72,2],[73,1,73,2],[78,0,88,0],[78,20,88,20],[83,1,83,2],[83,3,87,3],[84,1,84,2],[45,0,55,0],[45,3,55,3],[45,20,55,20],[50,1,50,2],[51,1,51,2],[56,0,66,0],[56,3,66,3],[56,20,66,20],[61,1,61,2],[62,1,62,2],[34,0,44,0],[34,3,44,3],[34,20,44,20],[9,1,9,2],[10,0,11,0],[10,1,11,2],[10,3,11,3],[10,20,11,20],[12,0,22,0],[12,3,22,3],[12,20,22,20],[23,0,33,0],[23,3,33,3],[23,20,33,20],[28,1,28,2],[29,1,29,2],[4,0,4,20],[5,0,5,20],[6,0,6,20],[7,0,8,0],[7,1,8,2],[7,4,8,4],[7,5,7,17],[7,18,8,18],[7,19,8,19],[7,20,8,20]]}
["Lampiran 2",null,{"$f":"[1]Tugas!C1","v":": SK Kepala MIS. Nurul Islam Labruk Kidul"}]
["Nomor",null,{"$f":"[1]Tugas!C2","v":": 001/MINI.L-Kid/30.02.02/SK.S.1-0/VII/2017"}]
["Tanggal",null,{"$f":"[1]Tugas!C3","v":": 15 Juli 2017"}]
[]
["DATA TUGAS MENGAJAR DAN JUMLAH JAM MENGAJAR"]
["MI. MA'ARIF NU NURUL ISLAM LABRUK KIDUL - SUMBERSUKO"]
["TAHUN PELAJARAN 2017/2018"]
["NO","NAMA GURU",null,"KD","TUGAS MENGAJAR","Jumlah Jam Dalam Kelas",null,null,null,null,null,null,null,null,null,null,null,null,"KS","JML JAM PER-BDG STUDI","JML JAM TOTAL"]
[null,null,null,"GURU",null,"1a","1b","1c","2a","2b","3a","3b","4a","4b","5a","5b","6a","6b"]
[1,"Sahroni, S.Pd.I",null,null,"Aswaja",null,null,null,null,null,null,null,null,null,null,null,2,2,18,{"$f":"SUM(F10:S10)","v":22},{"$f":"SUM(T10:T10)","v":22}]
[2,"M. Said",null,null,"B. Arab",null,null,null,null,null,null,null,2,2,2,2,2,2,null,12,{"$f":"SUM(T11:T12)","v":24}]
[null,null,null,null,"Nahwu/Shorof",null,null,null,null,null,null,null,2,2,2,2,2,2,null,12]
[3,null,null,null,"Matematika",4,null,null,null,null,null,null,null,null,null,null,null,null,null,4,{"$f":"SUM(F13:R23)","v":30}]
[null,null,null,null,"IPA/Sains",3,null,null,null,null,null,null,null,null,null,null,null,null,null,3]
[null,null,null,null,"B. Indonesia",4,null,null,null,null,null,null,null,null,null,null,null,null,null,4]
{"$rows_left_out":152}
{"sheet":"DTPERSON1516","index":5,"n_rows":72,"n_cols":9,"rows_kept":72,"cut":false,"hidden":false,"merged":[[0,0,0,6],[2,0,2,1],[44,2,44,4],[46,2,46,4],[48,2,48,4],[50,2,50,4],[52,2,52,4],[54,2,54,4],[56,2,56,4],[58,2,58,4],[69,2,69,4],[70,2,70,4],[71,2,71,4],[60,2,60,4],[62,2,62,4],[64,2,64,4],[66,2,66,4],[68,2,68,4]]}
["DATA PERSONAL",null,null,null,null,null,null,"2015/2016"]
[1,2,3,4,5,6,7,8,9]
[]
["No.","Nama","L/P","Tempat Lahir","Tanggal Lahir","Status","Jabatan","No. SK","KODE SK"]
[1,"M. Said","L","Lumajang","1966-06-23","Tenaga Pendidik","Guru","004","/MINI.L-Kid/ 30.02.02/SK/VII/2015"]
[2,"Sumarmi,S.Pd.I","P","Lumajang","1964-09-12","Tenaga Pendidik","Guru","005","/MINI.L-Kid/ 30.02.02/SK/VII/2015"]
[3,"Minuk Ika Wulandari,S.Pd,I","P","Lumajang","1979-04-14","Tenaga Pendidik","Guru","006","/MINI.L-Kid/ 30.02.02/SK/VII/2015"]
[4,"Chayul Mu'afa,S.Ag.","P","Lumajang","1977-04-15","Tenaga Pendidik","Guru","007","/MINI.L-Kid/ 30.02.02/SK/VII/2015"]
[5,"Khusnul Adibah,S.Pd.I","P","Lumajang","1968-10-03","Tenaga Pendidik","Guru","008","/MINI.L-Kid/ 30.02.02/SK/VII/2015"]
[6,"Muhammad Khoiri,S.Pd.I.","L","Lumajang","1978-05-03","Tenaga Pendidik","Guru","009","/MINI.L-Kid/ 30.02.02/SK/VII/2015"]
[7,"Yuliana,S.Pd.I","P","Lumajang","1986-10-24","Tenaga Pendidik","Guru","010","/MINI.L-Kid/ 30.02.02/SK/VII/2015"]
[8,"Ahmad Shodiq,S.H.","L","Lumajang","1977-05-15","Tenaga Pendidik","Guru","011","/MINI.L-Kid/ 30.02.02/SK/VII/2015"]
[9,"Chusni Kurniawan,S.Pd.","L","Lumajang","1987-03-09","Tenaga Pendidik","Guru","012","/MINI.L-Kid/ 30.02.02/SK/VII/2015"]
[10,"M. Zuhdi Agus Riyanto,S.Pd.","L","Jember","1975-08-23","Tenaga Pendidik","Guru","013","/MINI.L-Kid/ 30.02.02/SK/VII/2015"]
[11,"Liya Shobihatul Qudriyah,S.Pd","P","Lumajang","1990-04-25","Tenaga Pendidik","Guru","014","/MINI.L-Kid/ 30.02.02/SK/VII/2015"]
{"$rows_left_out":58}
{"sheet":"SK1617","index":6,"n_rows":49,"n_cols":8,"rows_kept":49,"cut":false,"hidden":false,"merged":[[17,3,17,5],[18,3,18,5],[23,3,23,5],[30,0,30,5],[37,3,37,5],[14,0,14,5],[8,0,8,5],[9,0,9,5],[11,0,11,5],[12,0,12,5],[13,0,13,5]]}
[]
[]
[]
[]
[]
[]
[]
[null,null,null,null,null,null,null,5]
["SURAT KEPUTUSAN KEPALA MI.NURUL ISLAM LABRUK KIDUL"]
[{"$f":"\"NOMOR : \"&VLOOKUP('SK1617'!H8,DTPERSON1617!A5:I44,8)&VLOOKUP('SK1617'!H8,DTPERSON1617!A5:I44,9)","v":"NOMOR : 008/MINI.L-Kid/ 30.02.02/SK/VII/2016"},null,null,null,null,null,null,{"$f":"VLOOKUP('SK1617'!H8,DTPERSON1617!A5:I44,7)","v":"Guru"}]
[]
["TENTANG"]
[{"$f":"\"PENGANGKATAN \"&UPPER(VLOOKUP('SK1617'!H8,DTPERSON1617!A5:I44,6))","v":"PENGANGKATAN TENAGA PENDIDIK"}]
["DI LINGKUNGAN LEMBAGA PENDIDIKAN MA’ARIF NU"]
[{"$f":"\"Tahun Pelajaran \"&DTPERSON1617!C45","v":"Tahun Pelajaran 2016/2017"}]
{"$rows_left_out":35}
{"sheet":"LPJ1617","index":7,"n_rows":166,"n_cols":21,"rows_kept":166,"cut":false,"hidden":false,"merged":[[157,0,157,4],[151,0,152,0],[151,1,152,2],[151,3,152,3],[151,20,152,20],[153,0,154,0],[153,1,154,2],[153,3,154,3],[153,20,154,20],[148,3,150,3],[148,20,150,20],[129,0,138,0],[129,3,138,3],[129,20,138,20],[132,1,132,2],[133,1,133,2],[134,1,134,2],[139,0,147,0],[139,3,147,3],[139,20,147,20],[143,1,143,2],[144,1,144,2],[109,0,118,0],[109,3,118,3],[109,20,118,20],[113,1,113,2],[119,0,128,0],[119,3,128,3],[119,20,128,20],[124,1,124,2],[89,0,98,0],[89,20,98,20],[93,1,93,2],[99,0,108,0],[99,3,108,3],[99,20,108,20],[103,1,103,2],[104,1,104,2],[67,0,77,0],[67,3,77,3],[67,20,77,20],[72,1,72,2],[73,1,73,2],[78,0,88,0],[78,20,88,20],[83,1,83,2],[83,3,87,3],[84,1,84,2],[45,0,55,0],[45,3,55,3],[45,20,55,20],[50,1,50,2],[51,1,51,2],[56,0,66,0],[56,3,66,3],[56,20,66,20],[61,1,61,2],[62,1,62,2],[34,0,44,0],[34,3,44,3],[34,20,44,20],[9,1,9,2],[10,0,11,0],[10,1,11,2],[10,3,11,3],[10,20,11,20],[12,0,22,0],[12,3,22,3],[12,20,22,20],[23,0,33,0],[23,3,33,3],[23,20,33,20],[28,1,28,2],[29,1,29,2],[4,0,4,20],[5,0,5,20],[6,0,6,20],[7,0,8,0],[7,1,8,2],[7,4,8,4],[7,5,7,17],[7,18,8,18],[7,19,8,19],[7,20,8,20]]}
["Lampiran 2",null,{"$f":"[1]Tugas!C1","v":": SK Kepala MIS. Nurul Islam Labruk Kidul"}]
["Nomor",null,{"$f":"[1]Tugas!C2","v":": 001/MINI.L-Kid/30.02.02/SK.S.1-0/VII/2017"}]
["Tanggal",null,{"$f":"[1]Tugas!C3","v":": 15 Juli 2017"}]
[]
["DATA TUGAS MENGAJAR DAN JUMLAH JAM MENGAJAR"]
["MI. MA'ARIF NU NURUL ISLAM LABRUK KIDUL - SUMBERSUKO"]
["TAHUN PELAJARAN 2017/2018"]
["NO","NAMA GURU",null,"KD","TUGAS MENGAJAR","Jumlah Jam Dalam Kelas",null,null,null,null,null,null,null,null,null,null,null,null,"KS","JML JAM PER-BDG STUDI","JML JAM TOTAL"]
[null,null,null,"GURU",null,"1a","1b","1c","2a","2b","3a","3b","4a","4b","5a","5b","6a","6b"]
[1,"Sahroni, S.Pd.I",null,null,"Aswaja",null,null,null,null,null,null,null,null,null,null,null,2,2,18,{"$f":"SUM(F10:S10)","v":22},{"$f":"SUM(T10:T10)","v":22}]
[2,"M. Said",null,null,"B. Arab",null,null,null,null,null,null,null,2,2,2,2,2,2,null,12,{"$f":"SUM(T11:T12)","v":24}]
[null,null,null,null,"Nahwu/Shorof",null,null,null,null,null,null,null,2,2,2,2,2,2,null,12]
[3,null,null,null,"Matematika",4,null,null,null,null,null,null,null,null,null,null,null,null,null,4,{"$f":"SUM(F13:R23)","v":30}]
[null,null,null,null,"IPA/Sains",3,null,null,null,null,null,null,null,null,null,null,null,null,null,3]
[null,null,null,null,"B. Indonesia",4,null,null,null,null,null,null,null,null,null,null,null,null,null,4]
{"$rows_left_out":152}
{"sheet":"LPT1617","index":8,"n_rows":55,"n_cols":9,"rows_kept":55,"cut":false,"hidden":false,"merged":[[35,5,35,6],[16,5,16,6],[18,5,29,6],[30,5,30,6],[31,5,31,6],[32,5,32,6],[33,5,33,6],[9,5,15,6],[4,0,5,0],[4,1,5,2],[4,3,5,4],[4,5,5,6],[6,5,7,6]]}
["Lampiran 1 ",null,": SK Kepala MIS. Nurul Islam Labruk Kidul"]
["Nomor",null,": 001/MINI.L-Kid/30.02.02/SK.S.1-0/VII/2017"]
["Tanggal",null,{"$f":"\": \"&\"15 Juli 2017\"","v":": 15 Juli 2017"},null,null,null,null,null,"2016-06-11"]
[]
["NO","N A M A",null,"JENIS TUGAS",null,"KETERANGAN"]
[]
["01","KEPALA MADRASAH"]
[null,"1. SAHRONI,S.Pd.I",null,"Ø","Kepala Madrasah"]
["02","PEMBANTU KEPALA MADRASAH"]
[null,"2.1.AZAN TUDHONI, S.Pd",null,"Ø","PKM Kesiswaan","Membantu Kepala Madrasah"]
[null,"2.2. NURUL HIDAYAH, S.Pd.I. MA",null,"Ø","PKM Tenaga Kependidikan"]
[null,"2.3. NUR RATNA PRIHATININGSIH, S.Pd",null,"Ø","PKM Kurikulum"]
[null,"2.4. KHUSNUL ADIBAH, S.Pd.I",null,"Ø","PKM Sarana Prasarana"]
[null,"2.5. AHMAD SHODIQ, SH",null,"Ø","PKM. Humas"]
["03","BENDAHARA"]
{"$rows_left_out":41}
{"sheet":"DTPERSON1617","index":9,"n_rows":72,"n_cols":9,"rows_kept":72,"cut":false,"hidden":false,"merged":[[2,0,2,1],[0,0,0,6],[44,2,44,4],[46,2,46,4],[48,2,48,4],[50,2,50,4],[52,2,52,4],[54,2,54,4],[56,2,56,4],[58,2,58,4],[69,2,69,4],[70,2,70,4],[71,2,71,4],[60,2,60,4],[62,2,62,4],[64,2,64,4],[66,2,66,4],[68,2,68,4]]}
["DATA PERSONAL",null,null,null,null,null,null,"2018/2019"]
[1,2,3,4,5,6,7,8,9]
[]
["No.","Nama","L/P","Tempat Lahir","Tanggal Lahir","Status","Jabatan","No. SK","KODE SK"]
[1,"M. Said","L","Lumajang","1966-06-23","Tenaga Pendidik","Guru","004","/MINI.L-Kid/ 30.02.02/SK/VII/2016"]
[2,"Sumarmi,S.Pd.I","P","Lumajang","1964-09-12","Tenaga Pendidik","Guru","005","/MINI.L-Kid/ 30.02.02/SK/VII/2016"]
[3,"Minuk Ika Wulandari,S.Pd,I","P","Lumajang","1979-04-14","Tenaga Pendidik","Guru","006","/MINI.L-Kid/ 30.02.02/SK/VII/2016"]
[4,"Chayul Mu'afa,S.Ag.","P","Lumajang","1977-04-15","Tenaga Pendidik","Guru","007","/MINI.L-Kid/ 30.02.02/SK/VII/2016"]
[5,"Khusnul Adibah,S.Pd.I","P","Lumajang","1968-10-03","Tenaga Pendidik","Guru","008","/MINI.L-Kid/ 30.02.02/SK/VII/2016"]
[6,"Muhammad Khoiri,S.Pd.I.","L","Lumajang","1978-05-03","Tenaga Pendidik","Guru","009","/MINI.L-Kid/ 30.02.02/SK/VII/2016"]
[7,"Yuliana,S.Pd.I","P","Lumajang","1986-10-24","Tenaga Pendidik","Guru","010","/MINI.L-Kid/ 30.02.02/SK/VII/2016"]
[8,"Ahmad Shodiq,S.H.","L","Lumajang","1977-05-15","Tenaga Pendidik","Guru","011","/MINI.L-Kid/ 30.02.02/SK/VII/2016"]
[9,"Chusni Kurniawan,S.Pd.","L","Lumajang","1987-03-09","Tenaga Pendidik","Guru","012","/MINI.L-Kid/ 30.02.02/SK/VII/2016"]
[10,"M. Zuhdi Agus Riyanto,S.Pd.","L","Jember","1975-08-23","Tenaga Pendidik","Guru","013","/MINI.L-Kid/ 30.02.02/SK/VII/2016"]
[11,"Liya Shobihatul Qudriyah,S.Pd","P","Lumajang","1990-04-25","Tenaga Pendidik","Guru","014","/MINI.L-Kid/ 30.02.02/SK/VII/2016"]
{"$rows_left_out":58}
{"sheet":"DTPERSON1718","index":10,"n_rows":73,"n_cols":9,"rows_kept":73,"cut":false,"hidden":false,"merged":[[67,1,67,2],[68,7,68,8],[69,7,69,8],[52,2,52,4],[54,2,54,4],[56,2,56,4],[58,2,58,4],[60,2,60,4],[62,2,62,4],[64,2,64,4],[66,2,66,4],[50,2,50,4],[0,0,0,6],[2,0,2,1],[44,2,44,4],[46,2,46,4],[48,2,48,4]]}
["DATA PERSONAL",null,null,null,null,null,null,"2019/2020"]
[1,2,3,4,5,6,7,8,9]
[]
["No.","Nama","L/P","Tempat Lahir","Tanggal Lahir","Status","Jabatan","No. SK","KODE SK"]
[1,"M. Said","L","Lumajang","1966-06-23","Tenaga Pendidik","Guru","004","/MINI.L-Kid/ 30.02.02/SK/VII/2019"]
[2,"Sumarmi,S.Pd.I","P","Lumajang","1964-09-12","Tenaga Pendidik","Guru","005","/MINI.L-Kid/ 30.02.02/SK/VII/2019"]
[3,"Minuk Ika Wulandari,S.Pd,I","P","Lumajang","1979-04-14","Tenaga Pendidik","Guru","006","/MINI.L-Kid/ 30.02.02/SK/VII/2019"]
[4,"Chayul Mu'afa,S.Ag.","P","Lumajang","1977-04-15","Tenaga Pendidik","Guru","007","/MINI.L-Kid/ 30.02.02/SK/VII/2019"]
[5,"Khusnul Adibah,S.Pd.I","P","Lumajang","1968-10-03","Tenaga Pendidik","Guru","008","/MINI.L-Kid/ 30.02.02/SK/VII/2019"]
[6,"Muhammad Khoiri,S.Pd.I.","L","Lumajang","1978-05-03","Tenaga Pendidik","Guru","009","/MINI.L-Kid/ 30.02.02/SK/VII/2019"]
[7,"Yuliana,S.Pd.I","P","Lumajang","1986-10-24","Tenaga Pendidik","Guru","010","/MINI.L-Kid/ 30.02.02/SK/VII/2019"]
[8,"Ahmad Shodiq,S.H.","L","Lumajang","1977-05-15","Tenaga Pendidik","Guru","011","/MINI.L-Kid/ 30.02.02/SK/VII/2019"]
[9,"Chusni Kurniawan,S.Pd.","L","Lumajang","1987-03-09","Tenaga Pendidik","Guru","012","/MINI.L-Kid/ 30.02.02/SK/VII/2019"]
[10,"M. Zuhdi Agus Riyanto,S.Pd.","L","Jember","1975-08-23","Tenaga Pendidik","Guru","013","/MINI.L-Kid/ 30.02.02/SK/VII/2019"]
[11,"Liya Shobihatul Qudriyah,S.Pd","P","Lumajang","1990-04-25","Tenaga Pendidik","Guru","014","/MINI.L-Kid/ 30.02.02/SK/VII/2019"]
{"$rows_left_out":59}
{"sheet":"SK1718","index":11,"n_rows":49,"n_cols":8,"rows_kept":49,"cut":false,"hidden":false,"merged":[[8,7,9,7],[14,0,14,5],[17,3,17,5],[18,3,18,5],[23,3,23,5],[37,3,37,5],[30,0,30,5],[8,0,8,5],[9,0,9,5],[11,0,11,5],[12,0,12,5],[13,0,13,5]]}
[]
[]
[]
[]
[null,null,null,null,null,null,null,"SEMESTER"]
[null,null,null,null,null,null,null,1]
[]
[null,null,null,null,null,null,null,26]
["SURAT KEPUTUSAN KEPALA MI.NURUL ISLAM LABRUK KIDUL",null,null,null,null,null,null,"Guru Nomor"]
[{"$f":"\"Nomor \"&\": \"&VLOOKUP(H6,DTPERSON1718!C69:I70,6)","v":"Nomor : 001/MINI.L-Kid/30.02.02/SK.S.1-0/VII/2019"}]
[]
["TENTANG"]
[{"$f":"\"PENGANGKATAN \"&UPPER(VLOOKUP('SK1718'!H8,DTPERSON1718!A5:I44,6))","v":"PENGANGKATAN TENAGA KEPENDIDIKAN"}]
["DI LINGKUNGAN LEMBAGA PENDIDIKAN MA’ARIF NU"]
[{"$f":"\"Tahun Pelajaran \"&DTPERSON1718!C45","v":"Tahun Pelajaran 2019/2020"}]
{"$rows_left_out":35}
{"sheet":"LPT1718","index":12,"n_rows":55,"n_cols":6,"rows_kept":55,"cut":false,"hidden":false,"merged":[[35,5,35,6],[16,5,16,6],[18,5,29,6],[30,5,30,6],[31,5,31,6],[32,5,32,6],[33,5,33,6],[9,5,15,6],[4,0,5,0],[4,1,5,2],[4,3,5,4],[4,5,5,6],[6,5,7,6]]}
["Lampiran 1 ",null,{"$f":"'LPJ1718'!C1","v":": SK Kepala MIS. Nurul Islam Labruk Kidul"}]
["Nomor",null,{"$f":"'LPJ1718'!C2","v":": 001/MINI.L-Kid/30.02.02/SK.S.1-0/VII/2019"}]
["Tanggal",null,{"$f":"'LPJ1718'!C3","v":": 13 Juli 2019"}]
[]
["NO","N A M A",null,"JENIS TUGAS",null,"KETERANGAN"]
[]
["01","KEPALA MADRASAH"]
[null,"1. SAHRONI,S.Pd.I",null,"Ø","Kepala Madrasah"]
["02","PEMBANTU KEPALA MADRASAH"]
[null,"2.1.AZAN TUDHONI, S.Pd",null,"Ø","PKM Kesiswaan","Membantu Kepala Madrasah"]
[null,"2.2. NURUL HIDAYAH, S.Pd.I. MA",null,"Ø","PKM Tenaga Kependidikan"]
[null,"2.3. NUR RATNA PRIHATININGSIH, S.Pd",null,"Ø","PKM Kurikulum"]
[null,"2.4. KHUSNUL ADIBAH, S.Pd.I",null,"Ø","PKM Sarana Prasarana"]
[null,"2.5. AHMAD SHODIQ, SH",null,"Ø","PKM. Humas"]
["03","BENDAHARA"]
{"$rows_left_out":41}
{"sheet":"LPJ1718","index":13,"n_rows":166,"n_cols":22,"rows_kept":166,"cut":false,"hidden":false,"merged":[[1,21,2,22],[4,21,5,22],[157,0,157,4],[151,0,152,0],[151,1,152,2],[151,3,152,3],[151,20,152,20],[153,0,154,0],[153,1,154,2],[153,3,154,3],[153,20,154,20],[148,3,150,3],[148,20,150,20],[129,0,138,0],[129,3,138,3],[129,20,138,20],[139,20,147,20],[143,1,143,2],[144,1,144,2],[109,0,118,0],[109,3,118,3],[109,20,118,20],[113,1,113,2],[119,0,128,0],[119,3,128,3],[119,20,128,20],[124,1,124,2],[132,1,132,2],[133,1,133,2],[134,1,134,2],[139,0,147,0],[139,3,147,3],[89,0,98,0],[89,20,98,20],[93,1,93,2],[99,0,108,0],[99,3,108,3],[99,20,108,20],[103,1,103,2],[104,1,104,2],[67,0,77,0],[67,3,77,3],[67,20,77,20],[72,1,72,2],[73,1,73,2],[78,0,88,0],[78,20,88,20],[83,1,83,2],[83,3,87,3],[84,1,84,2],[45,0,55,0],[45,3,55,3],[45,20,55,20],[50,1,50,2],[51,1,51,2],[56,0,66,0],[56,3,66,3],[56,20,66,20],[61,1,61,2],[62,1,62,2],[34,0,44,0],[34,3,44,3],[34,20,44,20],[9,1,9,2],[10,0,11,0],[10,1,11,2],[10,3,11,3],[10,20,11,20],[12,0,22,0],[12,3,22,3],[12,20,22,20],[23,0,33,0],[23,3,33,3],[23,20,33,20],[28,1,28,2],[29,1,29,2],[4,0,4,20],[5,0,5,20],[6,0,6,20],[7,0,8,0],[7,1,8,2],[7,4,8,4],[7,5,7,17],[7,18,8,18],[7,19,8,19],[7,20,8,20]]}
["Lampiran 2",null,{"$f":"[1]Tugas!C1","v":": SK Kepala MIS. Nurul Islam Labruk Kidul"}]
["Nomor",null,{"$f":"\": \"&VLOOKUP(V5,DTPERSON1718!C69:I70,6)","v":": 001/MINI.L-Kid/30.02.02/SK.S.1-0/VII/2019"},null,null,null,null,null,null,null,null,null,null,null,null,null,null,null,null,null,null,"SEMESTER"]
["Tanggal",null,{"$f":"\": \"&TEXT(VLOOKUP(V5,DTPERSON1718!C69:I70,2),\"dd mmmm yyyy\")","v":": 13 Juli 2019"}]
[]
["DATA TUGAS MENGAJAR DAN JUMLAH JAM MENGAJAR",null,null,null,null,null,null,null,null,null,null,null,null,null,null,null,null,null,null,null,null,{"$f":"'SK1718'!H6","v":1}]
["MI. MA'ARIF NU NURUL ISLAM LABRUK KIDUL - SUMBERSUKO"]
["TAHUN PELAJARAN 2017/2018"]
["NO","NAMA GURU",null,"KD","TUGAS MENGAJAR","Jumlah Jam Dalam Kelas",null,null,null,null,null,null,null,null,null,null,null,null,"KS","JML JAM PER-BDG STUDI","JML JAM TOTAL"]
[null,null,null,"GURU",null,"1a","1b","1c","2a","2b","3a","3b","4a","4b","5a","5b","6a","6b"]
[1,"Sahroni, S.Pd.I",null,null,"Aswaja",null,null,null,null,null,null,null,null,null,null,null,2,2,18,{"$f":"SUM(F10:S10)","v":22},{"$f":"SUM(T10:T10)","v":22}]
[2,"M. Said",null,null,"B. Arab",null,null,null,null,null,null,null,2,2,2,2,2,2,null,12,{"$f":"SUM(T11:T12)","v":24}]
[null,null,null,null,"Nahwu/Shorof",null,null,null,null,null,null,null,2,2,2,2,2,2,null,12]
[3,null,null,null,"Matematika",4,null,null,null,null,null,null,null,null,null,null,null,null,null,4,{"$f":"SUM(F13:R23)","v":30}]
[null,null,null,null,"IPA/Sains",3,null,null,null,null,null,null,null,null,null,null,null,null,null,3]
[null,null,null,null,"B. Indonesia",4,null,null,null,null,null,null,null,null,null,null,null,null,null,4]
{"$rows_left_out":151}