{"text_format":"1","workbook":"xlsx","n_sheets":4,"sheets":["CARIEDITSISWA","INDUK40015000","INDUK40015000HAL1","INDUK40015000HAL2"],"not_rendered":{"charts":0,"images":3,"macros":1,"external_links":1,"defined_names":6,"comments":0,"pivot_tables":0},"unopened":[],"bounds":{"document_bytes":16777216,"sheet_cells":100000,"rows_first":2000,"rows_last":500,"rows_between":2000,"halvings":0,"cell_chars":16384,"cell_head_chars":4096},"cells_cut":0,"cells_raw":0,"read":"whole","date_system":"1900"}

{"sheet":"CARIEDITSISWA","index":0,"n_rows":85,"n_cols":19,"rows_kept":85,"cut":false,"hidden":false,"merged":[[1,5,1,16],[0,17,3,17],[0,18,3,18]]}
["CARI NO INDUK / NAMA SISWA",null,null,null,null,null,null,null,null,null,null,null,null,null,null,null,null,"NILAI IJAZAH","NILAI SKHU"]
[null,null,null,null,null,"ISIAN RAPORT KELAS.SMT"]
[null,"NO INDUK","4001"]
[null,"NAMA","Nama Murid",null,"MP","1.1","1.2","2.1","2.2","3.1","3.2","4.1","4.2","5.1","5.2","6.1","6.2"]
[null,"LP","L",null,"QURDITS","A1","A2","A56","A57","A112","A62","A168","A169","A224","A225","A280","A281","A352","A353"]
["CARI      UPDATE       SAVE","TANGGAL LAHIR","1987-09-05",null,"AQIDAH AKHLAK","A3","A4","A58","A59","A63","A141","A170","A171","A226","A227","A282","A283","A354","A355"]
{"$rows_left_out":80}
{"sheet":"INDUK40015000","index":1,"n_rows":1005,"n_cols":480,"rows_kept":1005,"cut":false,"hidden":false,"merged":[[1,87,1,88],[1,0,2,0],[1,1,2,1],[1,2,2,2],[1,3,2,3],[1,4,2,4],[1,5,2,5],[1,12,1,14],[1,15,2,15],[1,16,1,19],[1,20,2,20],[1,21,2,21],[1,22,2,22],[1,6,2,6],[1,7,2,7],[1,8,2,8],[1,9,2,9],[1,10,2,10],[1,11,2,11],[1,40,1,42],[1,43,2,43],[1,44,2,44],[1,45,1,48],[1,49,2,49],[1,50,1,53],[1,23,2,23],[1,25,1,26],[1,27,1,28],[1,29,1,30],[1,31,1,34],[1,36,1,39],[1,69,2,69],[1,70,1,73],[1,74,2,74],[1,75,1,78],[1,79,2,79],[1,80,1,81],[1,54,2,54],[1,55,1,58],[1,59,2,59],[1,60,1,63],[1,64,2,64],[1,65,1,68],[1,82,2,82],[1,83,1,86],[1,91,1,146],[1,148,1,203],[1,205,1,260],[1,262,1,317],[2,109,2,110],[2,111,2,112],[2,113,2,114],[2,115,2,116],[2,117,2,118],[2,119,2,120],[2,121,2,122],[2,123,2,124],[2,125,2,126],[2,127,2,128],[2,133,2,134],[2,135,2,136],[2,137,2,138],[2,139,2,140],[2,168,2,169],[2,170,2,171],[2,172,2,173],[2,174,2,175],[1,446,1,448],[2,91,2,92],[2,93,2,94],[2,95,2,96],[2,97,2,98],[2,99,2,100],[2,101,2,102],[2,103,2,104],[2,105,2,106],[2,107,2,108],[1,319,1,374],[1,376,1,431],[1,433,1,435],[1,436,1,438],[1,439,1,441],[1,442,1,444],[2,141,2,142],[2,143,2,144],[2,148,2,149],[2,150,2,151],[2,152,2,153],[2,154,2,155],[2,129,2,130],[2,131,2,132],[2,176,2,177],[2,178,2,179],[2,156,2,157],[2,158,2,159],[2,160,2,161],[2,162,2,163],[2,164,2,165],[2,166,2,167],[2,192,2,193],[2,194,2,195],[2,196,2,197],[2,198,2,199],[2,200,2,201],[2,205,2,206],[2,180,2,181],[2,182,2,183],[2,184,2,185],[2,186,2,187],[2,188,2,189],[2,190,2,191],[2,219,2,220],[2,221,2,222],[2,223,2,224],[2,225,2,226],[2,227,2,228],[2,229,2,230],[2,207,2,208],[2,209,2,210],[2,211,2,212],[2,213,2,214],[2,215,2,216],[2,217,2,218],[2,243,2,244],[2,245,2,246],[2,247,2,248],[2,249,2,250],[2,251,2,252],[2,253,2,254],[2,231,2,232],[2,233,2,234],[2,235,2,236],[2,237,2,238],[2,239,2,240],[2,241,2,242],[2,270,2,271],[2,272,2,273],[2,274,2,275],[2,276,2,277],[2,278,2,279],[2,280,2,281],[2,255,2,256],[2,257,2,258],[2,262,2,263],[2,264,2,265],[2,266,2,267],[2,268,2,269],[2,294,2,295],[2,296,2,297],[2,298,2,299],[2,300,2,301],[2,302,2,303],[2,304,2,305],[2,282,2,283],[2,284,2,285],[2,286,2,287],[2,288,2,289],[2,290,2,291],[2,292,2,293],[2,321,2,322],[2,323,2,324],[2,325,2,326],[2,327,2,328],[2,329,2,330],[2,331,2,332],[2,306,2,307],[2,308,2,309],[2,310,2,311],[2,312,2,313],[2,314,2,315],[2,319,2,320],[2,345,2,346],[2,347,2,348],[2,349,2,350],[2,351,2,352],[2,353,2,354],[2,355,2,356],[2,333,2,334],[2,335,2,336],[2,337,2,338],[2,339,2,340],[2,341,2,342],[2,343,2,344],[2,369,2,370],[2,371,2,372],[2,376,2,377],[2,378,2,379],[2,380,2,381],[2,382,2,383],[2,357,2,358],[2,359,2,360],[2,361,2,362],[2,363,2,364],[2,365,2,366],[2,367,2,368],[2,396,2,397],[2,398,2,399],[2,400,2,401],[2,402,2,403],[2,404,2,405],[2,406,2,407],[2,384,2,385],[2,386,2,387],[2,388,2,389],[2,390,2,391],[2,392,2,393],[2,394,2,395],[2,420,2,421],[2,422,2,423],[2,424,2,425],[2,426,2,427],[2,428,2,429],[2,450,2,451],[2,408,2,409],[2,410,2,411],[2,412,2,413],[2,414,2,415],[2,416,2,417],[2,418,2,419],[2,476,2,477],[2,478,2,479],[1,450,1,479],[2,464,2,465],[2,466,2,467],[2,468,2,469],[2,470,2,471],[2,472,2,473],[2,474,2,475],[2,452,2,453],[2,454,2,455],[2,456,2,457],[2,458,2,459],[2,460,2,461],[2,462,2,463]]}
[1,2,3,4,5,6,7,8,"1900-01-09",10,11,12,13,14,15,16,17,18,19,20,21,22,23,24,25,26,27,28,29,30,31,32,33,34,35,36,37,38,39,40,41,42,43,44,45,46,47,48,49,50,51,52,53,54,55,56,57,58,59,60,61,62,63,64,65,66,67,68,69,70,71,72,73,74,75,76,77,78,79,80,81,82,83,84,85,86,87,88,89,90,91,92,93,94,95,96,97,98,99,100,101,102,103,104,105,106,107,108,109,110,111,112,113,114,115,116,117,118,119,120,121,122,123,124,125,126,127,128,129,130,131,132,133,134,135,136,137,138,139,140,141,142,143,144,145,146,147,148,149,150,151,152,153,154,155,156,157,158,159,160,161,162,163,164,165,166,167,168,169,170,171,172,173,174,175,176,177,178,179,180,181,182,183,184,185,186,187,188,189,190,191,192,193,194,195,196,197,198,199,200,201,202,203,204,205,206,207,208,209,210,211,212,213,214,215,216,217,218,219,220,221,222,223,224,225,226,227,228,229,230,231,232,233,234,235,236,237,238,239,240,241,242,243,244,245,246,247,248,249,250,251,252,253,254,255,256,257,258,259,260,261,262,263,264,265,266,267,268,269,270,271,272,273,274,275,276,277,278,279,280,281,282,283,284,285,286,287,288,289,290,291,292,293,294,295,296,297,298,299,300,301,302,303,304,305,306,307,308,309,310,311,312,313,314,315,316,317,318,319,320,321,322,323,324,325,326,327,328,329,330,331,332,333,334,335,336,337,338,339,340,341,342,343,344,345,346,347,348,349,350,351,352,353,354,355,356,357,358,359,360,361,362,363,364,365,366,367,368,369,370,371,372,373,374,375,376,377,378,379,380,381,382,383,384,385,386,387,388,389,390,391,392,393,394,395,396,397,398,399,400,401,402,403,404,405,406,407,408,409,410,411,412,413,414,415,416,417,418,419,420,421,422,423,424,425,426,427,428,429,430,431,432,433,434,435,"1901-03-11",437,438,439,440,441,442,443,444,445,446,447,448,449,450,451,452,453,454,455,456,457,458,459,460,461,462,463,464,465,466,467,468,469,470,471,472,473,474,475,476,477,478,479,480]
["Induk","Nama Murid","NISN","Kls.","Tgl Masuk","Tgl Keluar","Nama Panggilan",{"$f":"\"L/P\"","v":"L/P"},"Tanggal Lahir","Tempat Lahir","Agama","Kewarganegaraan","Jumlah saudara",null,null,"Bahasa Sehari-hari keluarga","Keadaan Jasmani",null,null,null,"alamat dan no. telp","tempat tinggal pada (ortu/numpang/asramah)","Jarak Tempat Tinggal","tahun masuk sekolah ini",null,"Nama Orang tua",null,"pendidikan Tertinggi",null,"Pekerjaan",null,"Wali (jika ada)",null,null,null,null,"Masuk menjadi murid tingkat 1",null,null,null,"pindahan jika dari sekolah lain",null,null,"Prestasi Belajar","KELAS 1",null,null,null,null,"KELAS 2",null,null,null,null,"KELAS 3",null,null,null,null,"KELAS 4",null,null,null,null,"KELAS 5",null,null,null,null,"KELAS 6",null,null,null,null,2023,null,null,null,null,"Beasiswa","Tahun Tamat",null,"Melanjutkan Ke","Mutasi Masuk Madrasah",null,null,null,"Mutasi Keluar Madrasah",null,null,null,"KELAS 1",null,null,null,null,null,null,null,null,null,null,null,null,null,null,null,null,null,null,null,null,null,null,null,null,null,null,null,null,null,null,null,null,null,null,null,null,null,null,null,null,null,null,null,null,null,null,null,null,null,null,null,null,null,null,null,null,"KELAS 2",null,null,null,null,null,null,null,null,null,null,null,null,null,null,null,null,null,null,null,null,null,null,null,null,null,null,null,null,null,null,null,null,null,null,null,null,null,null,null,null,null,null,null,null,null,null,null,null,null,null,null,null,null,null,null,null,"KELAS 3",null,null,null,null,null,null,null,null,null,null,null,null,null,null,null,null,null,null,null,null,null,null,null,null,null,null,null,null,null,null,null,null,null,null,null,null,null,null,null,null,null,null,null,null,null,null,null,null,null,null,null,null,null,null,null,null,"KELAS 4",null,null,null,null,null,null,null,null,null,null,null,null,null,null,null,null,null,null,null,null,null,null,null,null,null,null,null,null,null,null,null,null,null,null,null,null,null,null,null,null,null,null,null,null,null,null,null,null,null,null,null,null,null,null,null,null,"KELAS 5",null,null,null,null,null,null,null,null,null,null,null,null,null,null,null,null,null,null,null,null,null,null,null,null,null,null,null,null,null,null,null,null,null,null,null,null,null,null,null,null,null,null,null,null,null,null,null,null,null,null,null,null,null,null,null,null,"KELAS 6",null,null,null,null,null,null,null,null,null,null,null,null,null,null,null,null,null,null,null,null,null,null,null,null,null,null,null,null,null,null,null,null,null,null,null,null,null,null,null,null,null,null,null,null,null,null,null,null,null,null,null,null,null,null,null,null,"LULUSAN",null,null,"PENGHARGAAN 1",null,null,"PENGHARGAAN 1",null,null,"KETERANGAN",null,null,null,"KETERANGAN",null,null,null,"NILAI IJAZAH"]
[null,null,null,null,null,null,null,null,null,null,null,null,"Kandung","Tiri","Angkat",null,"Berat badan (Saat kelas 1)","tinggi badan (saat kelas 1)","gol.darah","penyakit berat",null,null,null,null,null,"Ayah","Ibu","Ayah","Ibu","Ayah","Ibu","Nama","hub.keluarga","Pendidikan","Pekerjaan",null,"asal TK/RA","nama RA/TK","Alamat","Tanggal dan No.STTB","Nama Sekolah","dari Tingkat","diterima Tanggal",null,null,"Kg","Cm","Penyakit","Kelainan",null,"Kg","Cm","Penyakit","Kelainan",null,"Kg","Cm","Penyakit","Kelainan",null,"Kg","Cm","Penyakit","Kelainan",null,"Kg","Cm","Penyakit","Kelainan",null,"Kg","Cm","Penyakit","Kelainan",null,"Kg","Cm","Penyakit","Kelainan",null,"Tahun","No. IJAZAH",null,"Dari Tingkat","Asal Sekolah","Tingkat","Tanggal","Tanggal","Alasan",null,null,"QH 1",null,"AA 1",null,"FQ 1",null,"SKI 1",null,"AWJ 1",null,"BA1",null,"PKN 1",null,"BID 1",null,"MTK 1",null,"IPA 1",null,"IPS 1",null,"SBK 1",null,"PJO 1",null,"BD 1",null,"BIG 1",null,"JML NILAI",null,"RATA - RATA",null,"PE RINGKAT",null,"SAKIT",null,"IJIN",null,"ALPA",null,"EKSKUL PRAMUKA",null,"EKSKUL 1",null,"EKSKUL 2",null,"KE-LAKU-AN",null,"KE-RAJINAN",null,"KE-BERSIHAN",null,"NAIK/ TIDAK NAIK","TAHUN PLJARAN",null,"QH 2",null,"AA 2",null,"FQ 2",null,"SKI 2",null,"AWJ 2",null,"BA2",null,"PKN 2",null,"BID 2",null,"MTK 2",null,"IPA 2",null,"IPS 2",null,"SBK 2",null,"PJO 2",null,"BD 2",null,"BIG 2",null,"JML NILAI",null,"RATA - RATA",null,"PE RINGKAT",null,"SAKIT",null,"IJIN",null,"ALPA",null,"EKSKUL PRAMUKA",null,"EKSKUL 1",null,"EKSKUL 2",null,"KE-LAKU-AN",null,"KE-RAJINAN",null,"KE-BERSIHAN",null,"NAIK/ TIDAK NAIK","TAHUN PLJARAN",null,"QH 3",null,"AA 3",null,"FQ 3",null,"SKI 3",null,"AWJ 3",null,"BA3",null,"PKN 3",null,"BID 3",null,"MTK 3",null,"IPA 3",null,"IPS 3",null,"SBK 3",null,"PJO 3",null,"BD 3",null,"BIG 3",null,"JML NILAI",null,"RATA - RATA",null,"PE RINGKAT",null,"SAKIT",null,"IJIN",null,"ALPA",null,"EKSKUL PRAMUKA",null,"EKSKUL 1",null,"EKSKUL 2",null,"KE-LAKU-AN",null,"KE-RAJINAN",null,"KE-BERSIHAN",null,"NAIK/ TIDAK NAIK","TAHUN PLJARAN",null,"QH 4",null,"AA 4",null,"FQ 4",null,"SKI 4",null,"AWJ 4",null,"BA4",null,"PKN 4",null,"BID 4",null,"MTK 4",null,"IPA 4",null,"IPS 4",null,"SBK 4",null,"PJO 4",null,"BD 4",null,"BIG 4",null,"JML NILAI",null,"RATA - RATA",null,"PE RINGKAT",null,"SAKIT",null,"IJIN",null,"ALPA",null,"EKSKUL PRAMUKA",null,"EKSKUL 1",null,"EKSKUL 2",null,"KE-LAKU-AN",null,"KE-RAJINAN",null,"KE-BERSIHAN",null,"NAIK/ TIDAK NAIK","TAHUN PLJARAN",null,"QH 5",null,"AA 5",null,"FQ 5",null,"SKI 5",null,"AWJ 5",null,"BA5",null,"PKN 5",null,"BID 5",null,"MTK 5",null,"IPA 5",null,"IPS 5",null,"SBK 5",null,"PJO 5",null,"BD 5",null,"BIG 5",null,"JML NILAI",null,"RATA - RATA",null,"PE RINGKAT",null,"SAKIT",null,"IJIN",null,"ALPA",null,"EKSKUL PRAMUKA",null,"EKSKUL 1",null,"EKSKUL 2",null,"KE-LAKU-AN",null,"KE-RAJINAN",null,"KE-BERSIHAN",null,"NAIK/ TIDAK NAIK","TAHUN PLJARAN",null,"QH 6",null,"AA 6",null,"FQ 6",null,"SKI 6",null,"AWJ 6",null,"BA6",null,"PKN 6",null,"BID 6",null,"MTK 6",null,"IPA 6",null,"IPS 6",null,"SBK 6",null,"PJO 6",null,"BD 6",null,"BIG 6",null,"JML NILAI",null,"RATA - RATA",null,"PE RINGKAT",null,"SAKIT",null,"IJIN",null,"ALPA",null,"EKSKUL PRAMUKA",null,"EKSKUL 1",null,"EKSKUL 2",null,"KE-LAKU-AN",null,"KE-RAJINAN",null,"KE-BERSIHAN",null,"NAIK/ TIDAK NAIK","TAHUN PLJARAN",null,"NOMOR IJAZAH","Tempat IJAZAH","TANGGAL IJAZAH","NOMOR SKHU","Tempat IJAZAH","TANGGAL IJAZAH","NOMOR IJAZAH","NOMOR IJAZAH","NOMOR IJAZAH","TENTANG","NOMOR SRT KET","TANGGAL SRT KET","NOMOR IJAZAH","TENTANG","NOMOR SRT KET","TANGGAL SRT KET",null,"QH (NILAI AKHIR)",null,"AA (NILAI AKHIR)",null,"FQ (NILAI AKHIR)",null,"SKI (NILAI AKHIR)",null,"AWJ (NILAI AKHIR)",null,"BA(NILAI AKHIR)",null,"PKN (NILAI AKHIR)",null,"BID (NILAI AKHIR)",null,"MTK (NILAI AKHIR)",null,"IPA (NILAI AKHIR)",null,"IPS (NILAI AKHIR)",null,"SBK (NILAI AKHIR)",null,"PJO (NILAI AKHIR)",null,"BD (NILAI AKHIR)",null,"BIG (NILAI AKHIR)"]
[null,null,null,null,null,null,null,null,null,null,null,null,null,null,null,null,null,null,null,null,null,null,null,null,null,null,null,null,null,null,null,null,null,null,null,null,null,null,null,null,null,null,null,null,null,null,null,null,null,null,null,null,null,null,null,null,null,null,null,null,null,null,null,null,null,null,null,null,null,null,null,null,null,null,null,null,null,null,null,null,null,null,null,null,null,null,null,null,null,null,null,"SMT1","SMT2","SMT1","SMT2","SMT1","SMT2","SMT1","SMT2","SMT1","SMT2","SMT1","SMT2","SMT1","SMT2","SMT1","SMT2","SMT1","SMT2","SMT1","SMT2","SMT1","SMT2","SMT1","SMT2","SMT1","SMT2","SMT1","SMT2","SMT1","SMT2","SMT1","SMT2","SMT1","SMT2","SMT1","SMT2","SMT1","SMT2","SMT1","SMT2","SMT1","SMT2","SMT1","SMT2","SMT1","SMT2","SMT1","SMT2","SMT1","SMT2","SMT1","SMT2","SMT1","SMT2",null,null,null,"SMT1","SMT2","SMT1","SMT2","SMT1","SMT2","SMT1","SMT2","SMT1","SMT2","SMT1","SMT2","SMT1","SMT2","SMT1","SMT2","SMT1","SMT2","SMT1","SMT2","SMT1","SMT2","SMT1","SMT2","SMT1","SMT2","SMT1","SMT2","SMT1","SMT2","SMT1","SMT2","SMT1","SMT2","SMT1","SMT2","SMT1","SMT2","SMT1","SMT2","SMT1","SMT2","SMT1","SMT2","SMT1","SMT2","SMT1","SMT2","SMT1","SMT2","SMT1","SMT2","SMT1","SMT2",null,null,null,"SMT1","SMT2","SMT1","SMT2","SMT1","SMT2","SMT1","SMT2","SMT1","SMT2","SMT1","SMT2","SMT1","SMT2","SMT1","SMT2","SMT1","SMT2","SMT1","SMT2","SMT1","SMT2","SMT1","SMT2","SMT1","SMT2","SMT1","SMT2","SMT1","SMT2","SMT1","SMT2","SMT1","SMT2","SMT1","SMT2","SMT1","SMT2","SMT1","SMT2","SMT1","SMT2","SMT1","SMT2","SMT1","SMT2","SMT1","SMT2","SMT1","SMT2","SMT1","SMT2","SMT1","SMT2",null,null,null,"SMT1","SMT2","SMT1","SMT2","SMT1","SMT2","SMT1","SMT2","SMT1","SMT2","SMT1","SMT2","SMT1","SMT2","SMT1","SMT2","SMT1","SMT2","SMT1","SMT2","SMT1","SMT2","SMT1","SMT2","SMT1","SMT2","SMT1","SMT2","SMT1","SMT2","SMT1","SMT2","SMT1","SMT2","SMT1","SMT2","SMT1","SMT2","SMT1","SMT2","SMT1","SMT2","SMT1","SMT2","SMT1","SMT2","SMT1","SMT2","SMT1","SMT2","SMT1","SMT2","SMT1","SMT2",null,null,null,"SMT1","SMT2","SMT1","SMT2","SMT1","SMT2","SMT1","SMT2","SMT1","SMT2","SMT1","SMT2","SMT1","SMT2","SMT1","SMT2","SMT1","SMT2","SMT1","SMT2","SMT1","SMT2","SMT1","SMT2","SMT1","SMT2","SMT1","SMT2","SMT1","SMT2","SMT1","SMT2","SMT1","SMT2","SMT1","SMT2","SMT1","SMT2","SMT1","SMT2","SMT1","SMT2","SMT1","SMT2","SMT1","SMT2","SMT1","SMT2","SMT1","SMT2","SMT1","SMT2","SMT1","SMT2",null,null,null,"SMT1","SMT2","SMT1","SMT2","SMT1","SMT2","SMT1","SMT2","SMT1","SMT2","SMT1","SMT2","SMT1","SMT2","SMT1","SMT2","SMT1","SMT2","SMT1","SMT2","SMT1","SMT2","SMT1","SMT2","SMT1","SMT2","SMT1","SMT2","SMT1","SMT2","SMT1","SMT2","SMT1","SMT2","SMT1","SMT2","SMT1","SMT2","SMT1","SMT2","SMT1","SMT2","SMT1","SMT2","SMT1","SMT2","SMT1","SMT2","SMT1","SMT2","SMT1","SMT2","SMT1","SMT2",null,null,null,null,null,null,null,null,null,null,null,null,null,null,null,null,null,null,null,null,"IJAZAH","SKHU","IJAZAH","SKHU","IJAZAH","SKHU","IJAZAH","SKHU","IJAZAH","SKHU","IJAZAH","SKHU","IJAZAH","SKHU","IJAZAH","SKHU","IJAZAH","SKHU","IJAZAH","SKHU","IJAZAH","SKHU","IJAZAH","SKHU","IJAZAH","SKHU","IJAZAH","SKHU","IJAZAH","SKHU"]
[]
[4001,"Nama Murid",null,null,{"$f":"AQ6","v":"diterima Tanggal"},{"$f":"QG6","v":"A351"},"PANGGIL","L","1987-09-05","LUMAJANG","ISLAM","WNI",4,5,6,"BHS SHRI2",20171,20172,"gol.darah","penyakit berat","alamat dan no. telp","ORANGTUA","Jarak Tempat Tinggal","tahun masuk sekolah ini",null,"no1","no2","pt1","pt2","pk1","pk2","Nama","hub.keluarga","Pekerjaan","Pekerjaan",null,"LANGSUNG ORANGTUA","nama RA/TK","Alamat","no STTB","Nama Sekolah","dari Tingkat","diterima Tanggal","Prestasi Belajar","THN KLS 1",20171,20172,20173,20174,2018,20181,20182,20183,20184,2019,20191,20192,20193,20194,2020,20201,20202,20203,20204,2021,20211,20212,20213,20214,2022,20221,20222,20223,20224,2023,20231,20232,20233,"LAIN","BEASISWA OK","Tahun","No. STTB","MELANJUTKAN KE OK","MUTASI OK","ASAL OK","DITERIMA OK","TGL OK","KELUAR OK","ALASAN OK","*",null,"A1","A2","A3","A4","A5","A6","A7","A8","A9","A10","A11","A12","A13","A14","A15","A16","A17","A18","A19","A20","A21","A22","A23","A24","A25","A26","A27","A28","A29","A30","A31","A32","A33","A34","A35","A36","A37","A38","A39","A40","A41","A42","A43","A44","A45","A46","A47","A48","A49","A50","A51","A52","A53","A54","A55","A56",null,"A56","A57","A58","A59","A60","A61","A62","A63","A64","A65","A66","A67","A68","A69","A70","A71","A72","A73","A74","A75","A76","A77","A78","A79","A80","A81","A82","A83","A84","A85","A86","A87","A88","A89","A90","A91","A92","A93","A94","A95","A96","A97","A98","A99","A100","A101","A102","A103","A104","A105","A106","A107","A108","A109","A110","A111",null,"A112","A113","A114","A115","A116","A117","A118","A119","A120","A121","A122","A123","A124","A125","A126","A127","A128","A129","A130","A131","A132","A133","A134","A135","A136","A137","A138","A139","A140","A141","A142","A143","A144","A145","A146","A147","A148","A149","A150","A151","A152","A153","A154","A155","A156","A157","A158","A159","A160","A161","A162","A163","A164","A165","A166","A167",null,"A168","A169","A170","A171","A172","A173","A174","A175","A176","A177","A178","A179","A180","A181","A182","A183","A184","A185","A186","A187","A188","A189","A190","A191","A192","A193","A194","A195","A196","A197","A198","A199","A200","A201","A202","A203","A204","A205","A206","A207","A208","A209","A210","A211","A212","A213","A214","A215","A216","A217","A218","A219","A220","A221","A222","A223",null,"A224","A225","A226","A227","A228","A229","A230","A231","A232","A233","A234","A235","A236","A237","A238","A239","A240","A241","A242","A243","A244","A245","A246","A247","A248","A249","A250","A251","A252","A253","A254","A255","A256","A257","A258","A259","A260","A261","A262","A263","A264","A265","A266","A267","A268","A269","A270","A271","A272","A273","A274","A275","A276","A277","A278","A279",null,"A280","A281","A282","A283","A284","A285","A286","A287","A288","A289","A290","A291","A292","A293","A294","A295","A296","A297","A298","A299","A300","A301","A302","A303","A304","A305","A306","A307","A308","A309","A310","A311","A312","A313","A314","A315","A316","A317","A318","A319","A320","A321","A322","A323","A324","A325","A326","A327","A328","A329","A330","A331","A332","A333","LULUS","A335",null,"A336","A337","A338","A339","A340","A341","A342","A343","A344","A345","A346","A347","A348","A349","A350","A351",null,"A352","A353","A354","A355","A356","A357","A358","A359","A360","A361","A362","A363","A364","A365","A366","A367","A368","A369","A370","A371","A372","A373","A374","A375","A376","A377","A378","A379","A380","A381"]
{"$rows_left_out":1000}
{"sheet":"INDUK40015000HAL1","index":2,"n_rows":74,"n_cols":15,"rows_kept":74,"cut":false,"hidden":false,"merged":[[6,1,10,1],[29,1,33,1],[54,4,54,7],[55,1,59,1],[55,4,55,7],[56,4,56,7],[57,4,57,7],[58,4,58,7]]}
[null,null,null,null,"Nomor Induk Murid : ",null,null,null,null,null,4324]
[null,null,null,"A.","KETERANGAN MURID"]
[null,null,null,null,"1.","Nama Murid :"]
[null,null,null,null,null,null,null,null,"a. Lengkap",null,null,{"$f":"\": \"&VLOOKUP($K$1,INDUK40015000!$A$6:$CK$1005,2)","v":": VIKA KUSUMA WATI"}]
[null,null,null,null,null,null,null,null,"b. Panggilan",null,null,{"$f":"\": \"&VLOOKUP($K$1,INDUK40015000!$A$6:$CK$1005,7)","v":": VIKA"}]
[null,null,null,null,"2.","Jenis Kelamin",null,null,null,null,null,{"$f":"\": \"&IF(VLOOKUP($K$1,INDUK40015000!$A$6:$CK$1005,8)=\"L\",\"Laki-Laki\",\"Perempuan\")","v":": Perempuan"}]
{"$rows_left_out":69}
{"sheet":"INDUK40015000HAL2","index":3,"n_rows":55,"n_cols":32,"rows_kept":55,"cut":false,"hidden":false,"merged":[[0,26,0,27],[1,0,4,0],[1,1,4,4],[1,5,1,8],[1,9,1,12],[1,13,1,16],[1,17,1,20],[1,21,1,24],[1,25,1,28],[3,7,3,8],[1,29,1,30],[2,5,2,8],[2,9,2,12],[2,13,2,16],[2,17,2,20],[2,21,2,24],[2,25,2,28],[2,29,4,29],[2,30,4,30],[3,5,3,6],[3,27,3,28],[5,0,9,0],[5,1,5,4],[5,5,5,30],[6,2,6,4],[7,2,7,4],[8,2,8,4],[3,9,3,10],[3,11,3,12],[3,13,3,14],[3,15,3,16],[3,17,3,18],[3,19,3,20],[9,2,9,4],[10,1,10,4],[11,1,11,4],[12,1,12,4],[13,1,13,4],[14,1,14,4],[3,21,3,22],[3,23,3,24],[3,25,3,26],[15,1,15,4],[16,1,16,4],[17,1,17,4],[18,0,21,0],[18,1,18,4],[18,5,18,30],[19,2,19,4],[20,2,20,4],[21,2,21,4],[22,0,22,4],[22,5,22,30],[23,1,23,4],[23,5,23,6],[23,7,23,8],[23,9,23,10],[23,11,23,12],[23,13,23,14],[23,15,23,16],[23,17,23,18],[23,19,23,20],[24,1,24,4],[24,5,24,6],[24,7,24,8],[24,9,24,10],[24,11,24,12],[24,25,24,26],[24,27,24,28],[24,19,24,20],[24,21,24,22],[24,23,24,24],[25,15,25,16],[25,17,25,18],[24,13,24,14],[24,15,24,16],[24,17,24,18],[23,21,23,22],[23,23,23,24],[23,25,23,26],[23,27,23,28],[26,13,26,14],[26,15,26,16],[26,17,26,18],[25,19,25,20],[25,21,25,22],[25,23,25,24],[25,25,25,26],[25,27,25,28],[26,0,26,4],[26,5,26,6],[26,7,26,8],[26,9,26,10],[26,11,26,12],[26,25,26,26],[26,27,26,28],[26,19,26,20],[26,21,26,22],[26,23,26,24],[25,1,25,4],[25,5,25,6],[25,7,25,8],[25,9,25,10],[25,11,25,12],[25,13,25,14],[27,19,27,20],[27,21,27,22],[27,23,27,24],[27,25,27,26],[27,27,27,28],[28,0,28,4],[28,5,28,6],[28,7,28,8],[28,9,28,10],[28,11,28,12],[28,25,28,26],[28,27,28,28],[27,0,27,4],[27,5,27,6],[27,7,27,8],[27,9,27,10],[27,11,27,12],[27,13,27,14],[27,15,27,16],[27,17,27,18],[29,0,29,4],[29,5,29,30],[30,1,30,4],[30,5,30,6],[30,7,30,8],[30,9,30,10],[30,11,30,12],[30,13,30,14],[28,13,28,14],[28,15,28,16],[28,17,28,18],[28,19,28,20],[28,21,28,22],[28,23,28,24],[30,27,30,28],[30,15,30,16],[30,17,30,18],[30,19,30,20],[30,21,30,22],[30,23,30,24],[30,25,30,26],[35,5,35,6],[31,21,31,22],[31,23,31,24],[31,25,31,26],[31,27,31,28],[32,1,32,4],[32,5,32,6],[32,7,32,8],[32,9,32,10],[32,11,32,12],[32,13,32,14],[31,1,31,4],[31,5,31,6],[31,7,31,8],[31,9,31,10],[31,11,31,12],[31,13,31,14],[31,15,31,16],[31,17,31,18],[31,19,31,20],[34,25,34,26],[34,23,34,24],[35,25,35,26],[34,27,34,28],[32,27,32,28],[33,0,33,4],[33,5,33,30],[34,1,34,3],[34,5,34,6],[34,7,34,8],[34,9,34,10],[34,11,34,12],[34,13,34,14],[34,15,34,16],[32,15,32,16],[32,17,32,18],[32,19,32,20],[32,21,32,22],[32,23,32,24],[32,25,32,26],[34,29,37,30],[34,17,34,18],[34,19,34,20],[34,21,34,22],[36,19,36,20],[36,21,36,22],[36,23,36,24],[36,25,36,26],[35,7,35,8],[35,9,35,10],[35,11,35,12],[35,13,35,14],[35,15,35,16],[35,17,35,18],[35,19,35,20],[35,21,35,22],[35,23,35,24],[35,27,35,28],[36,1,36,3],[36,5,36,6],[36,7,36,8],[36,9,36,10],[36,11,36,12],[36,13,36,14],[35,1,35,3],[41,16,41,20],[41,28,41,30],[39,4,39,11],[41,4,41,11],[39,16,39,20],[39,28,39,30],[36,27,36,28],[37,0,37,4],[37,5,37,8],[37,9,37,12],[37,13,37,16],[37,17,37,20],[37,21,37,24],[37,25,37,28],[36,15,36,16],[36,17,36,18],[45,3,45,11],[45,16,45,22],[45,27,45,30],[54,4,54,11],[54,16,54,22],[54,27,54,30],[47,3,47,11],[47,16,47,22],[47,27,47,30],[52,4,52,11],[52,16,52,22],[52,27,52,30]]}
["V.","PENILAIAN HASIL BELAJAR ",null,null,null,null,null,null,null,null,null,null,null,null,null,null,null,null,null,null,null,"NO.INDUK",null,null,null,":",{"$f":"INDUK40015000HAL1!K1","v":4324}]
["NO","Mata Pelajaran ",null,null,null,{"$f":"\"TP. \"&IF(VLOOKUP($AA$1,INDUK40015000!$A$6:$RL$1005,147,)=0,\"-\",VLOOKUP($AA$1,INDUK40015000!$A$6:$RL$1005,147,))","v":"TP. -"},null,null,null,{"$f":"\"TP. \"&IF(VLOOKUP($AA$1,INDUK40015000!$A$6:$RL$1005,204,)=0,\"-\",VLOOKUP($AA$1,INDUK40015000!$A$6:$RL$1005,204,))","v":"TP. -"},null,null,null,{"$f":"\"TP. \"&IF(VLOOKUP($AA$1,INDUK40015000!$A$6:$RL$1005,261,)=0,\"-\",VLOOKUP($AA$1,INDUK40015000!$A$6:$RL$1005,261,))","v":"TP. -"},null,null,null,{"$f":"\"TP. \"&IF(VLOOKUP($AA$1,INDUK40015000!$A$6:$RL$1005,318,)=0,\"-\",VLOOKUP($AA$1,INDUK40015000!$A$6:$RL$1005,318,))","v":"TP. -"},null,null,null,{"$f":"\"TP. \"&IF(VLOOKUP($AA$1,INDUK40015000!$A$6:$RL$1005,375,)=0,\"-\",VLOOKUP($AA$1,INDUK40015000!$A$6:$RL$1005,375,))","v":"TP. -"},null,null,null,{"$f":"\"TP. \"&IF(VLOOKUP($AA$1,INDUK40015000!$A$6:$RL$1005,432,)=0,\"-\",VLOOKUP($AA$1,INDUK40015000!$A$6:$RL$1005,432,))","v":"TP. -"},null,null,null,"NILAI",null,15]
[null,null,null,null,null,"KELAS 1",null,null,null,"KELAS 2",null,null,null,"KELAS 3",null,null,null,"KELAS 4",null,null,null,"KELAS 5",null,null,null,"KELAS 6",null,null,null,"RAPORT + UJIAN","RATA-RATA RAPORT"]
[null,null,null,null,null,"Smt I",null,"Smt II",null,"Smt I",null,"Smt II",null,"Smt I",null,"Smt II",null,"Smt I",null,"Smt II",null,"Smt I",null,"Smt II",null,"Smt I",null,"Smt II"]
[null,null,null,null,null,"KKM","Nilai","KKM","Nilai","KKM","Nilai","KKM","Nilai","KKM","Nilai","KKM","Nilai","KKM","Nilai","KKM","Nilai","KKM","Nilai","KKM","Nilai","KKM","Nilai","KKM","Nilai"]
[1,"Pendidikan Agama Islam "]
{"$rows_left_out":49}