{"text_format":"1","workbook":"xlsx","n_sheets":4,"sheets":["CARIEDITSISWA","INDUK40015000","INDUK40015000HAL1","INDUK40015000HAL2"],"not_rendered":{"charts":0,"images":3,"macros":1,"external_links":1,"defined_names":6,"comments":0,"pivot_tables":0},"unopened":[],"bounds":{"document_bytes":16777216,"sheet_cells":100000,"rows_first":2000,"rows_last":500,"rows_between":2000,"halvings":0,"cell_chars":16384,"cell_head_chars":4096},"cells_cut":0,"cells_raw":0,"read":"whole","date_system":"1900"}

{"sheet":"CARIEDITSISWA","index":0,"n_rows":85,"n_cols":19,"rows_kept":85,"cut":false,"hidden":false,"merged":[[1,5,1,16],[0,17,3,17],[0,18,3,18]]}
["CARI NO INDUK / NAMA SISWA",null,null,null,null,null,null,null,null,null,null,null,null,null,null,null,null,"NILAI IJAZAH","NILAI SKHU"]
[null,null,null,null,null,"ISIAN RAPORT KELAS.SMT"]
[null,"NO INDUK","4001"]
[null,"NAMA","Nama Murid",null,"MP","1.1","1.2","2.1","2.2","3.1","3.2","4.1","4.2","5.1","5.2","6.1","6.2"]
[null,"LP","L",null,"QURDITS","A1","A2","A56","A57","A112","A62","A168","A169","A224","A225","A280","A281","A352","A353"]
["CARI      UPDATE       SAVE","TANGGAL LAHIR","1987-09-05",null,"AQIDAH AKHLAK","A3","A4","A58","A59","A63","A141","A170","A171","A226","A227","A282","A283","A354","A355"]
[null,"TEMPAT LAHIR","LUMAJANG",null,"FIQIH","A5","A6","A60","A61","A142","A143","A172","A173","A228","A229","A284","A285","A356","A357"]
[null,"NAMA PANGGILAN","PANGGIL",null,"SKI","A7","A8","A62","A63","A144","A145","A174","A175","A230","A231","A286","A287","A358","A359"]
[null,"AGAMA","ISLAM",null,"ASWAJA","A9","A10","A64","A65","A146","A300","A176","A177","A232","A233","A288","A289","A360","A361"]
[null,"KEWARGANEGARAAN","WNI",null,"BARAB","A11","A12","A66","A67","A148","A149","A178","A179","A234","A235","A290","A291","A362","A363"]
[null,"JML SDR KANDUNG",4,null,"PKN","A13","A14","A68","A69","A150","A151","A180","A181","A236","A237","A292","A293","A364","A365"]
[null,"JML SDR TIRI",5,null,"B INDO","A15","A16","A70","A71","A152","A153","A182","A183","A238","A239","A294","A295","A366","A367"]
[null,"JML SDR ANGKAT",6,null,"MTK","A17","A18","A72","A73","A154","A155","A184","A185","A240","A241","A296","A297","A368","A369"]
[null,"BAHASA SEHARI-HARI","BHS SHRI2",null,"IPA","A19","A20","A74","A75","A156","A157","A186","A187","A242","A243","A298","A299","A370","A371"]
[null,"TINGGI BADAN",20171,null,"IPS","A21","A22","A76","A77","A158","A159","A188","A189","A244","A245","A300","A301","A372","A373"]
[null,"BERAT BADAN ",20172,null,"SBK","A23","A24","A78","A79","A160","A161","A190","A191","A246","A247","A302","A303","A374","A375"]
[null,"GOL DARAH","gol.darah",null,"PJOK","A25","A26","A80","A81","A162","A163","A192","A193","A248","A249","A304","A305","A376","A377"]
[null,"PENYAKIT BERAT","penyakit berat",null,"BIG","A27","A28","A82","A83","A164","A165","A194","A195","A250","A251","A306","A307","A378","A379"]
[null,"ALAMAT","alamat dan no. telp",null,"BD","A29","A30","A84","A85","A166","A141","A196","A197","A252","A253","A308","A309","A380","A381"]
[null,"TINGGAL DENGAN","ORANGTUA","PILIH"]
[null,"JARAK TMP TGGAL","Jarak Tempat Tinggal"]
[null,"TAHUN MASUK","tahun masuk sekolah ini"]
[]
[null,"NAMA AYAH","no1"]
[null,"NAMA IBU","no2"]
[null,"PENDIDIKAN AYAH","pt1"]
[null,"PENDIDIKAN IBU","pt2"]
[null,"PEKERJAAN AYAH","pk1"]
[null,"PEKERJAAN IBU","pk2"]
[null,"NAMA WALI","Nama"]
[null,"HUB. DG WALI","hub.keluarga"]
[null,"PENDIDIKAN WALI","Pekerjaan"]
[null,"PEKERJAAN WALI","Pekerjaan"]
[]
[null,"PENDIDIKAN SEBELUMNYA","LANGSUNG ORANGTUA","PILIH"]
[null,"NAMA TK/RA","nama RA/TK"]
[null,"ALAMAT TK/RA","Alamat"]
[null,"No. STTB","no STTB"]
[null,"PINDAHAN DARI SEKOLAH","Nama Sekolah"]
[null,"DITERIMA TINGKAT","dari Tingkat"]
[null,"DITERIMA TANGGAL","diterima Tanggal"]
[null,"KELAS 1 PADA TAHUN","THN KLS 1"]
[null,"BERAT BADAN (Kg)",20171]
[null,"TINGGI BADAN (Cm)",20172]
[null,"PENYAKIT",20173]
[null,"KELAINAN",20174]
[null,"KELAS 2 PADA TAHUN",2018]
[null,"BERAT BADAN (Kg)",20181]
[null,"TINGGI BADAN (Cm)",20182]
[null,"PENYAKIT",20183]
[null,"KELAINAN",20184]
[null,"KELAS 3 PADA THUN",2019]
[null,"BERAT BADAN (Kg)",20191]
[null,"TINGGI BADAN (Cm)",20192]
[null,"PENYAKIT",20193]
[null,"KELAINAN",20194]
[null,"KELAS 4 PADA TAHUN",2020]
[null,"BERAT BADAN (Kg)",20201]
[null,"TINGGI BADAN (Cm)",20202]
[null,"PENYAKIT",20203]
[null,"KELAINAN",20204]
[null,"KELAS 5 PADA TAHUN",2021]
[null,"BERAT BADAN (Kg)",20211]
[null,"TINGGI BADAN (Cm)",20212]
[null,"PENYAKIT",20213]
[null,"KELAINAN",20214]
[null,"KELAS 6 PADA TAHUN",2022]
[null,"BERAT BADAN (Kg)",20221]
[null,"TINGGI BADAN (Cm)",20222]
[null,"PENYAKIT",20223]
[null,"KELAINAN",20224]
[null,"KELAS - PADA TAHUN",2023]
[null,"BERAT BADAN (Kg)",20231]
[null,"TINGGI BADAN (Cm)",20232]
[null,"PENYAKIT",20233]
[null,"KELAINAN","LAIN"]
[null,"BEASISWA","BEASISWA OK"]
[null,"MELANJUTKAN KE","MELANJUTKAN KE OK"]
[null,"TINGKAT MUTASI MASUK","MUTASI OK"]
[null,"ASAL SEKOLAH","ASAL OK"]
[null,"DITERIMA TINGKAT ","DITERIMA OK"]
[null,"TANGGAL","TGL OK"]
[null,"MUTASI KELUAR TGL","KELUAR OK"]
[null,"ALASAN","ALASAN OK"]
[null,null,"*"]

{"sheet":"INDUK40015000","index":1,"n_rows":1005,"n_cols":480,"rows_kept":1005,"cut":false,"hidden":false,"merged":[[1,87,1,88],[1,0,2,0],[1,1,2,1],[1,2,2,2],[1,3,2,3],[1,4,2,4],[1,5,2,5],[1,12,1,14],[1,15,2,15],[1,16,1,19],[1,20,2,20],[1,21,2,21],[1,22,2,22],[1,6,2,6],[1,7,2,7],[1,8,2,8],[1,9,2,9],[1,10,2,10],[1,11,2,11],[1,40,1,42],[1,43,2,43],[1,44,2,44],[1,45,1,48],[1,49,2,49],[1,50,1,53],[1,23,2,23],[1,25,1,26],[1,27,1,28],[1,29,1,30],[1,31,1,34],[1,36,1,39],[1,69,2,69],[1,70,1,73],[1,74,2,74],[1,75,1,78],[1,79,2,79],[1,80,1,81],[1,54,2,54],[1,55,1,58],[1,59,2,59],[1,60,1,63],[1,64,2,64],[1,65,1,68],[1,82,2,82],[1,83,1,86],[1,91,1,146],[1,148,1,203],[1,205,1,260],[1,262,1,317],[2,109,2,110],[2,111,2,112],[2,113,2,114],[2,115,2,116],[2,117,2,118],[2,119,2,120],[2,121,2,122],[2,123,2,124],[2,125,2,126],[2,127,2,128],[2,133,2,134],[2,135,2,136],[2,137,2,138],[2,139,2,140],[2,168,2,169],[2,170,2,171],[2,172,2,173],[2,174,2,175],[1,446,1,448],[2,91,2,92],[2,93,2,94],[2,95,2,96],[2,97,2,98],[2,99,2,100],[2,101,2,102],[2,103,2,104],[2,105,2,106],[2,107,2,108],[1,319,1,374],[1,376,1,431],[1,433,1,435],[1,436,1,438],[1,439,1,441],[1,442,1,444],[2,141,2,142],[2,143,2,144],[2,148,2,149],[2,150,2,151],[2,152,2,153],[2,154,2,155],[2,129,2,130],[2,131,2,132],[2,176,2,177],[2,178,2,179],[2,156,2,157],[2,158,2,159],[2,160,2,161],[2,162,2,163],[2,164,2,165],[2,166,2,167],[2,192,2,193],[2,194,2,195],[2,196,2,197],[2,198,2,199],[2,200,2,201],[2,205,2,206],[2,180,2,181],[2,182,2,183],[2,184,2,185],[2,186,2,187],[2,188,2,189],[2,190,2,191],[2,219,2,220],[2,221,2,222],[2,223,2,224],[2,225,2,226],[2,227,2,228],[2,229,2,230],[2,207,2,208],[2,209,2,210],[2,211,2,212],[2,213,2,214],[2,215,2,216],[2,217,2,218],[2,243,2,244],[2,245,2,246],[2,247,2,248],[2,249,2,250],[2,251,2,252],[2,253,2,254],[2,231,2,232],[2,233,2,234],[2,235,2,236],[2,237,2,238],[2,239,2,240],[2,241,2,242],[2,270,2,271],[2,272,2,273],[2,274,2,275],[2,276,2,277],[2,278,2,279],[2,280,2,281],[2,255,2,256],[2,257,2,258],[2,262,2,263],[2,264,2,265],[2,266,2,267],[2,268,2,269],[2,294,2,295],[2,296,2,297],[2,298,2,299],[2,300,2,301],[2,302,2,303],[2,304,2,305],[2,282,2,283],[2,284,2,285],[2,286,2,287],[2,288,2,289],[2,290,2,291],[2,292,2,293],[2,321,2,322],[2,323,2,324],[2,325,2,326],[2,327,2,328],[2,329,2,330],[2,331,2,332],[2,306,2,307],[2,308,2,309],[2,310,2,311],[2,312,2,313],[2,314,2,315],[2,319,2,320],[2,345,2,346],[2,347,2,348],[2,349,2,350],[2,351,2,352],[2,353,2,354],[2,355,2,356],[2,333,2,334],[2,335,2,336],[2,337,2,338],[2,339,2,340],[2,341,2,342],[2,343,2,344],[2,369,2,370],[2,371,2,372],[2,376,2,377],[2,378,2,379],[2,380,2,381],[2,382,2,383],[2,357,2,358],[2,359,2,360],[2,361,2,362],[2,363,2,364],[2,365,2,366],[2,367,2,368],[2,396,2,397],[2,398,2,399],[2,400,2,401],[2,402,2,403],[2,404,2,405],[2,406,2,407],[2,384,2,385],[2,386,2,387],[2,388,2,389],[2,390,2,391],[2,392,2,393],[2,394,2,395],[2,420,2,421],[2,422,2,423],[2,424,2,425],[2,426,2,427],[2,428,2,429],[2,450,2,451],[2,408,2,409],[2,410,2,411],[2,412,2,413],[2,414,2,415],[2,416,2,417],[2,418,2,419],[2,476,2,477],[2,478,2,479],[1,450,1,479],[2,464,2,465],[2,466,2,467],[2,468,2,469],[2,470,2,471],[2,472,2,473],[2,474,2,475],[2,452,2,453],[2,454,2,455],[2,456,2,457],[2,458,2,459],[2,460,2,461],[2,462,2,463]]}
[1,2,3,4,5,6,7,8,"1900-01-09",10,11,12,13,14,15,16,17,18,19,20,21,22,23,24,25,26,27,28,29,30,31,32,33,34,35,36,37,38,39,40,41,42,43,44,45,46,47,48,49,50,51,52,53,54,55,56,57,58,59,60,61,62,63,64,65,66,67,68,69,70,71,72,73,74,75,76,77,78,79,80,81,82,83,84,85,86,87,88,89,90,91,92,93,94,95,96,97,98,99,100,101,102,103,104,105,106,107,108,109,110,111,112,113,114,115,116,117,118,119,120,121,122,123,124,125,126,127,128,129,130,131,132,133,134,135,136,137,138,139,140,141,142,143,144,145,146,147,148,149,150,151,152,153,154,155,156,157,158,159,160,161,162,163,164,165,166,167,168,169,170,171,172,173,174,175,176,177,178,179,180,181,182,183,184,185,186,187,188,189,190,191,192,193,194,195,196,197,198,199,200,201,202,203,204,205,206,207,208,209,210,211,212,213,214,215,216,217,218,219,220,221,222,223,224,225,226,227,228,229,230,231,232,233,234,235,236,237,238,239,240,241,242,243,244,245,246,247,248,249,250,251,252,253,254,255,256,257,258,259,260,261,262,263,264,265,266,267,268,269,270,271,272,273,274,275,276,277,278,279,280,281,282,283,284,285,286,287,288,289,290,291,292,293,294,295,296,297,298,299,300,301,302,303,304,305,306,307,308,309,310,311,312,313,314,315,316,317,318,319,320,321,322,323,324,325,326,327,328,329,330,331,332,333,334,335,336,337,338,339,340,341,342,343,344,345,346,347,348,349,350,351,352,353,354,355,356,357,358,359,360,361,362,363,364,365,366,367,368,369,370,371,372,373,374,375,376,377,378,379,380,381,382,383,384,385,386,387,388,389,390,391,392,393,394,395,396,397,398,399,400,401,402,403,404,405,406,407,408,409,410,411,412,413,414,415,416,417,418,419,420,421,422,423,424,425,426,427,428,429,430,431,432,433,434,435,"1901-03-11",437,438,439,440,441,442,443,444,445,446,447,448,449,450,451,452,453,454,455,456,457,458,459,460,461,462,463,464,465,466,467,468,469,470,471,472,473,474,475,476,477,478,479,480]
["Induk","Nama Murid","NISN","Kls.","Tgl Masuk","Tgl Keluar","Nama Panggilan",{"$f":"\"L/P\"","v":"L/P"},"Tanggal Lahir","Tempat Lahir","Agama","Kewarganegaraan","Jumlah saudara",null,null,"Bahasa Sehari-hari keluarga","Keadaan Jasmani",null,null,null,"alamat dan no. telp","tempat tinggal pada (ortu/numpang/asramah)","Jarak Tempat Tinggal","tahun masuk sekolah ini",null,"Nama Orang tua",null,"pendidikan Tertinggi",null,"Pekerjaan",null,"Wali (jika ada)",null,null,null,null,"Masuk menjadi murid tingkat 1",null,null,null,"pindahan jika dari sekolah lain",null,null,"Prestasi Belajar","KELAS 1",null,null,null,null,"KELAS 2",null,null,null,null,"KELAS 3",null,null,null,null,"KELAS 4",null,null,null,null,"KELAS 5",null,null,null,null,"KELAS 6",null,null,null,null,2023,null,null,null,null,"Beasiswa","Tahun Tamat",null,"Melanjutkan Ke","Mutasi Masuk Madrasah",null,null,null,"Mutasi Keluar Madrasah",null,null,null,"KELAS 1",null,null,null,null,null,null,null,null,null,null,null,null,null,null,null,null,null,null,null,null,null,null,null,null,null,null,null,null,null,null,null,null,null,null,null,null,null,null,null,null,null,null,null,null,null,null,null,null,null,null,null,null,null,null,null,null,"KELAS 2",null,null,null,null,null,null,null,null,null,null,null,null,null,null,null,null,null,null,null,null,null,null,null,null,null,null,null,null,null,null,null,null,null,null,null,null,null,null,null,null,null,null,null,null,null,null,null,null,null,null,null,null,null,null,null,null,"KELAS 3",null,null,null,null,null,null,null,null,null,null,null,null,null,null,null,null,null,null,null,null,null,null,null,null,null,null,null,null,null,null,null,null,null,null,null,null,null,null,null,null,null,null,null,null,null,null,null,null,null,null,null,null,null,null,null,null,"KELAS 4",null,null,null,null,null,null,null,null,null,null,null,null,null,null,null,null,null,null,null,null,null,null,null,null,null,null,null,null,null,null,null,null,null,null,null,null,null,null,null,null,null,null,null,null,null,null,null,null,null,null,null,null,null,null,null,null,"KELAS 5",null,null,null,null,null,null,null,null,null,null,null,null,null,null,null,null,null,null,null,null,null,null,null,null,null,null,null,null,null,null,null,null,null,null,null,null,null,null,null,null,null,null,null,null,null,null,null,null,null,null,null,null,null,null,null,null,"KELAS 6",null,null,null,null,null,null,null,null,null,null,null,null,null,null,null,null,null,null,null,null,null,null,null,null,null,null,null,null,null,null,null,null,null,null,null,null,null,null,null,null,null,null,null,null,null,null,null,null,null,null,null,null,null,null,null,null,"LULUSAN",null,null,"PENGHARGAAN 1",null,null,"PENGHARGAAN 1",null,null,"KETERANGAN",null,null,null,"KETERANGAN",null,null,null,"NILAI IJAZAH"]
[null,null,null,null,null,null,null,null,null,null,null,null,"Kandung","Tiri","Angkat",null,"Berat badan (Saat kelas 1)","tinggi badan (saat kelas 1)","gol.darah","penyakit berat",null,null,null,null,null,"Ayah","Ibu","Ayah","Ibu","Ayah","Ibu","Nama","hub.keluarga","Pendidikan","Pekerjaan",null,"asal TK/RA","nama RA/TK","Alamat","Tanggal dan No.STTB","Nama Sekolah","dari Tingkat","diterima Tanggal",null,null,"Kg","Cm","Penyakit","Kelainan",null,"Kg","Cm","Penyakit","Kelainan",null,"Kg","Cm","Penyakit","Kelainan",null,"Kg","Cm","Penyakit","Kelainan",null,"Kg","Cm","Penyakit","Kelainan",null,"Kg","Cm","Penyakit","Kelainan",null,"Kg","Cm","Penyakit","Kelainan",null,"Tahun","No. IJAZAH",null,"Dari Tingkat","Asal Sekolah","Tingkat","Tanggal","Tanggal","Alasan",null,null,"QH 1",null,"AA 1",null,"FQ 1",null,"SKI 1",null,"AWJ 1",null,"BA1",null,"PKN 1",null,"BID 1",null,"MTK 1",null,"IPA 1",null,"IPS 1",null,"SBK 1",null,"PJO 1",null,"BD 1",null,"BIG 1",null,"JML NILAI",null,"RATA - RATA",null,"PE RINGKAT",null,"SAKIT",null,"IJIN",null,"ALPA",null,"EKSKUL PRAMUKA",null,"EKSKUL 1",null,"EKSKUL 2",null,"KE-LAKU-AN",null,"KE-RAJINAN",null,"KE-BERSIHAN",null,"NAIK/ TIDAK NAIK","TAHUN PLJARAN",null,"QH 2",null,"AA 2",null,"FQ 2",null,"SKI 2",null,"AWJ 2",null,"BA2",null,"PKN 2",null,"BID 2",null,"MTK 2",null,"IPA 2",null,"IPS 2",null,"SBK 2",null,"PJO 2",null,"BD 2",null,"BIG 2",null,"JML NILAI",null,"RATA - RATA",null,"PE RINGKAT",null,"SAKIT",null,"IJIN",null,"ALPA",null,"EKSKUL PRAMUKA",null,"EKSKUL 1",null,"EKSKUL 2",null,"KE-LAKU-AN",null,"KE-RAJINAN",null,"KE-BERSIHAN",null,"NAIK/ TIDAK NAIK","TAHUN PLJARAN",null,"QH 3",null,"AA 3",null,"FQ 3",null,"SKI 3",null,"AWJ 3",null,"BA3",null,"PKN 3",null,"BID 3",null,"MTK 3",null,"IPA 3",null,"IPS 3",null,"SBK 3",null,"PJO 3",null,"BD 3",null,"BIG 3",null,"JML NILAI",null,"RATA - RATA",null,"PE RINGKAT",null,"SAKIT",null,"IJIN",null,"ALPA",null,"EKSKUL PRAMUKA",null,"EKSKUL 1",null,"EKSKUL 2",null,"KE-LAKU-AN",null,"KE-RAJINAN",null,"KE-BERSIHAN",null,"NAIK/ TIDAK NAIK","TAHUN PLJARAN",null,"QH 4",null,"AA 4",null,"FQ 4",null,"SKI 4",null,"AWJ 4",null,"BA4",null,"PKN 4",null,"BID 4",null,"MTK 4",null,"IPA 4",null,"IPS 4",null,"SBK 4",null,"PJO 4",null,"BD 4",null,"BIG 4",null,"JML NILAI",null,"RATA - RATA",null,"PE RINGKAT",null,"SAKIT",null,"IJIN",null,"ALPA",null,"EKSKUL PRAMUKA",null,"EKSKUL 1",null,"EKSKUL 2",null,"KE-LAKU-AN",null,"KE-RAJINAN",null,"KE-BERSIHAN",null,"NAIK/ TIDAK NAIK","TAHUN PLJARAN",null,"QH 5",null,"AA 5",null,"FQ 5",null,"SKI 5",null,"AWJ 5",null,"BA5",null,"PKN 5",null,"BID 5",null,"MTK 5",null,"IPA 5",null,"IPS 5",null,"SBK 5",null,"PJO 5",null,"BD 5",null,"BIG 5",null,"JML NILAI",null,"RATA - RATA",null,"PE RINGKAT",null,"SAKIT",null,"IJIN",null,"ALPA",null,"EKSKUL PRAMUKA",null,"EKSKUL 1",null,"EKSKUL 2",null,"KE-LAKU-AN",null,"KE-RAJINAN",null,"KE-BERSIHAN",null,"NAIK/ TIDAK NAIK","TAHUN PLJARAN",null,"QH 6",null,"AA 6",null,"FQ 6",null,"SKI 6",null,"AWJ 6",null,"BA6",null,"PKN 6",null,"BID 6",null,"MTK 6",null,"IPA 6",null,"IPS 6",null,"SBK 6",null,"PJO 6",null,"BD 6",null,"BIG 6",null,"JML NILAI",null,"RATA - RATA",null,"PE RINGKAT",null,"SAKIT",null,"IJIN",null,"ALPA",null,"EKSKUL PRAMUKA",null,"EKSKUL 1",null,"EKSKUL 2",null,"KE-LAKU-AN",null,"KE-RAJINAN",null,"KE-BERSIHAN",null,"NAIK/ TIDAK NAIK","TAHUN PLJARAN",null,"NOMOR IJAZAH","Tempat IJAZAH","TANGGAL IJAZAH","NOMOR SKHU","Tempat IJAZAH","TANGGAL IJAZAH","NOMOR IJAZAH","NOMOR IJAZAH","NOMOR IJAZAH","TENTANG","NOMOR SRT KET","TANGGAL SRT KET","NOMOR IJAZAH","TENTANG","NOMOR SRT KET","TANGGAL SRT KET",null,"QH (NILAI AKHIR)",null,"AA (NILAI AKHIR)",null,"FQ (NILAI AKHIR)",null,"SKI (NILAI AKHIR)",null,"AWJ (NILAI AKHIR)",null,"BA(NILAI AKHIR)",null,"PKN (NILAI AKHIR)",null,"BID (NILAI AKHIR)",null,"MTK (NILAI AKHIR)",null,"IPA (NILAI AKHIR)",null,"IPS (NILAI AKHIR)",null,"SBK (NILAI AKHIR)",null,"PJO (NILAI AKHIR)",null,"BD (NILAI AKHIR)",null,"BIG (NILAI AKHIR)"]
[null,null,null,null,null,null,null,null,null,null,null,null,null,null,null,null,null,null,null,null,null,null,null,null,null,null,null,null,null,null,null,null,null,null,null,null,null,null,null,null,null,null,null,null,null,null,null,null,null,null,null,null,null,null,null,null,null,null,null,null,null,null,null,null,null,null,null,null,null,null,null,null,null,null,null,null,null,null,null,null,null,null,null,null,null,null,null,null,null,null,null,"SMT1","SMT2","SMT1","SMT2","SMT1","SMT2","SMT1","SMT2","SMT1","SMT2","SMT1","SMT2","SMT1","SMT2","SMT1","SMT2","SMT1","SMT2","SMT1","SMT2","SMT1","SMT2","SMT1","SMT2","SMT1","SMT2","SMT1","SMT2","SMT1","SMT2","SMT1","SMT2","SMT1","SMT2","SMT1","SMT2","SMT1","SMT2","SMT1","SMT2","SMT1","SMT2","SMT1","SMT2","SMT1","SMT2","SMT1","SMT2","SMT1","SMT2","SMT1","SMT2","SMT1","SMT2",null,null,null,"SMT1","SMT2","SMT1","SMT2","SMT1","SMT2","SMT1","SMT2","SMT1","SMT2","SMT1","SMT2","SMT1","SMT2","SMT1","SMT2","SMT1","SMT2","SMT1","SMT2","SMT1","SMT2","SMT1","SMT2","SMT1","SMT2","SMT1","SMT2","SMT1","SMT2","SMT1","SMT2","SMT1","SMT2","SMT1","SMT2","SMT1","SMT2","SMT1","SMT2","SMT1","SMT2","SMT1","SMT2","SMT1","SMT2","SMT1","SMT2","SMT1","SMT2","SMT1","SMT2","SMT1","SMT2",null,null,null,"SMT1","SMT2","SMT1","SMT2","SMT1","SMT2","SMT1","SMT2","SMT1","SMT2","SMT1","SMT2","SMT1","SMT2","SMT1","SMT2","SMT1","SMT2","SMT1","SMT2","SMT1","SMT2","SMT1","SMT2","SMT1","SMT2","SMT1","SMT2","SMT1","SMT2","SMT1","SMT2","SMT1","SMT2","SMT1","SMT2","SMT1","SMT2","SMT1","SMT2","SMT1","SMT2","SMT1","SMT2","SMT1","SMT2","SMT1","SMT2","SMT1","SMT2","SMT1","SMT2","SMT1","SMT2",null,null,null,"SMT1","SMT2","SMT1","SMT2","SMT1","SMT2","SMT1","SMT2","SMT1","SMT2","SMT1","SMT2","SMT1","SMT2","SMT1","SMT2","SMT1","SMT2","SMT1","SMT2","SMT1","SMT2","SMT1","SMT2","SMT1","SMT2","SMT1","SMT2","SMT1","SMT2","SMT1","SMT2","SMT1","SMT2","SMT1","SMT2","SMT1","SMT2","SMT1","SMT2","SMT1","SMT2","SMT1","SMT2","SMT1","SMT2","SMT1","SMT2","SMT1","SMT2","SMT1","SMT2","SMT1","SMT2",null,null,null,"SMT1","SMT2","SMT1","SMT2","SMT1","SMT2","SMT1","SMT2","SMT1","SMT2","SMT1","SMT2","SMT1","SMT2","SMT1","SMT2","SMT1","SMT2","SMT1","SMT2","SMT1","SMT2","SMT1","SMT2","SMT1","SMT2","SMT1","SMT2","SMT1","SMT2","SMT1","SMT2","SMT1","SMT2","SMT1","SMT2","SMT1","SMT2","SMT1","SMT2","SMT1","SMT2","SMT1","SMT2","SMT1","SMT2","SMT1","SMT2","SMT1","SMT2","SMT1","SMT2","SMT1","SMT2",null,null,null,"SMT1","SMT2","SMT1","SMT2","SMT1","SMT2","SMT1","SMT2","SMT1","SMT2","SMT1","SMT2","SMT1","SMT2","SMT1","SMT2","SMT1","SMT2","SMT1","SMT2","SMT1","SMT2","SMT1","SMT2","SMT1","SMT2","SMT1","SMT2","SMT1","SMT2","SMT1","SMT2","SMT1","SMT2","SMT1","SMT2","SMT1","SMT2","SMT1","SMT2","SMT1","SMT2","SMT1","SMT2","SMT1","SMT2","SMT1","SMT2","SMT1","SMT2","SMT1","SMT2","SMT1","SMT2",null,null,null,null,null,null,null,null,null,null,null,null,null,null,null,null,null,null,null,null,"IJAZAH","SKHU","IJAZAH","SKHU","IJAZAH","SKHU","IJAZAH","SKHU","IJAZAH","SKHU","IJAZAH","SKHU","IJAZAH","SKHU","IJAZAH","SKHU","IJAZAH","SKHU","IJAZAH","SKHU","IJAZAH","SKHU","IJAZAH","SKHU","IJAZAH","SKHU","IJAZAH","SKHU","IJAZAH","SKHU"]
[]
[4001,"Nama Murid",null,null,{"$f":"AQ6","v":"diterima Tanggal"},{"$f":"QG6","v":"A351"},"PANGGIL","L","1987-09-05","LUMAJANG","ISLAM","WNI",4,5,6,"BHS SHRI2",20171,20172,"gol.darah","penyakit berat","alamat dan no. telp","ORANGTUA","Jarak Tempat Tinggal","tahun masuk sekolah ini",null,"no1","no2","pt1","pt2","pk1","pk2","Nama","hub.keluarga","Pekerjaan","Pekerjaan",null,"LANGSUNG ORANGTUA","nama RA/TK","Alamat","no STTB","Nama Sekolah","dari Tingkat","diterima Tanggal","Prestasi Belajar","THN KLS 1",20171,20172,20173,20174,2018,20181,20182,20183,20184,2019,20191,20192,20193,20194,2020,20201,20202,20203,20204,2021,20211,20212,20213,20214,2022,20221,20222,20223,20224,2023,20231,20232,20233,"LAIN","BEASISWA OK","Tahun","No. STTB","MELANJUTKAN KE OK","MUTASI OK","ASAL OK","DITERIMA OK","TGL OK","KELUAR OK","ALASAN OK","*",null,"A1","A2","A3","A4","A5","A6","A7","A8","A9","A10","A11","A12","A13","A14","A15","A16","A17","A18","A19","A20","A21","A22","A23","A24","A25","A26","A27","A28","A29","A30","A31","A32","A33","A34","A35","A36","A37","A38","A39","A40","A41","A42","A43","A44","A45","A46","A47","A48","A49","A50","A51","A52","A53","A54","A55","A56",null,"A56","A57","A58","A59","A60","A61","A62","A63","A64","A65","A66","A67","A68","A69","A70","A71","A72","A73","A74","A75","A76","A77","A78","A79","A80","A81","A82","A83","A84","A85","A86","A87","A88","A89","A90","A91","A92","A93","A94","A95","A96","A97","A98","A99","A100","A101","A102","A103","A104","A105","A106","A107","A108","A109","A110","A111",null,"A112","A113","A114","A115","A116","A117","A118","A119","A120","A121","A122","A123","A124","A125","A126","A127","A128","A129","A130","A131","A132","A133","A134","A135","A136","A137","A138","A139","A140","A141","A142","A143","A144","A145","A146","A147","A148","A149","A150","A151","A152","A153","A154","A155","A156","A157","A158","A159","A160","A161","A162","A163","A164","A165","A166","A167",null,"A168","A169","A170","A171","A172","A173","A174","A175","A176","A177","A178","A179","A180","A181","A182","A183","A184","A185","A186","A187","A188","A189","A190","A191","A192","A193","A194","A195","A196","A197","A198","A199","A200","A201","A202","A203","A204","A205","A206","A207","A208","A209","A210","A211","A212","A213","A214","A215","A216","A217","A218","A219","A220","A221","A222","A223",null,"A224","A225","A226","A227","A228","A229","A230","A231","A232","A233","A234","A235","A236","A237","A238","A239","A240","A241","A242","A243","A244","A245","A246","A247","A248","A249","A250","A251","A252","A253","A254","A255","A256","A257","A258","A259","A260","A261","A262","A263","A264","A265","A266","A267","A268","A269","A270","A271","A272","A273","A274","A275","A276","A277","A278","A279",null,"A280","A281","A282","A283","A284","A285","A286","A287","A288","A289","A290","A291","A292","A293","A294","A295","A296","A297","A298","A299","A300","A301","A302","A303","A304","A305","A306","A307","A308","A309","A310","A311","A312","A313","A314","A315","A316","A317","A318","A319","A320","A321","A322","A323","A324","A325","A326","A327","A328","A329","A330","A331","A332","A333","LULUS","A335",null,"A336","A337","A338","A339","A340","A341","A342","A343","A344","A345","A346","A347","A348","A349","A350","A351",null,"A352","A353","A354","A355","A356","A357","A358","A359","A360","A361","A362","A363","A364","A365","A366","A367","A368","A369","A370","A371","A372","A373","A374","A375","A376","A377","A378","A379","A380","A381"]
[4002,"Nama Murid","Nama Orang Tua","Kls.",{"$f":"AQ7","v":"diterima Tanggal"},{"$f":"QG7","v":"B351"},"Nama Panggilan","L","Tanggal Lahir","Tempat Lahir","ISLAM","WNI",6,7,8,"Bahasa Sehari-hari keluarga",{"$f":"AT7","v":20171},{"$f":"AU7","v":20172},"gol.darah","penyakit berat","alamat dan no. telp","tempat tinggal pada (ortu/numpang/asramah)","Jarak Tempat Tinggal","tahun masuk sekolah ini",null,"no1","no2","pt1","pt2","pk1","pk2","Nama","hub.keluarga","Pendidikan","Pekerjaan",null,"Langsung Orang Tua","nama RA/TK","Alamat","Tanggal dan No.STTB","Nama Sekolah","dari Tingkat","diterima Tanggal","Prestasi Belajar",2017,20171,20172,20173,20174,2018,20181,20182,20183,20184,2019,20191,20192,20193,20194,2020,20201,20202,20203,20204,2021,20211,20212,20213,20214,2022,20221,20222,20223,20224,2023,20231,20232,20233,20234,"KIP","Tahun","No. STTB","Melanjutkan Ke","Dari Tingkat","Ke Sekolah","Ke Tingkat","Tanggal","Tanggal","Alasan",null,null,"B1","B2","B3","B4","B5","B6","B7","B8","B9","B10","B11","B12","B13","B14","B15","B16","B17","B18","B19","B20","B21","B22","B23","B24","B25","B26","B27","B28","B29","B30","B31","B32","B33","B34","B35","B36","B37","B38","B39","B40","B41","B42","B43","B44","B45","B46","B47","B48","B49","B50","B51","B52","B53","B54","B55","B56",null,"B56","B57","B58","B59","B60","B61","B62","B63","B64","B65","B66","B67","B68","B69","B70","B71","B72","B73","B74","B75","B76","B77","B78","B79","B80","B81","B82","B83","B84","B85","B86","B87","B88","B89","B90","B91","B92","B93","B94","B95","B96","B97","B98","B99","B100","B101","B102","B103","B104","B105","B106","B107","B108","B109","B110","B111",null,"B112","B113","B114","B115","B116","B117","B118","B119","B120","B121","B122","B123","B124","B125","B126","B127","B128","B129","B130","B131","B132","B133","B134","B135","B136","B137","B138","B139","B140","B141","B142","B143","B144","B145","B146","B147","B148","B149","B150","B151","B152","B153","B154","B155","B156","B157","B158","B159","B160","B161","B162","B163","B164","B165","B166","B167",null,"B168","B169","B170","B171","B172","B173","B174","B175","B176","B177","B178","B179","B180","B181","B182","B183","B184","B185","B186","B187","B188","B189","B190","B191","B192","B193","B194","B195","B196","B197","B198","B199","B200","B201","B202","B203","B204","B205","B206","B207","B208","B209","B210","B211","B212","B213","B214","B215","B216","B217","B218","B219","B220","B221","B222","B223",null,"B224","B225","B226","B227","B228","B229","B230","B231","B232","B233","B234","B235","B236","B237","B238","B239","B240","B241","B242","B243","B244","B245","B246","B247","B248","B249","B250","B251","B252","B253","B254","B255","B256","B257","B258","B259","B260","B261","B262","B263","B264","B265","B266","B267","B268","B269","B270","B271","B272","B273","B274","B275","B276","B277","B278","B279",null,"B280","B281","B282","B283","B284","B285","B286","B287","B288","B289","B290","B291","B292","B293","B294","B295","B296","B297","B298","B299","B300","B301","B302","B303","B304","B305","B306","B307","B308","B309","B310","B311","B312","B313","B314","B315","B316","B317","B318","B319","B320","B321","B322","B323","B324","B325","B326","B327","B328","B329","B330","B331","B332","B333","LOELOES","LOELOES",null,"B336","B337","B338","B339","B340","B341","B342","B343","B344","B345","B346","B347","B348","B349","B350","B351",null,"B352","B353","B354","B355","B356","B357","B358","B359","B360","B361","B362","B363","B364","B365","B366","B367","B368","B369","B370","B371","B372","B373","B374","B375","B376","B377","B378","B379","B380","B381"]
[4003,null,null,null,{"$f":"AQ8","v":0},{"$f":"QG8","v":0},null,null,null,null,"ISLAM","WNI",null,null,null,null,{"$f":"AT8","v":0},{"$f":"AU8","v":0}]
[4004,null,null,null,0,0,null,null,null,null,"ISLAM","WNI",null,null,null,null,0,0]
[4005,null,null,null,0,0,null,null,null,null,"ISLAM","WNI",null,null,null,null,0,0]
[4006,null,null,null,0,0,null,null,null,null,"ISLAM","WNI",null,null,null,null,0,0]
[4007,null,null,null,0,0,null,null,null,null,"ISLAM","WNI",null,null,null,null,0,0]
[4008,null,null,null,0,0,null,null,null,null,"ISLAM","WNI",null,null,null,null,0,0]
[4009,null,null,null,0,0,null,null,null,null,"ISLAM","WNI",null,null,null,null,0,0]
[4010,null,null,null,0,0,null,null,null,null,"ISLAM","WNI",null,null,null,null,0,0]
[4011,null,null,null,0,0,null,null,null,null,"ISLAM","WNI",null,null,null,null,0,0]
[4012,null,null,null,0,0,null,null,null,null,"ISLAM","WNI",null,null,null,null,0,0]
[4013,null,null,null,0,0,null,null,null,null,"ISLAM","WNI",null,null,null,null,0,0]
[4014,null,null,null,0,0,null,null,null,null,"ISLAM","WNI",null,null,null,null,0,0]
[4015,null,null,null,0,0,null,null,null,null,"ISLAM","WNI",null,null,null,null,0,0]
[4016,null,null,null,0,0,null,null,null,null,"ISLAM","WNI",null,null,null,null,0,0]
[4017,null,null,null,0,0,null,null,null,null,"ISLAM","WNI",null,null,null,null,0,0]
[4018,null,null,null,0,0,null,null,null,null,"ISLAM","WNI",null,null,null,null,0,0]
[4019,null,null,null,0,0,null,null,null,null,"ISLAM","WNI",null,null,null,null,0,0]
[4020,null,null,null,0,0,null,null,null,null,"ISLAM","WNI",null,null,null,null,0,0]
[4021,null,null,null,0,0,null,null,null,null,"ISLAM","WNI",null,null,null,null,0,0]
[4022,null,null,null,0,0,null,null,null,null,"ISLAM","WNI",null,null,null,null,0,0]
[4023,null,null,null,0,0,null,null,null,null,"ISLAM","WNI",null,null,null,null,0,0]
[4024,null,null,null,0,0,null,null,null,null,"ISLAM","WNI",null,null,null,null,0,0]
[4025,null,null,null,0,0,null,null,null,null,"ISLAM","WNI",null,null,null,null,0,0]
[4026,null,null,null,0,0,null,null,null,null,"ISLAM","WNI",null,null,null,null,0,0]
[4027,null,null,null,0,0,null,null,null,null,"ISLAM","WNI",null,null,null,null,0,0]
[4028,null,null,null,0,0,null,null,null,null,"ISLAM","WNI",null,null,null,null,0,0]
[4029,null,null,null,0,0,null,null,null,null,"ISLAM","WNI",null,null,null,null,0,0]
[4030,null,null,null,0,0,null,null,null,null,"ISLAM","WNI",null,null,null,null,0,0]
[4031,null,null,null,0,0,null,null,null,null,"ISLAM","WNI",null,null,null,null,0,0]
[4032,null,null,null,0,0,null,null,null,null,"ISLAM","WNI",null,null,null,null,0,0]
[4033,null,null,null,0,0,null,null,null,null,"ISLAM","WNI",null,null,null,null,0,0]
[4034,null,null,null,0,0,null,null,null,null,"ISLAM","WNI",null,null,null,null,0,0]
[4035,null,null,null,0,0,null,null,null,null,"ISLAM","WNI",null,null,null,null,0,0]
[4036,null,null,null,0,0,null,null,null,null,"ISLAM","WNI",null,null,null,null,0,0]
[4037,null,null,null,0,0,null,null,null,null,"ISLAM","WNI",null,null,null,null,0,0]
[4038,null,null,null,0,0,null,null,null,null,"ISLAM","WNI",null,null,null,null,0,0]
[4039,null,null,null,0,0,null,null,null,null,"ISLAM","WNI",null,null,null,null,0,0]
[4040,null,null,null,0,0,null,null,null,null,"ISLAM","WNI",null,null,null,null,0,0]
[4041,null,null,null,0,0,null,null,null,null,"ISLAM","WNI",null,null,null,null,0,0]
[4042,null,null,null,0,0,null,null,null,null,"ISLAM","WNI",null,null,null,null,0,0]
[4043,null,null,null,0,0,null,null,null,null,"ISLAM","WNI",null,null,null,null,0,0]
[4044,"KRISNA DWI WICAKSONO",null,null,0,0,"KRISNA","L","LUMAJANG",null,"ISLAM","WNI",1,0,0,"JAWA",0,0,null,null,"GRATI","ORANGTUA",null,null,null,null,null,null,null,null,null,"-","-","-","-",null,null,null,null,null,null,null,null,null,null,null,null,null,null,null,null,null,null,null,null,null,null,null,null,null,null,null,null,null,null,null,null,null,null,"2017/18",42.7,156,null,null,null,null,null,null,null,null,null,null,null,null,null,null,null,null,null,"*"]
[4045,null,null,null,0,0,null,null,null,null,"ISLAM","WNI",null,null,null,null,0,0]
[4046,null,null,null,0,0,null,null,null,null,"ISLAM","WNI",null,null,null,null,0,0]
[4047,null,null,null,0,0,null,null,null,null,"ISLAM","WNI",null,null,null,null,0,0]
[4048,null,null,null,0,0,null,null,null,null,"ISLAM","WNI",null,null,null,null,0,0]
[4049,null,null,null,0,0,null,null,null,null,"ISLAM","WNI",null,null,null,null,0,0]
[4050,null,null,null,0,0,null,null,null,null,"ISLAM","WNI",null,null,null,null,0,0]
[4051,null,null,null,0,0,null,null,null,null,"ISLAM","WNI",null,null,null,null,0,0]
[4052,null,null,null,0,0,null,null,null,null,"ISLAM","WNI",null,null,null,null,0,0]
[4053,null,null,null,0,0,null,null,null,null,"ISLAM","WNI",null,null,null,null,0,0]
[4054,null,null,null,0,0,null,null,null,null,"ISLAM","WNI",null,null,null,null,0,0]
[4055,null,null,null,0,0,null,null,null,null,"ISLAM","WNI",null,null,null,null,0,0]
[4056,null,null,null,0,0,null,null,null,null,"ISLAM","WNI",null,null,null,null,0,0]
[4057,null,null,null,0,0,null,null,null,null,"ISLAM","WNI",null,null,null,null,0,0]
[4058,null,null,null,0,0,null,null,null,null,"ISLAM","WNI",null,null,null,null,0,0]
[4059,null,null,null,0,0,null,null,null,null,"ISLAM","WNI",null,null,null,null,0,0]
[4060,null,null,null,0,0,null,null,null,null,"ISLAM","WNI",null,null,null,null,0,0]
[4061,null,null,null,0,0,null,null,null,null,"ISLAM","WNI",null,null,null,null,0,0]
[4062,null,null,null,0,0,null,null,null,null,"ISLAM","WNI",null,null,null,null,0,0]
[4063,null,null,null,0,0,null,null,null,null,"ISLAM","WNI",null,null,null,null,0,0]
[4064,null,null,null,0,0,null,null,null,null,"ISLAM","WNI",null,null,null,null,0,0]
[4065,null,null,null,0,0,null,null,null,null,"ISLAM","WNI",null,null,null,null,0,0]
[4066,null,null,null,0,0,null,null,null,null,"ISLAM","WNI",null,null,null,null,0,0]
[4067,null,null,null,{"$f":"AQ72","v":0},{"$f":"QG72","v":0},null,null,null,null,"ISLAM","WNI",null,null,null,null,{"$f":"AT72","v":0},{"$f":"AU72","v":0}]
[4068,null,null,null,0,0,null,null,null,null,"ISLAM","WNI",null,null,null,null,0,0]
[4069,null,null,null,0,0,null,null,null,null,"ISLAM","WNI",null,null,null,null,0,0]
[4070,null,null,null,0,0,null,null,null,null,"ISLAM","WNI",null,null,null,null,0,0]
[4071,null,null,null,0,0,null,null,null,null,"ISLAM","WNI",null,null,null,null,0,0]
[4072,null,null,null,0,0,null,null,null,null,"ISLAM","WNI",null,null,null,null,0,0]
[4073,null,null,null,0,0,null,null,null,null,"ISLAM","WNI",null,null,null,null,0,0]
[4074,null,null,null,0,0,null,null,null,null,"ISLAM","WNI",null,null,null,null,0,0]
[4075,null,null,null,0,0,null,null,null,null,"ISLAM","WNI",null,null,null,null,0,0]
[4076,null,null,null,0,0,null,null,null,null,"ISLAM","WNI",null,null,null,null,0,0]
[4077,null,null,null,0,0,null,null,null,null,"ISLAM","WNI",null,null,null,null,0,0]
[4078,null,null,null,0,0,null,null,null,null,"ISLAM","WNI",null,null,null,null,0,0]
[4079,null,null,null,0,0,null,null,null,null,"ISLAM","WNI",null,null,null,null,0,0]
[4080,null,null,null,0,0,null,null,null,null,"ISLAM","WNI",null,null,null,null,0,0]
[4081,null,null,null,0,0,null,null,null,null,"ISLAM","WNI",null,null,null,null,0,0]
[4082,null,null,null,0,0,null,null,null,null,"ISLAM","WNI",null,null,null,null,0,0]
[4083,null,null,null,0,0,null,null,null,null,"ISLAM","WNI",null,null,null,null,0,0]
[4084,null,null,null,0,0,null,null,null,null,"ISLAM","WNI",null,null,null,null,0,0]
[4085,null,null,null,0,0,null,null,null,null,"ISLAM","WNI",null,null,null,null,0,0]
[4086,null,null,null,0,0,null,null,null,null,"ISLAM","WNI",null,null,null,null,0,0]
[4087,null,null,null,0,0,null,null,null,null,"ISLAM","WNI",null,null,null,null,0,0]
[4088,null,null,null,0,0,null,null,null,null,"ISLAM","WNI",null,null,null,null,0,0]
[4089,null,null,null,0,0,null,null,null,null,"ISLAM","WNI",null,null,null,null,0,0]
[4090,null,null,null,0,0,null,null,null,null,"ISLAM","WNI",null,null,null,null,0,0]
[4091,null,null,null,0,0,null,null,null,null,"ISLAM","WNI",null,null,null,null,0,0]
[4092,null,null,null,0,0,null,null,null,null,"ISLAM","WNI",null,null,null,null,0,0]
[4093,null,null,null,0,0,null,null,null,null,"ISLAM","WNI",null,null,null,null,0,0]
[4094,null,null,null,0,0,null,null,null,null,"ISLAM","WNI",null,null,null,null,0,0]
[4095,null,null,null,0,0,null,null,null,null,"ISLAM","WNI",null,null,null,null,0,0]
[4096,null,null,null,0,0,null,null,null,null,"ISLAM","WNI",null,null,null,null,0,0]
[4097,null,null,null,0,0,null,null,null,null,"ISLAM","WNI",null,null,null,null,0,0]
[4098,null,null,null,0,0,null,null,null,null,"ISLAM","WNI",null,null,null,null,0,0]
[4099,null,null,null,0,0,null,null,null,null,"ISLAM","WNI",null,null,null,null,0,0]
[4100,null,null,null,0,0,null,null,null,null,"ISLAM","WNI",null,null,null,null,0,0]
[4101,null,null,null,0,0,null,null,null,null,"ISLAM","WNI",null,null,null,null,0,0]
[4102,null,null,null,0,0,null,null,null,null,"ISLAM","WNI",null,null,null,null,0,0]
[4103,null,null,null,0,0,null,null,null,null,"ISLAM","WNI",null,null,null,null,0,0]
[4104,null,null,null,0,0,null,null,null,null,"ISLAM","WNI",null,null,null,null,0,0]
[4105,null,null,null,0,0,null,null,null,null,"ISLAM","WNI",null,null,null,null,0,0]
[4106,null,null,null,0,0,null,null,null,null,"ISLAM","WNI",null,null,null,null,0,0]
[4107,null,null,null,0,0,null,null,null,null,"ISLAM","WNI",null,null,null,null,0,0]
[4108,null,null,null,0,0,null,null,null,null,"ISLAM","WNI",null,null,null,null,0,0]
[4109,null,null,null,0,0,null,null,null,null,"ISLAM","WNI",null,null,null,null,0,0]
[4110,null,null,null,0,0,null,null,null,null,"ISLAM","WNI",null,null,null,null,0,0]
[4111,null,null,null,0,0,null,null,null,null,"ISLAM","WNI",null,null,null,null,0,0]
[4112,null,null,null,0,0,null,null,null,null,"ISLAM","WNI",null,null,null,null,0,0]
[4113,null,null,null,0,0,null,null,null,null,"ISLAM","WNI",null,null,null,null,0,0]
[4114,null,null,null,0,0,null,null,null,null,"ISLAM","WNI",null,null,null,null,0,0]
[4115,null,null,null,0,0,null,null,null,null,"ISLAM","WNI",null,null,null,null,0,0]
[4116,null,null,null,0,0,null,null,null,null,"ISLAM","WNI",null,null,null,null,0,0]
[4117,null,null,null,0,0,null,null,null,null,"ISLAM","WNI",null,null,null,null,0,0]
[4118,null,null,null,0,0,null,null,null,null,"ISLAM","WNI",null,null,null,null,0,0]
[4119,null,null,null,0,0,null,null,null,null,"ISLAM","WNI",null,null,null,null,0,0]
[4120,null,null,null,0,0,null,null,null,null,"ISLAM","WNI",null,null,null,null,0,0]
[4121,null,null,null,0,0,null,null,null,null,"ISLAM","WNI",null,null,null,null,0,0]
[4122,null,null,null,0,0,null,null,null,null,"ISLAM","WNI",null,null,null,null,0,0]
[4123,null,null,null,0,0,null,null,null,null,"ISLAM","WNI",null,null,null,null,0,0]
[4124,null,null,null,0,0,null,null,null,null,"ISLAM","WNI",null,null,null,null,0,0]
[4125,null,null,null,0,0,null,null,null,null,"ISLAM","WNI",null,null,null,null,0,0]
[4126,null,null,null,0,0,null,null,null,null,"ISLAM","WNI",null,null,null,null,0,0]
[4127,null,null,null,0,0,null,null,null,null,"ISLAM","WNI",null,null,null,null,0,0]
[4128,null,null,null,0,0,null,null,null,null,"ISLAM","WNI",null,null,null,null,0,0]
[4129,null,null,null,0,0,null,null,null,null,"ISLAM","WNI",null,null,null,null,0,0]
[4130,null,null,null,0,0,null,null,null,null,"ISLAM","WNI",null,null,null,null,0,0]
[4131,null,null,null,{"$f":"AQ136","v":0},{"$f":"QG136","v":0},null,null,null,null,"ISLAM","WNI",null,null,null,null,{"$f":"AT136","v":0},{"$f":"AU136","v":0}]
[4132,null,null,null,0,0,null,null,null,null,"ISLAM","WNI",null,null,null,null,0,0]
[4133,null,null,null,0,0,null,null,null,null,"ISLAM","WNI",null,null,null,null,0,0]
[4134,null,null,null,0,0,null,null,null,null,"ISLAM","WNI",null,null,null,null,0,0]
[4135,null,null,null,0,0,null,null,null,null,"ISLAM","WNI",null,null,null,null,0,0]
[4136,null,null,null,0,0,null,null,null,null,"ISLAM","WNI",null,null,null,null,0,0]
[4137,null,null,null,0,0,null,null,null,null,"ISLAM","WNI",null,null,null,null,0,0]
[4138,"FITRI NUR AINI",null,null,0,0,null,"P","LUMAJANG",null,"ISLAM","WNI",2,0,0,null,0,0,null,null,null,null,null,null,null,null,null,null,null,null,null,null,null,null,null,null,null,null,null,null,null,null,null,null,null,null,null,null,null,null,null,null,null,null,null,null,null,null,null,null,null,null,null,null,null,null,null,null,null,"2017/18",42.9,144,null,null,null,null,null,null,null,null,null,null,null,null,null,null,null,null,null,"*"]
[4139,null,null,null,0,0,null,null,null,null,"ISLAM","WNI",null,null,null,null,0,0]
[4140,null,null,null,0,0,null,null,null,null,"ISLAM","WNI",null,null,null,null,0,0]
[4141,null,null,null,0,0,null,null,null,null,"ISLAM","WNI",null,null,null,null,0,0]
[4142,null,null,null,0,0,null,null,null,null,"ISLAM","WNI",null,null,null,null,0,0]
[4143,null,null,null,0,0,null,null,null,null,"ISLAM","WNI",null,null,null,null,0,0]
[4144,null,null,null,0,0,null,null,null,null,"ISLAM","WNI",null,null,null,null,0,0]
[4145,null,null,null,0,0,null,null,null,null,"ISLAM","WNI",null,null,null,null,0,0]
[4146,null,null,null,0,0,null,null,null,null,"ISLAM","WNI",null,null,null,null,0,0]
[4147,null,null,null,0,0,null,null,null,null,"ISLAM","WNI",null,null,null,null,0,0]
[4148,null,null,null,0,0,null,null,null,null,"ISLAM","WNI",null,null,null,null,0,0]
[4149,null,null,null,0,0,null,null,null,null,"ISLAM","WNI",null,null,null,null,0,0]
[4150,null,null,null,0,0,null,null,null,null,"ISLAM","WNI",null,null,null,null,0,0]
[4151,null,null,null,0,0,null,null,null,null,"ISLAM","WNI",null,null,null,null,0,0]
[4152,null,null,null,0,0,null,null,null,null,"ISLAM","WNI",null,null,null,null,0,0]
[4153,null,null,null,0,0,null,null,null,null,"ISLAM","WNI",null,null,null,null,0,0]
[4154,null,null,null,0,0,null,null,null,null,"ISLAM","WNI",null,null,null,null,0,0]
[4155,null,null,null,0,0,null,null,null,null,"ISLAM","WNI",null,null,null,null,0,0]
[4156,null,null,null,0,0,null,null,null,null,"ISLAM","WNI",null,null,null,null,0,0]
[4157,null,null,null,0,0,null,null,null,null,"ISLAM","WNI",null,null,null,null,0,0]
[4158,null,null,null,0,0,null,null,null,null,"ISLAM","WNI",null,null,null,null,0,0]
[4159,null,null,null,0,0,null,null,null,null,"ISLAM","WNI",null,null,null,null,0,0]
[4160,null,null,null,0,0,null,null,null,null,"ISLAM","WNI",null,null,null,null,0,0]
[4161,null,null,null,0,0,null,null,null,null,"ISLAM","WNI",null,null,null,null,0,0]
[4162,null,null,null,0,0,null,null,null,null,"ISLAM","WNI",null,null,null,null,0,0]
[4163,null,null,null,0,0,null,null,null,null,"ISLAM","WNI",null,null,null,null,0,0]
[4164,null,null,null,0,0,null,null,null,null,"ISLAM","WNI",null,null,null,null,0,0]
[4165,null,null,null,0,0,null,null,null,null,"ISLAM","WNI",null,null,null,null,0,0]
[4166,null,null,null,0,0,null,null,null,null,"ISLAM","WNI",null,null,null,null,0,0]
[4167,null,null,null,0,0,null,null,null,null,"ISLAM","WNI",null,null,null,null,0,0]
[4168,null,null,null,0,0,null,null,null,null,"ISLAM","WNI",null,null,null,null,0,0]
[4169,null,null,null,0,0,null,null,null,null,"ISLAM","WNI",null,null,null,null,0,0]
[4170,null,null,null,0,0,null,null,null,null,"ISLAM","WNI",null,null,null,null,0,0]
[4171,null,null,null,0,0,null,null,null,null,"ISLAM","WNI",null,null,null,null,0,0]
[4172,null,null,null,0,0,null,null,null,null,"ISLAM","WNI",null,null,null,null,0,0]
[4173,null,null,null,0,0,null,null,null,null,"ISLAM","WNI",null,null,null,null,0,0]
[4174,null,null,null,0,0,null,null,null,null,"ISLAM","WNI",null,null,null,null,0,0]
[4175,null,null,null,0,0,null,null,null,null,"ISLAM","WNI",null,null,null,null,0,0]
[4176,"ADELINA KHILYATUL MILLAH",null,null,0,0,"ADEL","P","LUMAJANG","2004-12-03","ISLAM","WNI","K",null,null,"Jawa",0,0,null,null,null,"Orang Tua",null,null,null,null,null,null,null,null,null,null,null,null,null,null,null,null,null,null,null,null,null,null,null,null,null,null,null,null,null,null,null,null,null,null,null,null,null,null,null,null,null,null,null,null,null,null,null,"2017/18",37.299999999999997,144,null,null,null,null,null,null,null,null,null,null,null,null,null,null,null,null,null,"*"]
[4177,null,null,null,0,0,null,null,null,null,"ISLAM","WNI",null,null,null,null,0,0]
[4178,null,null,null,0,0,null,null,null,null,"ISLAM","WNI",null,null,null,null,0,0]
[4179,null,null,null,0,0,null,null,null,null,"ISLAM","WNI",null,null,null,null,0,0]
[4180,null,null,null,0,0,null,null,null,null,"ISLAM","WNI",null,null,null,null,0,0]
[4181,null,null,null,0,0,null,null,null,null,"ISLAM","WNI",null,null,null,null,0,0]
[4182,null,null,null,0,0,null,null,null,null,"ISLAM","WNI",null,null,null,null,0,0]
[4183,null,null,null,0,0,null,null,null,null,"ISLAM","WNI",null,null,null,null,0,0]
[4184,null,null,null,0,0,null,null,null,null,"ISLAM","WNI",null,null,null,null,0,0]
[4185,null,null,null,0,0,null,null,null,null,"ISLAM","WNI",null,null,null,null,0,0]
[4186,null,null,null,0,0,null,null,null,null,"ISLAM","WNI",null,null,null,null,0,0]
[4187,null,null,null,0,0,null,null,null,null,"ISLAM","WNI",null,null,null,null,0,0]
[4188,null,null,null,0,0,null,null,null,null,"ISLAM","WNI",null,null,null,null,0,0]
[4189,null,null,null,0,0,null,null,null,null,"ISLAM","WNI",null,null,null,null,0,0]
[4190,null,null,null,0,0,null,null,null,null,"ISLAM","WNI",null,null,null,null,0,0]
[4191,null,null,null,0,0,null,null,null,null,"ISLAM","WNI",null,null,null,null,0,0]
[4192,null,null,null,0,0,null,null,null,null,"ISLAM","WNI",null,null,null,null,0,0]
[4193,null,null,null,0,0,null,null,null,null,"ISLAM","WNI",null,null,null,null,0,0]
[4194,null,null,null,0,0,null,null,null,null,"ISLAM","WNI",null,null,null,null,0,0]
[4195,null,null,null,{"$f":"AQ200","v":0},{"$f":"QG200","v":0},null,null,null,null,"ISLAM","WNI",null,null,null,null,{"$f":"AT200","v":0},{"$f":"AU200","v":0}]
[4196,null,null,null,0,0,null,null,null,null,"ISLAM","WNI",null,null,null,null,0,0]
[4197,null,null,null,0,0,null,null,null,null,"ISLAM","WNI",null,null,null,null,0,0]
[4198,null,null,null,0,0,null,null,null,null,"ISLAM","WNI",null,null,null,null,0,0]
[4199,null,null,null,0,0,null,null,null,null,"ISLAM","WNI",null,null,null,null,0,0]
[4200,null,null,null,0,0,null,null,null,null,"ISLAM","WNI",null,null,null,null,0,0]
[4201,null,null,null,0,0,null,null,null,null,"ISLAM","WNI",null,null,null,null,0,0]
[4202,null,null,null,0,0,null,null,null,null,"ISLAM","WNI",null,null,null,null,0,0]
[4203,null,null,null,0,0,null,null,null,null,"ISLAM","WNI",null,null,null,null,0,0]
[4204,"AKHMAD AMBARI",null,null,0,0,null,"L",null,null,"ISLAM","WNI",null,null,null,null,0,0,null,null,null,null,null,null,null,null,null,null,null,null,null,null,null,null,null,null,null,null,null,null,null,null,null,null,null,null,null,null,null,null,null,null,null,null,null,null,null,null,null,null,null,null,null,null,null,null,null,null,null,"2017/18",58.6,148,null,null,null,null,null,null,null,null,null,null,null,null,null,null,null,null,null,"*"]
[4205,"ACHMAD MAULANA ADITYA FAHREZA",null,null,0,0,"REZA","L","2005-06-17","LUMAJANG","ISLAM","WNI",2,0,0,"JAWA",0,0,null,null,"LABRUK KIDUL","ORANGTUA","1-3 Km",2012,null,"MUHAMMAD MUHLISIN","ASTUTIK","SLTA","SLTA","Pengusaha/Wiraswasta","Peg.Swasta",null,null,null,null,null,null,null,null,null,null,null,null,null,null,null,null,null,null,null,null,null,null,null,null,null,null,null,null,null,null,null,null,null,null,null,null,null,null,"2017/19",39.200000000000003,138,null,null,null,null,null,null,null,null,null,null,null,null,null,null,null,null,null,"*"]
[4206,"AHMAD RIZKI JAELANI",null,null,0,0,null,"L",null,null,"ISLAM","WNI",null,null,null,null,0,0,null,null,null,null,null,null,null,null,null,null,null,null,null,null,null,null,null,null,null,null,null,null,null,null,null,null,null,null,null,null,null,null,null,null,null,null,null,null,null,null,null,null,null,null,null,null,null,null,null,null,null,"2017/18",36.299999999999997,145,null,null,null,null,null,null,null,null,null,null,null,null,null,null,null,null,null,"*"]
[4207,"AULIA SAFIRA",null,null,0,0,null,"P","2006-07-06","PROBOLINGGO","ISLAM","WNI",null,null,null,null,0,0,null,null,"MOJOSARI","ORANGTUA","< 1 Km",2012,null,null,null,null,null,null,null,null,null,null,null,null,null,null,null,null,null,null,null,null,null,null,null,null,null,null,null,null,null,null,null,null,null,null,null,null,null,null,null,null,null,null,null,null,null,null,39.5,154,null,null,null,null,null,null,null,null,null,null,null,null,null,null,null,null,null,"*"]
[4208,"BIMA LUTFIYAN FIRDAUS",null,null,0,0,null,"L",null,null,"ISLAM","WNI",null,null,null,null,0,0,null,null,null,null,null,null,null,null,null,null,null,null,null,null,null,null,null,null,null,null,null,null,null,null,null,null,null,null,null,null,null,null,null,null,null,null,null,null,null,null,null,null,null,null,null,null,null,null,null,null,null,"2017/18",35.200000000000003,136,null,null,null,null,null,null,null,null,null,null,null,null,null,null,null,null,null,"*"]
[4209,null,null,null,0,0,null,null,null,null,"ISLAM","WNI",null,null,null,null,0,0]
[4210,"DIVA SALWA SALSABILA",null,null,0,0,"SALSA","P","2006-06-08","LUMAJANG","ISLAM","WNI",null,null,null,null,0,0,null,null,null,null,null,null,null,"BUDI PURWANTO","HANA HANIFAH","SLTA","SLTA","Peg.Swasta","Pengusaha/Wiraswasta",null,null,null,null,null,null,null,null,null,null,null,null,null,null,null,null,null,null,null,null,null,null,null,null,null,null,null,null,null,null,null,null,null,null,null,null,null,null,"2017/18",33.5,145,null,null,null,null,null,null,null,null,null,null,null,null,null,null,null,null,null,"*"]
[4211,null,null,null,0,0,null,null,null,null,"ISLAM","WNI",null,null,null,null,0,0]
[4212,null,null,null,0,0,null,null,null,null,"ISLAM","WNI",null,null,null,null,0,0]
[4213,"HAMALNA DEWI NURHASANAH",null,null,0,0,null,"P","2005-05-22","LUMAJANG","ISLAM","WNI",null,null,null,null,0,0,null,null,null,null,null,null,null,"SUKOYO",null,null,null,null,null,null,null,null,null,null,null,null,null,null,null,null,null,null,null,null,null,null,null,null,null,null,null,null,null,null,null,null,null,null,null,null,null,null,null,null,null,null,null,"2017/18",20.7,133,null,null,null,null,null,null,null,null,null,null,null,null,null,null,null,null,null,"*"]
[4214,"INDAH ILMAWATUL FADIYAH",null,null,0,0,null,"P",null,null,"ISLAM","WNI",null,null,null,null,0,0,null,null,null,null,null,null,null,null,null,null,null,null,null,null,null,null,null,null,null,null,null,null,null,null,null,null,null,null,null,null,null,null,null,null,null,null,null,null,null,null,null,null,null,null,null,null,null,null,null,null,null,"2017/18",32.9,131,null,null,null,null,null,null,null,null,null,null,null,null,null,null,null,null,null,"*"]
[4215,"IZZA AFKARINA",null,null,0,0,null,"P",null,null,"ISLAM","WNI",null,null,null,null,0,0,null,null,null,null,null,null,null,null,null,null,null,null,null,null,null,null,null,null,null,null,null,null,null,null,null,null,null,null,null,null,null,null,null,null,null,null,null,null,null,null,null,null,null,null,null,null,null,null,null,null,null,"2017/18",40.299999999999997,147,null,null,null,null,null,null,null,null,null,null,null,null,null,null,null,null,null,"*"]
[4216,"JESIKA NUR SANJANA",null,null,0,0,null,"P",null,null,"ISLAM","WNI",null,null,null,null,0,0,null,null,null,null,null,null,null,null,null,null,null,null,null,null,null,null,null,null,null,null,null,null,null,null,null,null,null,null,null,null,null,null,null,null,null,null,null,null,null,null,null,null,null,null,null,null,null,null,null,null,null,"2017/18",30,143,null,null,null,null,null,null,null,null,null,null,null,null,null,null,null,null,null,"*"]
[4217,"KHAFIT I'ZAZ ABIYYU",null,null,0,0,null,"L",null,null,"ISLAM","WNI",null,null,null,null,0,0,null,null,null,null,null,null,null,null,null,null,null,null,null,null,null,null,null,null,null,null,null,null,null,null,null,null,null,null,null,null,null,null,null,null,null,null,null,null,null,null,null,null,null,null,null,null,null,null,null,null,null,"2017/18",30.6,138,null,null,null,null,null,null,null,null,null,null,null,null,null,null,null,null,null,"*"]
[4218,"MAYANGTIKA ANIL HAWA",null,null,0,0,null,"P",null,null,"ISLAM","WNI",null,null,null,null,0,0,null,null,null,null,null,null,null,null,null,null,null,null,null,null,null,null,null,null,null,null,null,null,null,null,null,null,null,null,null,null,null,null,null,null,null,null,null,null,null,null,null,null,null,null,null,null,null,null,null,null,null,"2017/18",36.799999999999997,144,null,null,null,null,null,null,null,null,null,null,null,null,null,null,null,null,null,"*"]
[4219,"MIR`ATUL KHOIROH",null,null,0,0,null,"P",null,null,"ISLAM","WNI",null,null,null,null,0,0,null,null,null,null,null,null,null,null,null,null,null,null,null,null,null,null,null,null,null,null,null,null,null,null,null,null,null,null,null,null,null,null,null,null,null,null,null,null,null,null,null,null,null,null,null,null,null,null,null,null,null,"2017/18",32.299999999999997,141,null,null,null,null,null,null,null,null,null,null,null,null,null,null,null,null,null,"*"]
[4220,"MOCHAMAD ABIR EKA FIRMANSYA",null,null,0,0,null,"L",null,null,"ISLAM","WNI",null,null,null,null,0,0,null,null,null,null,null,null,null,null,null,null,null,null,null,null,null,null,null,null,null,null,null,null,null,null,null,null,null,null,null,null,null,null,null,null,null,null,null,null,null,null,null,null,null,null,null,null,null,null,null,null,null,"2017/18",28.7,136,null,null,null,null,null,null,null,null,null,null,null,null,null,null,null,null,null,"*"]
[4221,"MOHAMMAD DANANG PRAYOGA",null,null,0,0,null,"L",null,null,"ISLAM","WNI",null,null,null,null,0,0,null,null,null,null,null,null,null,null,null,null,null,null,null,null,null,null,null,null,null,null,null,null,null,null,null,null,null,null,null,null,null,null,null,null,null,null,null,null,null,null,null,null,null,null,null,null,null,null,null,null,null,"2017/18",42.9,137,null,null,null,null,null,null,null,null,null,null,null,null,null,null,null,null,null,"*"]
[4222,"MUHAMAD DAIFA ROBBIT ATTIJANI",null,null,0,0,null,"L",null,null,"ISLAM","WNI",null,null,null,null,0,0,null,null,null,null,null,null,null,null,null,null,null,null,null,null,null,null,null,null,null,null,null,null,null,null,null,null,null,null,null,null,null,null,null,null,null,null,null,null,null,null,null,null,null,null,null,null,null,null,null,null,null,"2017/18",45.4,151,null,null,null,null,null,null,null,null,null,null,null,null,null,null,null,null,null,"*"]
[4223,"MUHAMMAD NOVAL NURSASI",null,null,0,0,null,"L",null,null,"ISLAM","WNI",null,null,null,null,0,0,null,null,null,null,null,null,null,null,null,null,null,null,null,null,null,null,null,null,null,null,null,null,null,null,null,null,null,null,null,null,null,null,null,null,null,null,null,null,null,null,null,null,null,null,null,null,null,null,null,null,null,"2017/18",27,132,null,null,null,null,null,null,null,null,null,null,null,null,null,null,null,null,null,"*"]
[4224,"MUHAMMAD NUR KHOLIS",null,null,0,0,null,"L",null,null,"ISLAM","WNI",null,null,null,null,0,0,null,null,null,null,null,null,null,null,null,null,null,null,null,null,null,null,null,null,null,null,null,null,null,null,null,null,null,null,null,null,null,null,null,null,null,null,null,null,null,null,null,null,null,null,null,null,null,null,null,null,null,"2017/18",31.1,135,null,null,null,null,null,null,null,null,null,null,null,null,null,null,null,null,null,"*"]
[4225,"NAFISSATUL KHOIROH",null,null,0,0,null,"P",null,null,"ISLAM","WNI",null,null,null,null,0,0,null,null,null,null,null,null,null,null,null,null,null,null,null,null,null,null,null,null,null,null,null,null,null,null,null,null,null,null,null,null,null,null,null,null,null,null,null,null,null,null,null,null,null,null,null,null,null,null,null,null,null,"2017/18",63.2,147,null,null,null,null,null,null,null,null,null,null,null,null,null,null,null,null,null,"*"]
[4226,"NAJWA MUFARRICHA",null,null,0,0,null,"P",null,null,"ISLAM","WNI",null,null,null,null,0,0,null,null,null,null,null,null,null,null,null,null,null,null,null,null,null,null,null,null,null,null,null,null,null,null,null,null,null,null,null,null,null,null,null,null,null,null,null,null,null,null,null,null,null,null,null,null,null,null,null,null,null,"2017/18",31.3,138,null,null,null,null,null,null,null,null,null,null,null,null,null,null,null,null,null,"*"]
[4227,"NAUFAL DAFFA ANWAR",null,null,0,0,null,"L",null,null,"ISLAM","WNI",null,null,null,null,0,0,null,null,null,null,null,null,null,null,null,null,null,null,null,null,null,null,null,null,null,null,null,null,null,null,null,null,null,null,null,null,null,null,null,null,null,null,null,null,null,null,null,null,null,null,null,null,null,null,null,null,null,"2017/18",47.9,153,null,null,null,null,null,null,null,null,null,null,null,null,null,null,null,null,null,"*"]
[4228,"NIKE CANDRA KURNIA DEWI",null,null,0,0,null,"P",null,null,"ISLAM","WNI",null,null,null,null,0,0,null,null,null,null,null,null,null,null,null,null,null,null,null,null,null,null,null,null,null,null,null,null,null,null,null,null,null,null,null,null,null,null,null,null,null,null,null,null,null,null,null,null,null,null,null,null,null,null,null,null,null,"2017/18",27.4,139,null,null,null,null,null,null,null,null,null,null,null,null,null,null,null,null,null,"*"]
[4229,"NUR AFNI DWI MAULIDIYAH",null,null,0,0,null,null,null,null,"ISLAM","WNI",null,null,null,null,0,0,null,null,null,null,null,null,null,null,null,null,null,null,null,null,null,null,null,null,null,null,null,null,null,null,null,null,null,null,null,null,null,null,null,null,null,null,null,null,null,null,null,null,null,null,null,null,null,null,null,null,null,"2017/18",43.6,148,null,null,null,null,null,null,null,null,null,null,null,null,null,null,null,null,null,"*"]
[4230,"SAFIRA FIRNANDA ARTAMEVIA",null,null,0,0,null,"P",null,null,"ISLAM","WNI",null,null,null,null,0,0,null,null,null,null,null,null,null,null,null,null,null,null,null,null,null,null,null,null,null,null,null,null,null,null,null,null,null,null,null,null,null,null,null,null,null,null,null,null,null,null,null,null,null,null,null,null,null,null,null,null,null,"2017/18",33.200000000000003,137,null,null,null,null,null,null,null,null,null,null,null,null,null,null,null,null,null,"*"]
[4231,"SITI WIFAQOTUL IMAMATUR ROHMAH",null,null,0,0,null,"P",null,null,"ISLAM","WNI",null,null,null,null,0,0,null,null,null,null,null,null,null,null,null,null,null,null,null,null,null,null,null,null,null,null,null,null,null,null,null,null,null,null,null,null,null,null,null,null,null,null,null,null,null,null,null,null,null,null,null,null,null,null,null,null,null,"2017/18",45.6,145,null,null,null,null,null,null,null,null,null,null,null,null,null,null,null,null,null,"*"]
[4232,null,null,null,0,0,null,null,null,null,"ISLAM","WNI",null,null,null,null,0,0]
[4233,"YUNITA WARDATUL CHOIRIYAH",null,null,0,0,null,"P",null,null,"ISLAM","WNI",null,null,null,null,0,0,null,null,null,null,null,null,null,null,null,null,null,null,null,null,null,null,null,null,null,null,null,null,null,null,null,null,null,null,null,null,null,null,null,null,null,null,null,null,null,null,null,null,null,null,null,null,null,null,null,null,null,"2017/18",39.1,146,null,null,null,null,null,null,null,null,{"$f":"RIGHT(CD238,4)","v":"0"},{"$f":"PR238","v":0},null,null,null,null,null,null,null,"*"]
[4234,"ACHMAD ROZALI",null,null,0,0,"ROZALI","L","2005-09-02",null,"ISLAM","WNI","K",null,null,"JAWA",0,0,null,null,null,null,null,2012,null,"ABD. GHOFUR",null,null,null,null,null,null,null,null,null,null,null,null,null,null,null,null,null,null,"2012/13",null,null,null,null,"2013/14",null,null,null,null,"2014/15",null,null,null,null,"2015/16",null,null,null,null,"2016/17",null,null,null,null,"2017/18",29.1,139,"-","-",null,null,null,null,null,null,{"$f":"RIGHT(CD239,4)","v":"2018"},{"$f":"PR239","v":"Nomor : 001/Mi.13.05.162/PP.01.1/06/2018"},null,null,null,null,null,null,null,"*",null,null,null,null,null,null,null,null,null,null,null,null,null,null,null,null,null,null,null,null,null,null,null,null,null,null,null,null,null,null,null,null,null,null,null,null,null,null,null,null,null,null,null,null,null,null,null,null,null,null,null,null,null,null,null,null,null,null,null,null,null,null,null,null,null,null,null,null,null,null,null,null,null,null,null,null,null,null,null,null,null,null,null,null,null,null,null,null,null,null,null,null,null,null,null,null,null,null,null,null,null,null,null,null,null,null,null,null,null,null,null,null,null,null,null,null,null,null,null,null,null,null,null,null,null,null,null,null,null,null,null,null,null,null,null,null,null,null,null,null,null,null,null,null,null,null,null,null,null,null,null,null,null,null,null,null,null,null,null,null,null,null,null,null,null,null,null,null,null,null,null,null,67,75,71,72,69,75,63,71,null,null,65,70,63,73,71,75,65,74,66,76,70,77,70,77,65,76,60,65,65,64,null,null,null,null,null,null,null,null,null,null,null,null,null,null,null,null,null,null,null,null,null,null,null,null,null,null,null,80,77,79,77,80,77,75,76,null,null,74,77,76,75,75,74,74,74,74,76,75,76,75,76,75,76,72,74,55,74,null,null,null,null,null,null,null,null,null,null,null,null,null,null,null,null,null,null,null,null,null,null,null,null,null,null,null,76,65,76,65,76,65,71,65,null,null,72,65,73,65,71,59.96,71,35.28,72,43.73,75,65,75,65,72,65,72,65,73,65,null,null,null,null,null,null,null,null,null,null,null,null,null,null,null,null,null,null,null,null,null,null,null,null,null,null,null,"Nomor : 001/Mi.13.05.162/PP.01.1/06/2018","Lumajang","2018-06-04",null,null,null,null,null,null,null,null,null,null,null,null,null,null,73,75,73,75,73.320000000000007,75.400000000000006,69.959999999999994,71.2,null,null,70.28,71.599999999999994,69.199999999999989,72,66.315200000000004,70.552000000000007,48.355199999999996,57.071999999999996,57.683599999999998,66.986000000000004,69.680000000000007,72.8,72.680000000000007,74.599999999999994,76.36,79.2,65.959999999999994,66.2,67.88,68.599999999999994]
[4235,"AHMAD ZAINURI",null,null,0,0,null,"L",null,null,"ISLAM","WNI",null,null,null,null,{"$f":"AT240","v":0},{"$f":"AU240","v":0},null,null,null,null,null,null,null,null,null,null,null,null,null,null,null,null,null,null,null,null,null,null,null,null,null,null,null,null,null,null,null,null,null,null,null,null,null,null,null,null,null,null,null,null,null,null,null,null,null,null,null,"2017/18",41.4,138,null,null,null,null,null,null,null,null,{"$f":"RIGHT(CD240,4)","v":"0"},{"$f":"PR240","v":0},null,null,null,null,null,null,null,"*"]
[4236,"AHMAT ZAINURI",null,null,0,0,"ZAINURI","L","2006-01-01","LUMAJANG","ISLAM","WNI",null,null,null,"JAWA",0,0,null,null,"TOMPOKERSAN",null,null,null,null,"HANDOYO","MASILAH","SLTA","<=SLTP","Pengusaha/Wiraswasta","IBU RUMAH TANGGA",null,null,null,null,null,null,null,null,null,null,null,null,null,null,null,null,null,null,null,null,null,null,null,null,null,null,null,null,null,null,null,null,null,null,null,null,null,null,null,34.9,141,null,null,null,null,null,null,null,null,"0",0,null,null,null,null,null,null,null,"*"]
[4237,null,null,null,0,0,null,null,null,null,"ISLAM","WNI",null,null,null,null,0,0,null,null,null,null,null,null,null,null,null,null,null,null,null,null,null,null,null,null,null,null,null,null,null,null,null,null,null,null,null,null,null,null,null,null,null,null,null,null,null,null,null,null,null,null,null,null,null,null,null,null,null,null,null,null,null,null,null,null,null,null,null,null,"0",0]
[4238,"DESI NATALIA SAPUTRI",null,null,0,0,null,"P","2005-12-24",null,"ISLAM","WNI",null,null,null,null,0,0,null,null,null,null,null,null,null,null,null,null,null,null,null,null,null,null,null,null,null,null,null,null,null,null,null,null,null,null,null,null,null,null,null,null,null,null,null,null,null,null,null,null,null,null,null,null,"2017/18",28.9,131,null,null,null,null,null,null,null,null,null,null,null,null,null,"0",0,null,null,null,null,null,null,null,"*"]
[4239,"ERINA DWI RAMADHANI",null,null,0,0,null,null,null,null,"ISLAM","WNI",null,null,null,null,0,0,null,null,null,null,null,null,null,null,null,null,null,null,null,null,null,null,null,null,null,null,null,null,null,null,null,null,null,null,null,null,null,null,null,null,null,null,null,null,null,null,null,null,null,null,null,null,null,null,null,null,null,"2017/18",44.7,152,null,null,null,null,null,null,null,null,"0",0,null,null,null,null,null,null,null,"*"]
[4240,"FILSAFAH KARINA NUR ALIFIA",null,null,0,0,"KARIN","P","2005-10-04","LUMAJANG","ISLAM","WNI",null,null,null,null,0,0,null,null,null,null,null,null,null,"HANDOYO",null,null,null,null,null,null,null,null,null,null,null,null,null,null,null,null,null,null,null,null,null,null,null,null,null,null,null,null,null,null,null,null,null,null,null,null,null,null,null,null,null,null,null,"2017/18",40.799999999999997,150,null,null,null,null,null,null,null,null,"0",0,null,null,null,null,null,null,null,"*"]
[4241,"KHUSNI CAHYONO",null,null,0,0,null,"L","2005-07-14",null,"ISLAM","WNI",null,null,null,null,0,0,null,null,null,null,null,null,null,null,null,null,null,null,null,null,null,null,null,null,null,null,null,null,null,null,null,null,null,null,null,null,null,null,null,null,null,null,null,null,null,null,null,null,null,null,null,null,"2017/18",28.5,143,null,null,null,null,null,null,null,null,null,null,null,null,null,"0",0,null,null,null,null,null,null,null,"*"]
[4242,"LAILA AFIFAHTUR ROHMAH",null,null,0,0,null,"P",null,null,"ISLAM","WNI",null,null,null,null,0,0,null,null,null,null,null,null,null,null,null,null,null,null,null,null,null,null,null,null,null,null,null,null,null,null,null,null,null,null,null,null,null,null,null,null,null,null,null,null,null,null,null,null,null,null,null,null,null,null,null,null,null,"2017/18",36.700000000000003,140,null,null,null,null,null,null,null,null,"0",0,null,null,null,null,null,null,null,"*"]
[4243,"LIA DAHLIA",null,null,0,0,null,"P",null,null,"ISLAM","WNI",null,null,null,null,0,0,null,null,null,null,null,null,null,null,null,null,null,null,null,null,null,null,null,null,null,null,null,null,null,null,null,null,null,null,null,null,null,null,null,null,null,null,null,null,null,null,null,null,null,null,null,null,null,null,null,null,null,"2017/18",42.9,145,null,null,null,null,null,null,null,null,"0",0,null,null,null,null,null,null,null,"*"]
[4244,"MUHAMMAD ARIS MAHENDRA",null,null,0,0,null,null,null,null,"ISLAM","WNI",null,null,null,null,0,0,null,null,null,null,null,null,null,null,null,null,null,null,null,null,null,null,null,null,null,null,null,null,null,null,null,null,null,null,null,null,null,null,null,null,null,null,null,null,null,null,null,null,null,null,null,null,null,null,null,null,null,"2017/18",25.7,130,null,null,null,null,null,null,null,null,"0",0,null,null,null,null,null,null,null,"*"]
[4245,"MIFTAKHUS SURUR",null,null,0,0,null,"L",null,null,"ISLAM","WNI",null,null,null,null,0,0,null,null,null,null,null,null,null,null,null,null,null,null,null,null,null,null,null,null,null,null,null,null,null,null,null,null,null,null,null,null,null,null,null,null,null,null,null,null,null,null,null,null,null,null,null,null,null,null,null,null,null,"2017/18",34.700000000000003,145,null,null,null,null,null,null,null,null,"0",0,null,null,null,null,null,null,null,"*"]
[4246,"MOCHAMAD ALIFAMADIO DWI ANANTA",null,null,0,0,null,"L",null,null,"ISLAM","WNI",null,null,null,null,0,0,null,null,null,null,null,null,null,null,null,null,null,null,null,null,null,null,null,null,null,null,null,null,null,null,null,null,null,null,null,null,null,null,null,null,null,null,null,null,null,null,null,null,null,null,null,null,null,null,null,null,null,"2017/18",38,153,null,null,null,null,null,null,null,null,"0",0,null,null,null,null,null,null,null,"*"]
[4247,"MOCHAMAD ARIEL FRANS TITO",null,null,0,0,null,"L","2005-02-12",null,"ISLAM","WNI",null,null,null,null,0,0,null,null,null,null,null,null,null,null,null,null,null,null,null,null,null,null,null,null,null,null,null,null,null,null,null,null,null,null,null,null,null,null,null,null,null,null,null,null,null,null,null,null,null,null,null,null,"2017/18",45.9,150,null,null,null,null,null,null,null,null,null,null,null,null,null,"0",0,null,null,null,null,null,null,null,"*"]
[4248,"MOHAMAD RIZKY ARDIANTO",null,null,0,0,null,"L",null,null,"ISLAM","WNI",null,null,null,null,0,0,null,null,null,null,null,null,null,null,null,null,null,null,null,null,null,null,null,null,null,null,null,null,null,null,null,null,null,null,null,null,null,null,null,null,null,null,null,null,null,null,null,null,null,null,null,null,null,null,null,null,null,"2017/18",32.700000000000003,137,null,null,null,null,null,null,null,null,"0",0,null,null,null,null,null,null,null,"*"]
[4249,"MUCHAMAD ADITIYA PUTRA FEBRYANSYAH",null,null,0,0,null,"L",null,null,"ISLAM","WNI",null,null,null,null,0,0,null,null,null,null,null,null,null,null,null,null,null,null,null,null,null,null,null,null,null,null,null,null,null,null,null,null,null,null,null,null,null,null,null,null,null,null,null,null,null,null,null,null,null,null,null,null,null,null,null,null,null,"2017/18",30.2,136,null,null,null,null,null,null,null,null,"0",0,null,null,null,null,null,null,null,"*"]
[4250,null,null,null,0,0,null,null,null,null,"ISLAM","WNI",null,null,null,null,0,0,null,null,null,null,null,null,null,null,null,null,null,null,null,null,null,null,null,null,null,null,null,null,null,null,null,null,null,null,null,null,null,null,null,null,null,null,null,null,null,null,null,null,null,null,null,null,null,null,null,null,null,null,null,null,null,null,null,null,null,null,null,null,"0",0]
[4251,"MUHAMAD YOGA HALIM AKBAR",null,null,0,0,null,"L",null,null,"ISLAM","WNI",null,null,null,null,0,0,null,null,null,null,null,null,null,null,null,null,null,null,null,null,null,null,null,null,null,null,null,null,null,null,null,null,null,null,null,null,null,null,null,null,null,null,null,null,null,null,null,null,null,null,null,null,null,null,null,null,null,"2017/18",30.5,143,null,null,null,null,null,null,null,null,"0",0,null,null,null,null,null,null,null,"*"]
[4252,"MUHAMMAD IZZUL AKROM",null,null,0,0,null,"L",null,null,"ISLAM","WNI",null,null,null,null,0,0,null,null,null,null,null,null,null,null,null,null,null,null,null,null,null,null,null,null,null,null,null,null,null,null,null,null,null,null,null,null,null,null,null,null,null,null,null,null,null,null,null,null,null,null,null,null,null,null,null,null,null,"2017/18",43.4,153,null,null,null,null,null,null,null,null,"0",0,null,null,null,null,null,null,null,"*"]
[4253,"MUHAMMAD REZA NURDIANSYAH",null,null,0,0,null,"L",null,null,"ISLAM","WNI",null,null,null,null,0,0,null,null,null,null,null,null,null,null,null,null,null,null,null,null,null,null,null,null,null,null,null,null,null,null,null,null,null,null,null,null,null,null,null,null,null,null,null,null,null,null,null,null,null,null,null,null,null,null,null,null,null,"2017/18",36.1,142,null,null,null,null,null,null,null,null,"0",0,null,null,null,null,null,null,null,"*"]
[4254,"MUHAMMAD YUSUF ABDILLAH",null,null,0,0,null,null,null,null,"ISLAM","WNI",null,null,null,null,0,0,null,null,null,null,null,null,null,null,null,null,null,null,null,null,null,null,null,null,null,null,null,null,null,null,null,null,null,null,null,null,null,null,null,null,null,null,null,null,null,null,null,null,null,null,null,null,null,null,null,null,null,"2017/18",27.9,130,null,null,null,null,null,null,null,null,"0",0,null,null,null,null,null,null,null,"*"]
[4255,"MUHAMMAD ZAYIN FADHLILLAH",null,null,0,0,null,"L",null,null,"ISLAM","WNI",null,null,null,null,0,0,null,null,null,null,null,null,null,null,null,null,null,null,null,null,null,null,null,null,null,null,null,null,null,null,null,null,null,null,null,null,null,null,null,null,null,null,null,null,null,null,null,null,null,null,null,null,null,null,null,null,null,"2017/18",24.2,133,null,null,null,null,null,null,null,null,"0",0,null,null,null,null,null,null,null,"*"]
[4256,"MUKHAMMAD YAASIIN HASAN KHASBULLOH",null,null,0,0,null,"L","2006-01-19",null,"ISLAM","WNI",null,null,null,null,0,0,null,null,null,null,null,null,null,null,null,null,null,null,null,null,null,null,null,null,null,null,null,null,null,null,null,null,null,null,null,null,null,null,null,null,null,null,null,null,null,null,null,null,null,null,null,null,"2017/18",30.5,133,null,null,null,null,null,null,null,null,null,null,null,null,null,"0",0,null,null,null,null,null,null,null,"*"]
[4257,"NAJWA FARISYA BAROROH",null,null,0,0,null,"P","2006-12-25","LUMAJANG","ISLAM","WNI",null,null,null,null,0,0,null,null,null,null,null,null,null,null,null,null,null,null,null,null,null,null,null,null,null,null,null,null,null,null,null,null,null,null,null,null,null,null,null,null,null,null,null,null,null,null,null,null,null,null,null,null,"2017/18",30.5,140,null,null,null,null,null,null,null,null,null,null,null,null,null,"0",0,null,null,null,null,null,null,null,"*"]
[4258,"NURUL ISLAKHATUL MAGHFIROH",null,null,0,0,null,"P",null,null,"ISLAM","WNI",null,null,null,null,0,0,null,null,null,null,null,null,null,null,null,null,null,null,null,null,null,null,null,null,null,null,null,null,null,null,null,null,null,null,null,null,null,null,null,null,null,null,null,null,null,null,null,null,null,null,null,null,null,null,null,null,null,"2017/18",39.5,145,null,null,null,null,null,null,null,null,"0",0,null,null,null,null,null,null,null,"*"]
[4259,"SALIFA IHDAHLIA",null,null,{"$f":"AQ264","v":0},{"$f":"QG264","v":0},null,"P",null,null,"ISLAM","WNI",null,null,null,null,0,0,null,null,null,null,null,null,null,null,null,null,null,null,null,null,null,null,null,null,null,null,null,null,null,null,null,null,null,null,null,null,null,null,null,null,null,null,null,null,null,null,null,null,null,null,null,null,null,null,null,null,null,"2017/18",28.8,142,null,null,null,null,null,null,null,null,"0",0,null,null,null,null,null,null,null,"*"]
[4260,null,null,null,0,0,null,null,null,null,"ISLAM","WNI",null,null,null,null,0,0,null,null,null,null,null,null,null,null,null,null,null,null,null,null,null,null,null,null,null,null,null,null,null,null,null,null,null,null,null,null,null,null,null,null,null,null,null,null,null,null,null,null,null,null,null,null,null,null,null,null,null,null,null,null,null,null,null,null,null,null,null,null,"0",0]
[4261,null,null,null,0,0,null,null,null,null,"ISLAM","WNI",null,null,null,null,0,0,null,null,null,null,null,null,null,null,null,null,null,null,null,null,null,null,null,null,null,null,null,null,null,null,null,null,null,null,null,null,null,null,null,null,null,null,null,null,null,null,null,null,null,null,null,null,null,null,null,null,null,null,null,null,null,null,null,null,null,null,null,null,"0",0]
[4262,null,null,null,0,0,null,null,null,null,"ISLAM","WNI",null,null,null,null,0,0,null,null,null,null,null,null,null,null,null,null,null,null,null,null,null,null,null,null,null,null,null,null,null,null,null,null,null,null,null,null,null,null,null,null,null,null,null,null,null,null,null,null,null,null,null,null,null,null,null,null,null,null,null,null,null,null,null,null,null,null,null,null,"0",0]
[4263,null,null,null,0,0,null,null,null,null,"ISLAM","WNI",null,null,null,null,0,0,null,null,null,null,null,null,null,null,null,null,null,null,null,null,null,null,null,null,null,null,null,null,null,null,null,null,null,null,null,null,null,null,null,null,null,null,null,null,null,null,null,null,null,null,null,null,null,null,null,null,null,null,null,null,null,null,null,null,null,null,null,null,"0",0]
[4264,null,null,null,0,0,null,null,null,null,"ISLAM","WNI",null,null,null,null,0,0,null,null,null,null,null,null,null,null,null,null,null,null,null,null,null,null,null,null,null,null,null,null,null,null,null,null,null,null,null,null,null,null,null,null,null,null,null,null,null,null,null,null,null,null,null,null,null,null,null,null,null,null,null,null,null,null,null,null,null,null,null,null,"0",0]
[4265,null,null,null,0,0,null,null,null,null,"ISLAM","WNI",null,null,null,null,0,0,null,null,null,null,null,null,null,null,null,null,null,null,null,null,null,null,null,null,null,null,null,null,null,null,null,null,null,null,null,null,null,null,null,null,null,null,null,null,null,null,null,null,null,null,null,null,null,null,null,null,null,null,null,null,null,null,null,null,null,null,null,null,"0",0]
[4266,null,null,null,0,0,null,null,null,null,"ISLAM","WNI",null,null,null,null,0,0,null,null,null,null,null,null,null,null,null,null,null,null,null,null,null,null,null,null,null,null,null,null,null,null,null,null,null,null,null,null,null,null,null,null,null,null,null,null,null,null,null,null,null,null,null,null,null,null,null,null,null,null,null,null,null,null,null,null,null,null,null,null,"0",0]
[4267,null,null,null,0,0,null,null,null,null,"ISLAM","WNI",null,null,null,null,0,0,null,null,null,null,null,null,null,null,null,null,null,null,null,null,null,null,null,null,null,null,null,null,null,null,null,null,null,null,null,null,null,null,null,null,null,null,null,null,null,null,null,null,null,null,null,null,null,null,null,null,null,null,null,null,null,null,null,null,null,null,null,null,"0",0]
[4268,"MUHAMMAD SONI",null,null,0,0,null,null,null,null,"ISLAM","WNI",null,null,null,null,0,0,null,null,null,null,null,null,null,null,null,null,null,null,null,null,null,null,null,null,null,null,null,null,null,null,null,null,null,null,null,null,null,null,null,null,null,null,null,null,null,null,null,null,null,null,null,null,null,null,null,null,null,"2017/18",54.1,160,null,null,null,null,null,null,null,null,"0",0,null,null,null,null,null,null,null,"*"]
[4269,null,null,null,0,0,null,null,null,null,"ISLAM","WNI",null,null,null,null,0,0,null,null,null,null,null,null,null,null,null,null,null,null,null,null,null,null,null,null,null,null,null,null,null,null,null,null,null,null,null,null,null,null,null,null,null,null,null,null,null,null,null,null,null,null,null,null,null,null,null,null,null,null,null,null,null,null,null,null,null,null,null,null,"0",0]
[4270,"ADITYA MAULA FANDY TAULANI",null,null,0,0,"ADITYA","L","2006-06-13","LUMAJANG","ISLAM","WNI","k",null,null,"JAWA",0,0,null,null,null,null,null,null,null,null,null,null,null,null,null,null,null,null,null,null,null,null,null,null,null,null,null,null,null,null,null,null,null,null,null,null,null,null,null,null,null,null,null,null,null,null,null,null,"2017/18",26.9,137,null,null,null,null,null,null,null,null,null,null,null,null,null,"0",0,null,null,null,null,null,null,null,"*"]
[4271,"AHMAD RAMADHANI FADLULLOH",null,null,0,0,"DHANI","L","2006-10-18","LUMAJANG","ISLAM","WNI","k",null,null,"JAWA",0,0,null,null,null,null,null,null,null,null,null,null,null,null,null,null,null,null,null,null,null,null,null,null,null,null,null,null,null,null,null,null,null,null,null,null,null,null,null,null,null,null,null,null,null,null,null,null,"2017/18",24.6,123,null,null,null,null,null,null,null,null,null,null,null,null,null,"0",0,null,null,null,null,null,null,null,"*"]
[4272,"ANDINI MAULID DWI LESTARI",null,null,0,0,"ANDINI","P","2007-03-30","LUMAJANG","ISLAM","WNI","k",null,null,"JAWA",0,0,null,null,null,null,null,null,null,null,null,null,null,null,null,null,null,null,null,null,null,null,null,null,null,null,null,null,null,null,null,null,null,null,null,null,null,null,null,null,null,null,null,null,null,null,null,null,"2017/18",38.799999999999997,151,null,null,null,null,null,null,null,null,null,null,null,null,null,"0",0,null,null,null,null,null,null,null,"*"]
[4273,"DEWI SAKINAH ISWARA",null,null,0,0,"ISWA","P","2006-08-31","LUMAJANG","ISLAM","WNI","k",null,null,"JAWA",0,0,null,null,null,null,null,null,null,null,null,null,null,null,null,null,null,null,null,null,null,null,null,null,null,null,null,null,null,null,null,null,null,null,null,null,null,null,null,null,null,null,null,null,null,null,null,null,"2017/18",32.299999999999997,144,null,null,null,null,null,null,null,null,null,null,null,null,null,"0",0,null,null,null,null,null,null,null,"*"]
[4274,"DWITA FITA WULANDARI",null,null,0,0,"DWITA","P","2007-02-25","LUMAJANG","ISLAM","WNI","k",null,null,"JAWA",0,0,null,null,null,null,null,null,null,null,null,null,null,null,null,null,null,null,null,null,null,null,null,null,null,null,null,null,null,null,null,null,null,null,null,null,null,null,null,null,null,null,null,null,null,null,null,null,"2017/18",26.7,128,null,null,null,null,null,null,null,null,null,null,null,null,null,"0",0,null,null,null,null,null,null,null,"*"]
[4275,"HANIK APRILIA SARI",null,null,0,0,"HANIK","P","2007-04-23","LUMAJANG","ISLAM","WNI","k",null,null,"JAWA",0,0,null,null,null,null,null,null,null,null,null,null,null,null,null,null,null,null,null,null,null,null,null,null,null,null,null,null,null,null,null,null,null,null,null,null,null,null,null,null,null,null,null,null,null,null,null,null,"2017/18",47.8,138,null,null,null,null,null,null,null,null,null,null,null,null,null,"0",0,null,null,null,null,null,null,null,"*"]
[4276,"IZZA ILMIA AZZAHRA",null,null,0,0,null,"P","2006-12-15","LUMAJANG","ISLAM","WNI","k",null,null,"JAWA",0,0,null,null,null,null,null,null,null,null,null,null,null,null,null,null,null,null,null,null,null,null,null,null,null,null,null,null,null,null,null,null,null,null,null,null,null,null,null,null,null,null,null,null,null,null,null,null,"2017/18",27.2,130,null,null,null,null,null,null,null,null,null,null,null,null,null,"0",0,null,null,null,null,null,null,null,"*"]
[4277,"KARINA FEBBY CAHYA AMILIA",null,null,0,0,null,"P","2007-02-01","LUMAJANG","ISLAM","WNI","k",null,null,"JAWA",0,0,null,null,null,null,null,null,null,null,null,null,null,null,null,null,null,null,null,null,null,null,null,null,null,null,null,null,null,null,null,null,null,null,null,null,null,null,null,null,null,null,null,null,null,null,null,null,"2017/18",67.2,153,null,null,null,null,null,null,null,null,null,null,null,null,null,"0",0,null,null,null,null,null,null,null,"*"]
[4278,"KHARISYA AZZAHRO",null,null,0,0,null,"P","2007-01-21","LUMAJANG","ISLAM","WNI","k",null,null,"JAWA",0,0,null,null,null,null,null,null,null,null,null,null,null,null,null,null,null,null,null,null,null,null,null,null,null,null,null,null,null,null,null,null,null,null,null,null,null,null,null,null,null,null,null,null,null,null,null,null,"2017/18",35.799999999999997,142,null,null,null,null,null,null,null,null,null,null,null,null,null,"0",0,null,null,null,null,null,null,null,"*"]
[4279,"MITA SEPTIANI ISLAMIA",null,null,0,0,null,"L","2006-09-16","LUMAJANG","ISLAM","WNI","k",null,null,"JAWA",0,0,null,null,null,null,null,null,null,null,null,null,null,null,null,null,null,null,null,null,null,null,null,null,null,null,null,null,null,null,null,null,null,null,null,null,null,null,null,null,null,null,null,null,null,null,null,null,"2017/18",37.200000000000003,139,null,null,null,null,null,null,null,null,null,null,null,null,null,"0",0,null,null,null,null,null,null,null,"*"]
[4280,"MUCHAMMAD ALIEF FERDIANSYAH",null,null,0,0,null,"L","2006-06-22","LUMAJANG","ISLAM","WNI","k",null,null,"JAWA",0,0,null,null,null,null,null,null,null,null,null,null,null,null,null,null,null,null,null,null,null,null,null,null,null,null,null,null,null,null,null,null,null,null,null,null,null,null,null,null,null,null,null,null,null,null,null,null,"2017/18",27.6,131,null,null,null,null,null,null,null,null,null,null,null,null,null,"0",0,null,null,null,null,null,null,null,"*"]
[4281,"MUHAMMAD AGUS ANDRIANTO",null,null,0,0,"ANDRI","L","2006-08-11","LUMAJANG","ISLAM","WNI","k",null,null,"JAWA",0,0,null,null,null,null,null,null,null,null,null,null,null,null,null,null,null,null,null,null,null,null,null,null,null,null,null,null,null,null,null,null,null,null,null,null,null,null,null,null,null,null,null,null,null,null,null,null,"2017/18",25.4,125,null,null,null,null,null,null,null,null,null,null,null,null,null,"0",0,null,null,null,null,null,null,null,"*"]
[4282,"MUHAMMAD AGUS FERDIANSYAH",null,null,0,0,"FERDI","L","2006-08-11",null,"ISLAM","WNI",null,null,null,null,0,0,null,null,null,null,null,null,null,null,null,null,null,null,null,null,null,null,null,null,null,null,null,null,null,null,null,null,null,null,null,null,null,null,null,null,null,null,null,null,null,null,null,null,null,null,null,null,"2017/18",25.9,126,null,null,null,null,null,null,null,null,null,null,null,null,null,"0",0,null,null,null,null,null,null,null,"*"]
[4283,"MUHAMMAD FERDINAN JAYYIDAH RIFQI",null,null,0,0,"FERDINAN","L","2007-05-13",null,"ISLAM","WNI",null,null,null,null,0,0,null,null,null,null,null,null,null,null,null,null,null,null,null,null,null,null,null,null,null,null,null,null,null,null,null,null,null,null,null,null,null,null,null,null,null,null,null,null,null,null,null,null,null,null,null,null,"2017/18",39.799999999999997,144,null,null,null,null,null,null,null,null,null,null,null,null,null,"0",0,null,null,null,null,null,null,null,"*"]
[4284,"MUHAMMAD RAYA KAFAF JAUHARI",null,null,0,0,"RAYA","L","2006-09-06",null,"ISLAM","WNI",null,null,null,null,0,0,null,null,null,null,null,null,null,null,null,null,null,null,null,null,null,null,null,null,null,null,null,null,null,null,null,null,null,null,null,null,null,null,null,null,null,null,null,null,null,null,null,null,null,null,null,null,"2017/18",31.8,135,null,null,null,null,null,null,null,null,null,null,null,null,null,"0",0,null,null,null,null,null,null,null,"*"]
[4285,"MUHAMMAD VERYANSYAH",null,null,0,0,"VERY","L",null,null,"ISLAM","WNI",null,null,null,null,0,0,null,null,null,null,null,null,null,null,null,null,null,null,null,null,null,null,null,null,null,null,null,null,null,null,null,null,null,null,null,null,null,null,null,null,null,null,null,null,null,null,null,null,null,null,null,null,"2017/18",45.9,145,null,null,null,null,null,null,null,null,null,null,null,null,null,"0",0,null,null,null,null,null,null,null,"*"]
[4286,"MUHAMMAD ZIDNY NA'IM",null,null,0,0,"EZI","L",null,null,"ISLAM","WNI",null,null,null,null,0,0,null,null,null,null,null,null,null,null,null,null,null,null,null,null,null,null,null,null,null,null,null,null,null,null,null,null,null,null,null,null,null,null,null,null,null,null,null,null,null,null,null,null,null,null,null,null,"2017/18",33.299999999999997,143,null,null,null,null,null,null,null,null,null,null,null,null,null,"0",0,null,null,null,null,null,null,null,"*"]
[4287,"NABILA ARISKA PUTRI",null,null,0,0,null,"P","2006-06-16",null,"ISLAM","WNI",null,null,null,null,0,0,null,null,null,null,null,null,null,null,null,null,null,null,null,null,null,null,null,null,null,null,null,null,null,null,null,null,null,null,null,null,null,null,null,null,null,null,null,null,null,null,null,null,null,null,null,null,"2017/18",36.4,136,null,null,null,null,null,null,null,null,null,null,null,null,null,"0",0,null,null,null,null,null,null,null,"*"]
[4288,"NAFISA INDRIANI",null,null,0,0,null,"P",null,null,"ISLAM","WNI",null,null,null,null,0,0,null,null,null,null,null,null,null,null,null,null,null,null,null,null,null,null,null,null,null,null,null,null,null,null,null,null,null,null,null,null,null,null,null,null,null,null,null,null,null,null,null,null,null,null,null,null,"2017/18",35.200000000000003,138,null,null,null,null,null,null,null,null,null,null,null,null,null,"0",0,null,null,null,null,null,null,null,"*"]
[4289,"NUR FITRIYAH",null,null,0,0,null,"P",null,null,"ISLAM","WNI",null,null,null,null,0,0,null,null,null,null,null,null,null,null,null,null,null,null,null,null,null,null,null,null,null,null,null,null,null,null,null,null,null,null,null,null,null,null,null,null,null,null,null,null,null,null,null,null,null,null,null,null,"2017/18",35.1,139,null,null,null,null,null,null,null,null,null,null,null,null,null,"0",0,null,null,null,null,null,null,null,"*"]
[4290,"QORIATUN SHOLIHAH",null,null,0,0,null,"P",null,null,"ISLAM","WNI",null,null,null,null,0,0,null,null,null,null,null,null,null,null,null,null,null,null,null,null,null,null,null,null,null,null,null,null,null,null,null,null,null,null,null,null,null,null,null,null,null,null,null,null,null,null,null,null,null,null,null,null,"2017/18",37.299999999999997,137,null,null,null,null,null,null,null,null,null,null,null,null,null,"0",0,null,null,null,null,null,null,null,"*"]
[4291,"RACHMAD HIDAYAT",null,null,0,0,null,"L",null,null,"ISLAM","WNI",null,null,null,null,0,0,null,null,null,null,null,null,null,null,null,null,null,null,null,null,null,null,null,null,null,null,null,null,null,null,null,null,null,null,null,null,null,null,null,null,null,null,null,null,null,null,null,null,null,null,null,null,"2017/18",27.4,132,null,null,null,null,null,null,null,null,null,null,null,null,null,"0",0,null,null,null,null,null,null,null,"*"]
[4292,"RHEA RAYSHANADA NUGRAHA",null,null,0,0,null,"P",null,null,"ISLAM","WNI",null,null,null,null,0,0,null,null,null,null,null,null,null,null,null,null,null,null,null,null,null,null,null,null,null,null,null,null,null,null,null,null,null,null,null,null,null,null,null,null,null,null,null,null,null,null,null,null,null,null,null,null,"2017/18",24.5,127,null,null,null,null,null,null,null,null,null,null,null,null,null,"0",0,null,null,null,null,null,null,null,"*"]
[4293,"RIYANTI APRILIA",null,null,0,0,null,"P",null,null,"ISLAM","WNI",null,null,null,null,0,0,null,null,null,null,null,null,null,null,null,null,null,null,null,null,null,null,null,null,null,null,null,null,null,null,null,null,null,null,null,null,null,null,null,null,null,null,null,null,null,null,null,null,null,null,null,null,"2017/18",38.4,143,null,null,null,null,null,null,null,null,null,null,null,null,null,"0",0,null,null,null,null,null,null,null,"*"]
[4294,"RIZKA AYU WULANDARI",null,null,0,0,null,"P",null,null,"ISLAM","WNI",null,null,null,null,0,0,null,null,null,null,null,null,null,null,null,null,null,null,null,null,null,null,null,null,null,null,null,null,null,null,null,null,null,null,null,null,null,null,null,null,null,null,null,null,null,null,null,null,null,null,null,null,"2017/18",38,139,null,null,null,null,null,null,null,null,null,null,null,null,null,"0",0,null,null,null,null,null,null,null,"*"]
[4295,"SHONIA AULIA AS'AD",null,null,0,0,null,"P",null,null,"ISLAM","WNI",null,null,null,null,0,0,null,null,null,null,null,null,null,null,null,null,null,null,null,null,null,null,null,null,null,null,null,null,null,null,null,null,null,null,null,null,null,null,null,null,null,null,null,null,null,null,null,null,null,null,null,null,"2017/18",20.9,126,null,null,null,null,null,null,null,null,null,null,null,null,null,"0",0,null,null,null,null,null,null,null,"*"]
[4296,"USWATUN KHASANAH",null,null,0,0,null,"P",null,null,"ISLAM","WNI",null,null,null,null,0,0,null,null,null,null,null,null,null,null,null,null,null,null,null,null,null,null,null,null,null,null,null,null,null,null,null,null,null,null,null,null,null,null,null,null,null,null,null,null,null,null,null,null,null,null,null,null,null,null,null,null,null,null,null,null,null,null,null,null,null,null,null,null,"0",0]
[4297,"USWATUN KHASANAH",null,null,0,0,null,"P","2006-12-19","LUMAJANG","ISLAM","WNI",null,null,null,null,0,0,null,null,null,null,null,null,null,null,null,null,null,null,null,null,null,null,null,null,null,null,null,null,null,null,null,null,null,null,null,null,null,null,null,null,null,null,null,null,null,null,null,null,null,null,null,null,"2017/18",33,137,null,null,null,null,null,null,null,null,null,null,null,null,null,"0",0,null,null,null,null,null,null,null,"*"]
[4298,"VERLINA DWI MAULANI",null,null,0,0,null,"P","2006-04-22",null,"ISLAM","WNI",null,null,null,null,{"$f":"AT303","v":0},{"$f":"AU303","v":0},null,null,null,null,null,null,null,null,null,null,null,null,null,null,null,null,null,null,null,null,null,null,null,null,null,null,null,null,null,null,null,null,null,null,null,null,null,null,null,null,null,null,null,null,null,null,"2017/18",56.9,148,null,null,null,null,null,null,null,null,null,null,null,null,null,"0",0,null,null,null,null,null,null,null,"*"]
[4299,null,null,null,0,0,null,null,null,null,"ISLAM","WNI",null,null,null,null,0,0,null,null,null,null,null,null,null,null,null,null,null,null,null,null,null,null,null,null,null,null,null,null,null,null,null,null,null,null,null,null,null,null,null,null,null,null,null,null,null,null,null,null,null,null,null,null,null,null,null,null,null,null,null,null,null,null,null,null,null,null,null,null,{"$f":"RIGHT(CD304,4)","v":"0"},{"$f":"PR304","v":0}]
[4300,"AHMAD FERDIAN ALAMSYAH",null,null,0,0,"FERDI","L","2006-08-19","LUMAJANG","ISLAM","WNI","k",null,null,"JAWA",0,0,null,null,null,null,null,null,null,null,null,null,null,null,null,null,null,null,null,null,null,null,null,null,null,null,null,null,null,null,null,null,null,null,null,null,null,null,null,null,null,null,null,null,null,null,null,null,"2017/18",28.5,133,"-","-","2018/19",null,null,null,null,null,null,null,null,null,null,"0",0]
[4301,"ANDRIK YUSRI",null,null,0,0,"ANDRIK","L","2006-05-15","LUMAJANG","ISLAM","WNI","k",null,null,"JAWA",0,0,null,null,null,null,null,null,null,null,null,null,null,null,null,null,null,null,null,null,null,null,null,null,null,null,null,null,null,null,null,null,null,null,null,null,null,null,null,null,null,null,null,null,null,null,null,null,"2017/18",37.6,141,null,null,null,null,null,null,null,null,null,null,null,null,null,"0",0,null,null,null,null,null,null,null,"*"]
[4302,null,null,null,0,0,null,null,null,null,"ISLAM","WNI",null,null,null,null,0,0,null,null,null,null,null,null,null,null,null,null,null,null,null,null,null,null,null,null,null,null,null,null,null,null,null,null,null,null,null,null,null,null,null,null,null,null,null,null,null,null,null,null,null,null,null,null,null,null,null,null,null,null,null,null,null,null,null,null,null,null,null,null,"0",0]
[4303,"FARIDATUS SAHDIAH",null,null,0,0,null,"P","2006-06-29","LUMAJANG","ISLAM","WNI","k",null,null,"JAWA",0,0,null,null,null,null,null,null,null,null,null,null,null,null,null,null,null,null,null,null,null,null,null,null,null,null,null,null,null,null,null,null,null,null,null,null,null,null,null,null,null,null,null,null,null,null,null,null,"2017/18",29.3,129,null,null,null,null,null,null,null,null,null,null,null,null,null,"0",0,null,null,null,null,null,null,null,"*"]
[4304,null,null,null,0,0,null,null,null,null,"ISLAM","WNI",null,null,null,null,0,0,null,null,null,null,null,null,null,null,null,null,null,null,null,null,null,null,null,null,null,null,null,null,null,null,null,null,null,null,null,null,null,null,null,null,null,null,null,null,null,null,null,null,null,null,null,null,null,null,null,null,null,null,null,null,null,null,null,null,null,null,null,null,"0",0]
[4305,"JULI ANDRIYANTO",null,null,0,0,null,"L",null,null,"ISLAM","WNI",null,null,null,null,0,0,null,null,null,null,null,null,null,null,null,null,null,null,null,null,null,null,null,null,null,null,null,null,null,null,null,null,null,null,null,null,null,null,null,null,null,null,null,null,null,null,null,null,null,null,null,null,null,null,null,null,null,null,null,null,null,null,null,null,null,null,null,null,"0",0]
[4306,"LENNY AGUSTIN NINGTYAS",null,null,0,0,"LENNY","P","2006-08-17","LUMAJANG","ISLAM","WNI","k",null,null,"JAWA",0,0,null,null,null,null,null,null,null,null,null,null,null,null,null,null,null,null,null,null,null,null,null,null,null,null,null,null,null,null,null,null,null,null,null,null,null,null,null,null,null,null,null,null,null,null,null,null,"2017/18",50.2,136,null,null,null,null,null,null,null,null,null,null,null,null,null,"0",0,null,null,null,null,null,null,null,"*"]
[4307,"CHAKIM",null,null,0,0,"CHAKIM","L","2006-05-05","LUMAJANG","ISLAM","WNI","k",null,null,"JAWA",0,0,null,null,null,null,null,null,null,null,null,null,null,null,null,null,null,null,null,null,null,null,null,null,null,null,null,null,null,null,null,null,null,null,null,null,null,null,null,null,null,null,null,null,null,null,null,null,"2017/18",29.4,137,null,null,null,null,null,null,null,null,null,null,null,null,null,"0",0,null,null,null,null,null,null,null,"*"]
[4308,"MAURIS HIDAYATUR ROCHMAN",null,null,0,0,"MAURIS","L","2006-12-11","LUMAJANG","ISLAM","WNI","k",null,null,"JAWA",0,0,null,null,null,null,null,null,null,null,null,null,null,null,null,null,null,null,null,null,null,null,null,null,null,null,null,null,null,null,null,null,null,null,null,null,null,null,null,null,null,null,null,null,null,null,null,null,"2017/18",28.3,130,null,null,null,null,null,null,null,null,null,null,null,null,null,"0",0,null,null,null,null,null,null,null,"*"]
[4309,"MAYA BUNGA ANJANI",null,null,0,0,null,"P","2007-05-04","LUMAJANG","ISLAM","WNI","k",null,null,"JAWA",0,0,null,null,null,null,null,null,null,null,null,null,null,null,null,null,null,null,null,null,null,null,null,null,null,null,null,null,null,null,null,null,null,null,null,null,null,null,null,null,null,null,null,null,null,null,null,null,"2017/18",23.6,129,null,null,null,null,null,null,null,null,null,null,null,null,null,"0",0,null,null,null,null,null,null,null,"*"]
[4310,"MOCHAMMAD BIMA RISFANDA",null,null,0,0,null,"L",null,null,"ISLAM","WNI",null,null,null,null,0,0,null,null,null,null,null,null,null,null,null,null,null,null,null,null,null,null,null,null,null,null,null,null,null,null,null,null,null,null,null,null,null,null,null,null,null,null,null,null,null,null,null,null,null,null,null,null,"2017/18",28.7,134,null,null,null,null,null,null,null,null,null,null,null,null,null,"0",0,null,null,null,null,null,null,null,"*"]
[4311,null,null,null,0,0,null,null,null,null,"ISLAM","WNI",null,null,null,null,0,0,null,null,null,null,null,null,null,null,null,null,null,null,null,null,null,null,null,null,null,null,null,null,null,null,null,null,null,null,null,null,null,null,null,null,null,null,null,null,null,null,null,null,null,null,null,null,null,null,null,null,null,null,null,null,null,null,null,null,null,null,null,null,"0",0]
[4312,null,null,null,0,0,null,null,null,null,"ISLAM","WNI",null,null,null,null,0,0,null,null,null,null,null,null,null,null,null,null,null,null,null,null,null,null,null,null,null,null,null,null,null,null,null,null,null,null,null,null,null,null,null,null,null,null,null,null,null,null,null,null,null,null,null,null,null,null,null,null,null,null,null,null,null,null,null,null,null,null,null,null,"0",0]
[4313,"MUHAMMAD AMRU FADHIL",null,null,0,0,"FADIL","L","2006-02-03","LUMAJANG","ISLAM","WNI",null,null,null,null,0,0,null,null,null,null,null,null,null,null,null,null,null,null,null,null,null,null,null,null,null,null,null,null,null,null,null,null,null,null,null,null,null,null,null,null,null,null,null,null,null,null,null,null,null,null,null,null,null,null,null,null,null,null,null,null,null,null,null,null,null,null,null,null,"0",0,null,null,null,null,null,null,null,"*"]
[4314,"MUHAMMAD BISMAR TAUFIQUROHMAN",null,null,0,0,"BISMAR","L","2007-02-20","LUMAJANG","ISLAM","WNI",2,"-","-","JAWA",0,0,null,null,null,null,null,null,null,null,null,null,null,null,null,null,null,null,null,null,null,null,null,null,null,null,null,null,null,null,null,null,null,null,null,null,null,null,null,null,null,null,null,null,null,null,null,null,"2017/18",32.700000000000003,136,null,null,null,null,null,null,null,null,null,null,null,null,null,"0",0,null,null,null,null,null,null,null,"*"]
[4315,"MUHAMMAD FARDAN ABDILLAH",null,null,0,0,"FARDAN","L","2006-01-18","LUMAJANG","ISLAM","WNI","k",null,null,"JAWA",0,0,null,null,null,null,null,null,null,null,null,null,null,null,null,null,null,null,null,null,null,null,null,null,null,null,null,null,null,null,null,null,null,null,null,null,null,null,null,null,null,null,null,null,null,null,null,null,"2017/18",28,138,null,null,null,null,null,null,null,null,null,null,null,null,null,"0",0,null,null,null,null,null,null,null,"*"]
[4316,null,null,null,0,0,null,null,null,null,"ISLAM","WNI",null,null,null,null,0,0,null,null,null,null,null,null,null,null,null,null,null,null,null,null,null,null,null,null,null,null,null,null,null,null,null,null,null,null,null,null,null,null,null,null,null,null,null,null,null,null,null,null,null,null,null,null,null,null,null,null,null,null,null,null,null,null,null,null,null,null,null,null,"0",0]
[4317,"MUHAMMAD FIRMANSYAH",null,null,0,0,"FIRMAN","L","2006-09-27","LUMAJANG","ISLAM","WNI","k",null,null,"JAWA",0,0,null,null,null,null,null,null,null,null,null,null,null,null,null,null,null,null,null,null,null,null,null,null,null,null,null,null,null,null,null,null,null,null,null,null,null,null,null,null,null,null,null,null,null,null,null,null,"2017/18",24.1,123,null,null,null,null,null,null,null,null,null,null,null,null,null,"0",0,null,null,null,null,null,null,null,"*"]
[4318,"MUHAMMAD HILDAN DWI SAPUTRA",null,null,0,0,"HILDAN","L","2006-05-04","LUMAJANG","ISLAM","WNI","k",null,null,"JAWA",0,0,null,null,null,null,null,null,null,null,null,null,null,null,null,null,null,null,null,null,null,null,null,null,null,null,null,null,null,null,null,null,null,null,null,null,null,null,null,null,null,null,null,null,null,null,null,null,"2017/18",37.799999999999997,134,null,null,null,null,null,null,null,null,null,null,null,null,null,"0",0,null,null,null,null,null,null,null,"*"]
[4319,"MUHAMMAD RUDI TANTOWIK",null,null,0,0,"ANTOK","L","2006-09-09","LUMAJANG","ISLAM","WNI","k",null,null,"JAWA",0,0,null,null,null,null,null,null,null,null,null,null,null,null,null,null,null,null,null,null,null,null,null,null,null,null,null,null,null,null,null,null,null,null,null,null,null,null,null,null,null,null,null,null,null,null,null,null,"2017/18",30.2,135,null,null,null,null,null,null,null,null,null,null,null,null,null,"0",0,null,null,null,null,null,null,null,"*"]
[4320,"MUHAMMAD SAHLAN SHODIQ",null,null,0,0,"SAHLAN","L","2006-04-26","LUMAJANG","ISLAM","WNI","k",null,null,"JAWA",0,0,null,null,null,null,null,null,null,null,null,null,null,null,null,null,null,null,null,null,null,null,null,null,null,null,null,null,null,null,null,null,null,null,null,null,null,null,null,null,null,null,null,null,null,null,null,null,"2017/18",31.8,135,null,null,null,null,null,null,null,null,null,null,null,null,null,"0",0,null,null,null,null,null,null,null,"*"]
[4321,"MUHAMMAD SEPTYAN EKA PRATAMA",null,null,0,0,"SEPTYAN","L","2006-09-14","LUMAJANG","ISLAM","WNI","k",null,null,"JAWA",0,0,null,null,null,null,null,null,null,null,null,null,null,null,null,null,null,null,null,null,null,null,null,null,null,null,null,null,null,null,null,null,null,null,null,null,null,null,null,null,null,null,null,null,null,null,null,null,"2017/18",60.9,142,null,null,null,null,null,null,null,null,null,null,null,null,null,"0",0,null,null,null,null,null,null,null,"*"]
[4322,"MUHAMMAD ZULDIENUR HABIBIE",null,null,0,0,"BIBI","L","2005-11-30","LUMAJANG","ISLAM","WNI","k",null,null,"JAWA",0,0,null,null,null,null,null,null,null,null,null,null,null,null,null,null,null,null,null,null,null,null,null,null,null,null,null,null,null,null,null,null,null,null,null,null,null,null,null,null,null,null,null,null,null,null,null,null,"2017/18",29,131,null,null,null,null,null,null,null,null,null,null,null,null,null,"0",0,null,null,null,null,null,null,null,"*"]
[4323,"MUKHAMAD KHOIRUL AMIN",null,null,{"$f":"AQ328","v":0},{"$f":"QG328","v":0},"AMIN","L","2007-05-02","LUMAJANG","ISLAM","WNI","k",null,null,"JAWA",0,0,null,null,null,null,null,null,null,null,null,null,null,null,null,null,null,null,null,null,null,null,null,null,null,null,null,null,null,null,null,null,null,null,null,null,null,null,null,null,null,null,null,null,null,null,null,null,"2017/18",25.8,124,null,null,null,null,null,null,null,null,null,null,null,null,null,"0",0,null,null,null,null,null,null,null,"*"]
[4324,"VIKA KUSUMA WATI",null,null,0,0,"VIKA","P","2007-05-03","LUMAJANG","ISLAM","WNI","k",null,null,"JAWA",0,0,null,null,null,null,null,null,null,null,null,null,null,null,null,null,null,null,null,null,null,null,null,null,null,null,null,null,null,null,null,null,null,null,null,null,null,null,null,null,null,null,null,null,null,null,null,null,"2017/18",33,137,null,null,null,null,null,null,null,null,null,null,null,null,null,"0",0,null,null,null,null,null,null,null,"*"]
[4325,null,null,null,0,0,null,null,null,null,"ISLAM","WNI",null,null,null,null,0,0,null,null,null,null,null,null,null,null,null,null,null,null,null,null,null,null,null,null,null,null,null,null,null,null,null,null,null,null,null,null,null,null,null,null,null,null,null,null,null,null,null,null,null,null,null,null,null,null,null,null,null,null,null,null,null,null,null,null,null,null,null,null,"0",0]
[4326,"YOHAN EGA GILANG PERMANA",null,null,0,0,"EGA","L","2006-11-24","LUMAJANG","ISLAM","WNI","k",null,null,"JAWA",0,0,null,null,null,null,null,null,null,null,null,null,null,null,null,null,null,null,null,null,null,null,null,null,null,null,null,null,null,null,null,null,null,null,null,null,null,null,null,null,null,null,null,null,null,null,null,null,"2017/18",41.4,138,null,null,null,null,null,null,null,null,null,null,null,null,null,"0",0,null,null,null,null,null,null,null,"*"]
[4327,"MUHAMMAD AKBAR MAULANA ISKHAQ",null,null,0,0,null,"L",null,null,"ISLAM","WNI",null,null,null,null,0,0,null,null,null,null,null,null,null,null,null,null,null,null,null,null,null,null,null,null,null,null,null,null,null,null,null,null,null,null,null,null,null,null,null,null,null,null,null,null,null,null,null,null,null,null,null,null,null,null,null,null,null,"2017/18",46.7,155,null,null,null,null,null,null,null,null,"0",0,null,null,null,null,null,null,null,"*"]
[4328,"ADELIA SEPTI BERTHA ANANDA",null,null,0,0,null,"P",null,null,"ISLAM","WNI",null,null,null,null,0,0,null,null,null,null,null,null,null,null,null,null,null,null,null,null,null,null,null,null,null,null,null,null,null,null,null,null,null,null,null,null,null,null,null,null,null,null,null,null,null,null,null,null,null,null,null,null,null,null,null,null,null,"2017/28",48.3,136,null,null,null,null,null,null,null,null,"0",0,null,null,null,null,null,null,null,"*"]
[4329,null,null,null,0,0,null,null,null,null,"ISLAM","WNI",null,null,null,null,0,0,null,null,null,null,null,null,null,null,null,null,null,null,null,null,null,null,null,null,null,null,null,null,null,null,null,null,null,null,null,null,null,null,null,null,null,null,null,null,null,null,null,null,null,null,null,null,null,null,null,null,null,null,null,null,null,null,null,null,null,null,null,null,"0",0]
[4330,"ACHID ATHIRIL ARDAN",null,null,0,0,null,null,null,null,"ISLAM","WNI",null,null,null,null,0,0,null,null,null,null,null,null,null,null,null,null,null,null,null,null,null,null,null,null,null,null,null,null,null,null,null,null,null,null,null,null,null,null,null,null,null,null,null,null,null,null,null,null,null,null,null,null,null,null,null,null,null,null,null,null,null,null,null,null,null,null,null,null,"0",0]
[4331,"ACHMAD FATHIR IZUDDIN",null,null,0,0,null,null,null,null,"ISLAM","WNI",null,null,null,null,0,0,null,null,null,null,null,null,null,null,null,null,null,null,null,null,null,null,null,null,null,null,null,null,null,null,null,null,null,null,null,null,null,null,null,null,null,null,null,null,null,null,null,null,null,null,null,null,null,null,null,null,null,null,null,null,null,null,null,null,null,null,null,null,"0",0]
[4332,null,null,null,0,0,null,null,null,null,"ISLAM","WNI",null,null,null,null,0,0,null,null,null,null,null,null,null,null,null,null,null,null,null,null,null,null,null,null,null,null,null,null,null,null,null,null,null,null,null,null,null,null,null,null,null,null,null,null,null,null,null,null,null,null,null,null,null,null,null,null,null,null,null,null,null,null,null,null,null,null,null,null,"0",0]
[4333,"AININ NAFISA FEBRIYANTI",null,null,0,0,null,null,null,null,"ISLAM","WNI",null,null,null,null,0,0,null,null,null,null,null,null,null,null,null,null,null,null,null,null,null,null,null,null,null,null,null,null,null,null,null,null,null,null,null,null,null,null,null,null,null,null,null,null,null,null,null,null,null,null,null,null,null,null,null,null,null,null,null,null,null,null,null,null,null,null,null,null,"0",0]
[4334,"AISYAH DWI ANDINI",null,null,0,0,null,null,null,null,"ISLAM","WNI",null,null,null,null,0,0,null,null,null,null,null,null,null,null,null,null,null,null,null,null,null,null,null,null,null,null,null,null,null,null,null,null,null,null,null,null,null,null,null,null,null,null,null,null,null,null,null,null,null,null,null,null,null,null,null,null,null,null,null,null,null,null,null,null,null,null,null,null,"0",0]
[4335,"AJENG AGUSTINA KIRANA PUTRI",null,null,0,0,null,null,null,null,"ISLAM","WNI",null,null,null,null,0,0,null,null,null,null,null,null,null,null,null,null,null,null,null,null,null,null,null,null,null,null,null,null,null,null,null,null,null,null,null,null,null,null,null,null,null,null,null,null,null,null,null,null,null,null,null,null,null,null,null,null,null,null,null,null,null,null,null,null,null,null,null,null,"0",0]
[4336,"ALVIAN FAIZULHAQQI",null,null,0,0,null,null,null,null,"ISLAM","WNI",null,null,null,null,0,0,null,null,null,null,null,null,null,null,null,null,null,null,null,null,null,null,null,null,null,null,null,null,null,null,null,null,null,null,null,null,null,null,null,null,null,null,null,null,null,null,null,null,null,null,null,null,null,null,null,null,null,null,null,null,null,null,null,null,null,null,null,null,"0",0]
[4337,"ANGGITA RIZKY YUGA MEISYA",null,null,0,0,null,null,null,null,"ISLAM","WNI",null,null,null,null,0,0,null,null,null,null,null,null,null,null,null,null,null,null,null,null,null,null,null,null,null,null,null,null,null,null,null,null,null,null,null,null,null,null,null,null,null,null,null,null,null,null,null,null,null,null,null,null,null,null,null,null,null,null,null,null,null,null,null,null,null,null,null,null,"0",0]
[4338,"AURA SALSABILA WULAN SARI",null,null,0,0,null,null,null,null,"ISLAM","WNI",null,null,null,null,0,0,null,null,null,null,null,null,null,null,null,null,null,null,null,null,null,null,null,null,null,null,null,null,null,null,null,null,null,null,null,null,null,null,null,null,null,null,null,null,null,null,null,null,null,null,null,null,null,null,null,null,null,null,null,null,null,null,null,null,null,null,null,null,"0",0]
[4339,"DEVI KARUNIA RATNA PUTRI",null,null,0,0,null,null,null,null,"ISLAM","WNI",null,null,null,null,0,0,null,null,null,null,null,null,null,null,null,null,null,null,null,null,null,null,null,null,null,null,null,null,null,null,null,null,null,null,null,null,null,null,null,null,null,null,null,null,null,null,null,null,null,null,null,null,null,null,null,null,null,null,null,null,null,null,null,null,null,null,null,null,"0",0]
[4340,"DEVITA FEBRIANI PUTRI",null,null,0,0,null,null,null,null,"ISLAM","WNI",null,null,null,null,0,0,null,null,null,null,null,null,null,null,null,null,null,null,null,null,null,null,null,null,null,null,null,null,null,null,null,null,null,null,null,null,null,null,null,null,null,null,null,null,null,null,null,null,null,null,null,null,null,null,null,null,null,null,null,null,null,null,null,null,null,null,null,null,"0",0]
[4341,"ERSA PUSPITA EKA ROSA LINDA",null,null,0,0,null,null,null,null,"ISLAM","WNI",null,null,null,null,0,0,null,null,null,null,null,null,null,null,null,null,null,null,null,null,null,null,null,null,null,null,null,null,null,null,null,null,null,null,null,null,null,null,null,null,null,null,null,null,null,null,null,null,null,null,null,null,null,null,null,null,null,null,null,null,null,null,null,null,null,null,null,null,"0",0]
[4342,"FARAH NAILATUL ALYAH",null,null,0,0,null,null,null,null,"ISLAM","WNI",null,null,null,null,0,0,null,null,null,null,null,null,null,null,null,null,null,null,null,null,null,null,null,null,null,null,null,null,null,null,null,null,null,null,null,null,null,null,null,null,null,null,null,null,null,null,null,null,null,null,null,null,null,null,null,null,null,null,null,null,null,null,null,null,null,null,null,null,"0",0]
[4343,"FELISITA APRILIA NUR NIHAYA",null,null,0,0,null,null,null,null,"ISLAM","WNI",null,null,null,null,0,0,null,null,null,null,null,null,null,null,null,null,null,null,null,null,null,null,null,null,null,null,null,null,null,null,null,null,null,null,null,null,null,null,null,null,null,null,null,null,null,null,null,null,null,null,null,null,null,null,null,null,null,null,null,null,null,null,null,null,null,null,null,null,"0",0]
[4344,"FIRDA DWI ANDRIANI",null,null,0,0,null,null,null,null,"ISLAM","WNI",null,null,null,null,0,0,null,null,null,null,null,null,null,null,null,null,null,null,null,null,null,null,null,null,null,null,null,null,null,null,null,null,null,null,null,null,null,null,null,null,null,null,null,null,null,null,null,null,null,null,null,null,null,null,null,null,null,null,null,null,null,null,null,null,null,null,null,null,"0",0]
[4345,"GALANG MARDHOTILLAH SATOTO",null,null,0,0,null,null,null,null,"ISLAM","WNI",null,null,null,null,0,0,null,null,null,null,null,null,null,null,null,null,null,null,null,null,null,null,null,null,null,null,null,null,null,null,null,null,null,null,null,null,null,null,null,null,null,null,null,null,null,null,null,null,null,null,null,null,null,null,null,null,null,null,null,null,null,null,null,null,null,null,null,null,"0",0]
[4346,"IKA KURNIA WATI AGUSTINA",null,null,0,0,null,null,null,null,"ISLAM","WNI",null,null,null,null,0,0,null,null,null,null,null,null,null,null,null,null,null,null,null,null,null,null,null,null,null,null,null,null,null,null,null,null,null,null,null,null,null,null,null,null,null,null,null,null,null,null,null,null,null,null,null,null,null,null,null,null,null,null,null,null,null,null,null,null,null,null,null,null,"0",0]
[4347,"LIYA FEBRIYANI",null,null,0,0,null,null,null,null,"ISLAM","WNI",null,null,null,null,0,0,null,null,null,null,null,null,null,null,null,null,null,null,null,null,null,null,null,null,null,null,null,null,null,null,null,null,null,null,null,null,null,null,null,null,null,null,null,null,null,null,null,null,null,null,null,null,null,null,null,null,null,null,null,null,null,null,null,null,null,null,null,null,"0",0]
[4348,"LIZATUL CHAIYUNI",null,null,0,0,null,null,null,null,"ISLAM","WNI",null,null,null,null,0,0,null,null,null,null,null,null,null,null,null,null,null,null,null,null,null,null,null,null,null,null,null,null,null,null,null,null,null,null,null,null,null,null,null,null,null,null,null,null,null,null,null,null,null,null,null,null,null,null,null,null,null,null,null,null,null,null,null,null,null,null,null,null,"0",0]
[4349,"MUHAMMAD FARIZ UBAIDILLA",null,null,0,0,null,null,null,null,"ISLAM","WNI",null,null,null,null,0,0,null,null,null,null,null,null,null,null,null,null,null,null,null,null,null,null,null,null,null,null,null,null,null,null,null,null,null,null,null,null,null,null,null,null,null,null,null,null,null,null,null,null,null,null,null,null,null,null,null,null,null,null,null,null,null,null,null,null,null,null,null,null,"0",0]
[4350,"MAYLUNA EKA PRATIWI",null,null,0,0,null,null,null,null,"ISLAM","WNI",null,null,null,null,0,0,null,null,null,null,null,null,null,null,null,null,null,null,null,null,null,null,null,null,null,null,null,null,null,null,null,null,null,null,null,null,null,null,null,null,null,null,null,null,null,null,null,null,null,null,null,null,null,null,null,null,null,null,null,null,null,null,null,null,null,null,null,null,"0",0]
[4351,"MOCHAMAD RAFLI DIAN SAPUTRA",null,null,0,0,null,null,null,null,"ISLAM","WNI",null,null,null,null,0,0,null,null,null,null,null,null,null,null,null,null,null,null,null,null,null,null,null,null,null,null,null,null,null,null,null,null,null,null,null,null,null,null,null,null,null,null,null,null,null,null,null,null,null,null,null,null,null,null,null,null,null,null,null,null,null,null,null,null,null,null,null,null,"0",0]
[4352,"MOCHAMMAD AFAREL PUTRA RAMDHANA",null,null,0,0,null,null,null,null,"ISLAM","WNI",null,null,null,null,0,0,null,null,null,null,null,null,null,null,null,null,null,null,null,null,null,null,null,null,null,null,null,null,null,null,null,null,null,null,null,null,null,null,null,null,null,null,null,null,null,null,null,null,null,null,null,null,null,null,null,null,null,null,null,null,null,null,null,null,null,null,null,null,"0",0]
[4353,"MOHAMAD DWIMAS FIRDAUS",null,null,0,0,null,null,null,null,"ISLAM","WNI",null,null,null,null,0,0,null,null,null,null,null,null,null,null,null,null,null,null,null,null,null,null,null,null,null,null,null,null,null,null,null,null,null,null,null,null,null,null,null,null,null,null,null,null,null,null,null,null,null,null,null,null,null,null,null,null,null,null,null,null,null,null,null,null,null,null,null,null,"0",0]
[4354,"MUHAMMAD ALVIN RIDHO",null,null,0,0,null,null,null,null,"ISLAM","WNI",null,null,null,null,0,0,null,null,null,null,null,null,null,null,null,null,null,null,null,null,null,null,null,null,null,null,null,null,null,null,null,null,null,null,null,null,null,null,null,null,null,null,null,null,null,null,null,null,null,null,null,null,null,null,null,null,null,null,null,null,null,null,null,null,null,null,null,null,"0",0]
[4355,"MUHAMAD JEFRI MAULANA",null,null,0,0,null,null,null,null,"ISLAM","WNI",null,null,null,null,0,0,null,null,null,null,null,null,null,null,null,null,null,null,null,null,null,null,null,null,null,null,null,null,null,null,null,null,null,null,null,null,null,null,null,null,null,null,null,null,null,null,null,null,null,null,null,null,null,null,null,null,null,null,null,null,null,null,null,null,null,null,null,null,"0",0]
[4356,"MUHAMMAD MAULANA ZIDANIL ILMI",null,null,0,0,null,null,null,null,"ISLAM","WNI",null,null,null,null,0,0,null,null,null,null,null,null,null,null,null,null,null,null,null,null,null,null,null,null,null,null,null,null,null,null,null,null,null,null,null,null,null,null,null,null,null,null,null,null,null,null,null,null,null,null,null,null,null,null,null,null,null,null,null,null,null,null,null,null,null,null,null,null,"0",0]
[4357,"MUHAMMAD SUTRISNO ISMAIL",null,null,0,0,null,null,null,null,"ISLAM","WNI",null,null,null,null,0,0,null,null,null,null,null,null,null,null,null,null,null,null,null,null,null,null,null,null,null,null,null,null,null,null,null,null,null,null,null,null,null,null,null,null,null,null,null,null,null,null,null,null,null,null,null,null,null,null,null,null,null,null,null,null,null,null,null,null,null,null,null,null,"0",0]
[4358,"PUTRI SHOLIKHA",null,null,0,0,null,null,null,null,"ISLAM","WNI",null,null,null,null,0,0,null,null,null,null,null,null,null,null,null,null,null,null,null,null,null,null,null,null,null,null,null,null,null,null,null,null,null,null,null,null,null,null,null,null,null,null,null,null,null,null,null,null,null,null,null,null,null,null,null,null,null,null,null,null,null,null,null,null,null,null,null,null,"0",0]
[4359,"ROUDHOTUS SA'DIYAH",null,null,0,0,null,null,null,null,"ISLAM","WNI",null,null,null,null,0,0,null,null,null,null,null,null,null,null,null,null,null,null,null,null,null,null,null,null,null,null,null,null,null,null,null,null,null,null,null,null,null,null,null,null,null,null,null,null,null,null,null,null,null,null,null,null,null,null,null,null,null,null,null,null,null,null,null,null,null,null,null,null,"0",0]
[4360,"ZIDNY ILMA NABILA",null,null,0,0,null,null,null,null,"ISLAM","WNI",null,null,null,null,0,0,null,null,null,null,null,null,null,null,null,null,null,null,null,null,null,null,null,null,null,null,null,null,null,null,null,null,null,null,null,null,null,null,null,null,null,null,null,null,null,null,null,null,null,null,null,null,null,null,null,null,null,null,null,null,null,null,null,null,null,null,null,null,"0",0]
[4361,"ACHMAD SEPTIAN HAMDANI",null,null,0,0,null,null,null,null,"ISLAM","WNI",null,null,null,null,0,0,null,null,null,null,null,null,null,null,null,null,null,null,null,null,null,null,null,null,null,null,null,null,null,null,null,null,null,null,null,null,null,null,null,null,null,null,null,null,null,null,null,null,null,null,null,null,null,null,null,null,null,null,null,null,null,null,null,null,null,null,null,null,"0",0]
[4362,"ACHMAD SULAIMAN",null,null,0,0,null,null,null,null,"ISLAM","WNI",null,null,null,null,{"$f":"AT367","v":0},{"$f":"AU367","v":0},null,null,null,null,null,null,null,null,null,null,null,null,null,null,null,null,null,null,null,null,null,null,null,null,null,null,null,null,null,null,null,null,null,null,null,null,null,null,null,null,null,null,null,null,null,null,null,null,null,null,null,null,null,null,null,null,null,null,null,null,null,null,"0",0]
[4363,null,null,null,0,0,null,null,null,null,"ISLAM","WNI",null,null,null,null,0,0,null,null,null,null,null,null,null,null,null,null,null,null,null,null,null,null,null,null,null,null,null,null,null,null,null,null,null,null,null,null,null,null,null,null,null,null,null,null,null,null,null,null,null,null,null,null,null,null,null,null,null,null,null,null,null,null,null,null,null,null,null,null,{"$f":"RIGHT(CD368,4)","v":"0"},{"$f":"PR368","v":0}]
[4364,"AIRLANGGA DWIKA RIZQI",null,null,0,0,null,null,null,null,"ISLAM","WNI",null,null,null,null,0,0,null,null,null,null,null,null,null,null,null,null,null,null,null,null,null,null,null,null,null,null,null,null,null,null,null,null,null,null,null,null,null,null,null,null,null,null,null,null,null,null,null,null,null,null,null,null,null,null,null,null,null,null,null,null,null,null,null,null,null,null,null,null,"0",0]
[4365,"AUFAN AZKAL ABRORI",null,null,0,0,null,null,null,null,"ISLAM","WNI",null,null,null,null,0,0,null,null,null,null,null,null,null,null,null,null,null,null,null,null,null,null,null,null,null,null,null,null,null,null,null,null,null,null,null,null,null,null,null,null,null,null,null,null,null,null,null,null,null,null,null,null,null,null,null,null,null,null,null,null,null,null,null,null,null,null,null,null,"0",0]
[4366,"BALQIS NAILA AUDIA",null,null,0,0,null,null,null,null,"ISLAM","WNI",null,null,null,null,0,0,null,null,null,null,null,null,null,null,null,null,null,null,null,null,null,null,null,null,null,null,null,null,null,null,null,null,null,null,null,null,null,null,null,null,null,null,null,null,null,null,null,null,null,null,null,null,null,null,null,null,null,null,null,null,null,null,null,null,null,null,null,null,"0",0]
[4367,"BIMA SATRIA DIRGANTARA",null,null,0,0,null,null,null,null,"ISLAM","WNI",null,null,null,null,0,0,null,null,null,null,null,null,null,null,null,null,null,null,null,null,null,null,null,null,null,null,null,null,null,null,null,null,null,null,null,null,null,null,null,null,null,null,null,null,null,null,null,null,null,null,null,null,null,null,null,null,null,null,null,null,null,null,null,null,null,null,null,null,"0",0]
[4368,"EKA AULIYA` PUTRI",null,null,0,0,null,null,null,null,"ISLAM","WNI",null,null,null,null,0,0,null,null,null,null,null,null,null,null,null,null,null,null,null,null,null,null,null,null,null,null,null,null,null,null,null,null,null,null,null,null,null,null,null,null,null,null,null,null,null,null,null,null,null,null,null,null,null,null,null,null,null,null,null,null,null,null,null,null,null,null,null,null,"0",0]
[4369,"FABIYAN TRI BAKTI OKTAFIAN",null,null,0,0,null,null,null,null,"ISLAM","WNI",null,null,null,null,0,0,null,null,null,null,null,null,null,null,null,null,null,null,null,null,null,null,null,null,null,null,null,null,null,null,null,null,null,null,null,null,null,null,null,null,null,null,null,null,null,null,null,null,null,null,null,null,null,null,null,null,null,null,null,null,null,null,null,null,null,null,null,null,"0",0]
[4370,"FAKHIS GABRIL LIA",null,null,0,0,null,null,null,null,"ISLAM","WNI",null,null,null,null,0,0,null,null,null,null,null,null,null,null,null,null,null,null,null,null,null,null,null,null,null,null,null,null,null,null,null,null,null,null,null,null,null,null,null,null,null,null,null,null,null,null,null,null,null,null,null,null,null,null,null,null,null,null,null,null,null,null,null,null,null,null,null,null,"0",0]
[4371,"GALIH FAREL PRASETYO",null,null,0,0,null,null,null,null,"ISLAM","WNI",null,null,null,null,0,0,null,null,null,null,null,null,null,null,null,null,null,null,null,null,null,null,null,null,null,null,null,null,null,null,null,null,null,null,null,null,null,null,null,null,null,null,null,null,null,null,null,null,null,null,null,null,null,null,null,null,null,null,null,null,null,null,null,null,null,null,null,null,"0",0]
[4372,"GILANG AKBAR PRASETYO",null,null,0,0,null,null,null,null,"ISLAM","WNI",null,null,null,null,0,0,null,null,null,null,null,null,null,null,null,null,null,null,null,null,null,null,null,null,null,null,null,null,null,null,null,null,null,null,null,null,null,null,null,null,null,null,null,null,null,null,null,null,null,null,null,null,null,null,null,null,null,null,null,null,null,null,null,null,null,null,null,null,"0",0]
[4373,"IFTAH IZZAH EMILIA  MAHMUD",null,null,0,0,null,null,null,null,"ISLAM","WNI",null,null,null,null,0,0,null,null,null,null,null,null,null,null,null,null,null,null,null,null,null,null,null,null,null,null,null,null,null,null,null,null,null,null,null,null,null,null,null,null,null,null,null,null,null,null,null,null,null,null,null,null,null,null,null,null,null,null,null,null,null,null,null,null,null,null,null,null,"0",0]
[4374,"IYAAD  AFLAKHA RAMZII",null,null,0,0,null,null,null,null,"ISLAM","WNI",null,null,null,null,0,0,null,null,null,null,null,null,null,null,null,null,null,null,null,null,null,null,null,null,null,null,null,null,null,null,null,null,null,null,null,null,null,null,null,null,null,null,null,null,null,null,null,null,null,null,null,null,null,null,null,null,null,null,null,null,null,null,null,null,null,null,null,null,"0",0]
[4375,"MUHAMMAD AFFAN ABI SYAHPUTRA",null,null,0,0,null,null,null,null,"ISLAM","WNI",null,null,null,null,0,0,null,null,null,null,null,null,null,null,null,null,null,null,null,null,null,null,null,null,null,null,null,null,null,null,null,null,null,null,null,null,null,null,null,null,null,null,null,null,null,null,null,null,null,null,null,null,null,null,null,null,null,null,null,null,null,null,null,null,null,null,null,null,"0",0]
[4376,"MUHAMMAD DWI WILDAN BAGUS KURNIAWAN",null,null,0,0,null,null,null,null,"ISLAM","WNI",null,null,null,null,0,0,null,null,null,null,null,null,null,null,null,null,null,null,null,null,null,null,null,null,null,null,null,null,null,null,null,null,null,null,null,null,null,null,null,null,null,null,null,null,null,null,null,null,null,null,null,null,null,null,null,null,null,null,null,null,null,null,null,null,null,null,null,null,"0",0]
[4377,"MUHAMMAD FARIL FIRMANSYA",null,null,0,0,null,null,null,null,"ISLAM","WNI",null,null,null,null,0,0,null,null,null,null,null,null,null,null,null,null,null,null,null,null,null,null,null,null,null,null,null,null,null,null,null,null,null,null,null,null,null,null,null,null,null,null,null,null,null,null,null,null,null,null,null,null,null,null,null,null,null,null,null,null,null,null,null,null,null,null,null,null,"0",0]
[4378,"MUKHAMAD DAVID ARIF FIRDAUS",null,null,0,0,null,null,null,null,"ISLAM","WNI",null,null,null,null,0,0,null,null,null,null,null,null,null,null,null,null,null,null,null,null,null,null,null,null,null,null,null,null,null,null,null,null,null,null,null,null,null,null,null,null,null,null,null,null,null,null,null,null,null,null,null,null,null,null,null,null,null,null,null,null,null,null,null,null,null,null,null,null,"0",0]
[4379,"NAORA ISQI AINAYYA",null,null,0,0,null,null,null,null,"ISLAM","WNI",null,null,null,null,0,0,null,null,null,null,null,null,null,null,null,null,null,null,null,null,null,null,null,null,null,null,null,null,null,null,null,null,null,null,null,null,null,null,null,null,null,null,null,null,null,null,null,null,null,null,null,null,null,null,null,null,null,null,null,null,null,null,null,null,null,null,null,null,"0",0]
[4380,"NAZRA ISLAMAY PASHA",null,null,0,0,null,null,null,null,"ISLAM","WNI",null,null,null,null,0,0,null,null,null,null,null,null,null,null,null,null,null,null,null,null,null,null,null,null,null,null,null,null,null,null,null,null,null,null,null,null,null,null,null,null,null,null,null,null,null,null,null,null,null,null,null,null,null,null,null,null,null,null,null,null,null,null,null,null,null,null,null,null,"0",0]
[4381,"NOVITA ERNIAWAN",null,null,0,0,null,null,null,null,"ISLAM","WNI",null,null,null,null,0,0,null,null,null,null,null,null,null,null,null,null,null,null,null,null,null,null,null,null,null,null,null,null,null,null,null,null,null,null,null,null,null,null,null,null,null,null,null,null,null,null,null,null,null,null,null,null,null,null,null,null,null,null,null,null,null,null,null,null,null,null,null,null,"0",0]
[4382,"NUR ALYA NABILA",null,null,0,0,null,null,null,null,"ISLAM","WNI",null,null,null,null,0,0,null,null,null,null,null,null,null,null,null,null,null,null,null,null,null,null,null,null,null,null,null,null,null,null,null,null,null,null,null,null,null,null,null,null,null,null,null,null,null,null,null,null,null,null,null,null,null,null,null,null,null,null,null,null,null,null,null,null,null,null,null,null,"0",0]
[4383,"PUTRI AULIA DWI AGUSTIN",null,null,0,0,null,null,null,null,"ISLAM","WNI",null,null,null,null,0,0,null,null,null,null,null,null,null,null,null,null,null,null,null,null,null,null,null,null,null,null,null,null,null,null,null,null,null,null,null,null,null,null,null,null,null,null,null,null,null,null,null,null,null,null,null,null,null,null,null,null,null,null,null,null,null,null,null,null,null,null,null,null,"0",0]
[4384,"RESTI FITRIANTI DWI OCTAVIANI",null,null,0,0,null,null,null,null,"ISLAM","WNI",null,null,null,null,0,0,null,null,null,null,null,null,null,null,null,null,null,null,null,null,null,null,null,null,null,null,null,null,null,null,null,null,null,null,null,null,null,null,null,null,null,null,null,null,null,null,null,null,null,null,null,null,null,null,null,null,null,null,null,null,null,null,null,null,null,null,null,null,"0",0]
[4385,"STANY RAFIDAH RAHMANIA",null,null,0,0,null,null,null,null,"ISLAM","WNI",null,null,null,null,0,0,null,null,null,null,null,null,null,null,null,null,null,null,null,null,null,null,null,null,null,null,null,null,null,null,null,null,null,null,null,null,null,null,null,null,null,null,null,null,null,null,null,null,null,null,null,null,null,null,null,null,null,null,null,null,null,null,null,null,null,null,null,null,"0",0]
[4386,"TIERSYA BETA RAMANUZAN",null,null,0,0,null,null,null,null,"ISLAM","WNI",null,null,null,null,0,0,null,null,null,null,null,null,null,null,null,null,null,null,null,null,null,null,null,null,null,null,null,null,null,null,null,null,null,null,null,null,null,null,null,null,null,null,null,null,null,null,null,null,null,null,null,null,null,null,null,null,null,null,null,null,null,null,null,null,null,null,null,null,"0",0]
[4387,"USWATUN KHASANAH",null,null,{"$f":"AQ392","v":0},{"$f":"QG392","v":0},null,null,null,null,"ISLAM","WNI",null,null,null,null,0,0,null,null,null,null,null,null,null,null,null,null,null,null,null,null,null,null,null,null,null,null,null,null,null,null,null,null,null,null,null,null,null,null,null,null,null,null,null,null,null,null,null,null,null,null,null,null,null,null,null,null,null,null,null,null,null,null,null,null,null,null,null,null,"0",0]
[4388,"VERA MUSTIKA",null,null,0,0,null,null,null,null,"ISLAM","WNI",null,null,null,null,0,0,null,null,null,null,null,null,null,null,null,null,null,null,null,null,null,null,null,null,null,null,null,null,null,null,null,null,null,null,null,null,null,null,null,null,null,null,null,null,null,null,null,null,null,null,null,null,null,null,null,null,null,null,null,null,null,null,null,null,null,null,null,null,"0",0]
[4389,"VIKROUL KHAMILA",null,null,0,0,null,null,null,null,"ISLAM","WNI",null,null,null,null,0,0,null,null,null,null,null,null,null,null,null,null,null,null,null,null,null,null,null,null,null,null,null,null,null,null,null,null,null,null,null,null,null,null,null,null,null,null,null,null,null,null,null,null,null,null,null,null,null,null,null,null,null,null,null,null,null,null,null,null,null,null,null,null,"0",0]
[4390,"ZITNATUL AULIA ILLA",null,null,0,0,null,null,null,null,"ISLAM","WNI",null,null,null,null,0,0,null,null,null,null,null,null,null,null,null,null,null,null,null,null,null,null,null,null,null,null,null,null,null,null,null,null,null,null,null,null,null,null,null,null,null,null,null,null,null,null,null,null,null,null,null,null,null,null,null,null,null,null,null,null,null,null,null,null,null,null,null,null,"0",0]
[4391,"HIDAYATUL KHUMAINIA",null,null,0,0,null,"P",null,null,"ISLAM","WNI",null,null,null,null,0,0,null,null,null,null,null,null,null,null,null,null,null,null,null,null,null,null,null,null,null,null,null,null,null,null,null,null,null,null,null,null,null,null,null,null,null,null,null,null,null,null,null,null,null,null,null,null,"2017/18",29.6,129,null,null,null,null,null,null,null,null,null,null,null,null,null,"0",0,null,null,null,null,null,null,null,"*"]
[4392,"PUTRI NAFI'ATUS SOLIKHAH",null,null,0,0,null,null,null,null,"ISLAM","WNI",null,null,null,null,0,0,null,null,null,null,null,null,null,null,null,null,null,null,null,null,null,null,null,null,null,null,null,null,null,null,null,null,null,null,null,null,null,null,null,null,null,null,null,null,null,null,null,null,null,null,null,null,"2017/18",28,138,null,null,null,null,null,null,null,null,null,null,null,null,null,"0",0,null,null,null,null,null,null,null,"*"]
[4393,"AHMAD SHOHIBI",null,null,0,0,null,"L",null,null,"ISLAM","WNI",null,null,null,null,0,0,null,null,null,null,null,null,null,null,null,null,null,null,null,null,null,null,null,null,null,null,null,null,null,null,null,null,null,null,null,null,null,null,null,null,null,null,null,null,null,null,null,null,null,null,null,null,null,null,null,null,null,"2017/18",46.5,154,null,null,null,null,null,null,null,null,"0",0,null,null,null,null,null,null,null,"*"]
[4394,null,null,null,0,0,null,null,null,null,"ISLAM","WNI",null,null,null,null,0,0,null,null,null,null,null,null,null,null,null,null,null,null,null,null,null,null,null,null,null,null,null,null,null,null,null,null,null,null,null,null,null,null,null,null,null,null,null,null,null,null,null,null,null,null,null,null,null,null,null,null,null,null,null,null,null,null,null,null,null,null,null,null,"0",0]
[4395,null,null,null,0,0,null,null,null,null,"ISLAM","WNI",null,null,null,null,0,0,null,null,null,null,null,null,null,null,null,null,null,null,null,null,null,null,null,null,null,null,null,null,null,null,null,null,null,null,null,null,null,null,null,null,null,null,null,null,null,null,null,null,null,null,null,null,null,null,null,null,null,null,null,null,null,null,null,null,null,null,null,null,"0",0]
[4396,null,null,null,0,0,null,null,null,null,"ISLAM","WNI",null,null,null,null,0,0,null,null,null,null,null,null,null,null,null,null,null,null,null,null,null,null,null,null,null,null,null,null,null,null,null,null,null,null,null,null,null,null,null,null,null,null,null,null,null,null,null,null,null,null,null,null,null,null,null,null,null,null,null,null,null,null,null,null,null,null,null,null,"0",0]
[4397,null,null,null,0,0,null,null,null,null,"ISLAM","WNI",null,null,null,null,0,0,null,null,null,null,null,null,null,null,null,null,null,null,null,null,null,null,null,null,null,null,null,null,null,null,null,null,null,null,null,null,null,null,null,null,null,null,null,null,null,null,null,null,null,null,null,null,null,null,null,null,null,null,null,null,null,null,null,null,null,null,null,null,"0",0]
[4398,"ANANDA AMILIA",null,null,0,0,null,"P",null,null,"ISLAM","WNI",null,null,null,null,0,0,null,null,null,null,null,null,null,null,null,null,null,null,null,null,null,null,null,null,null,null,null,null,null,null,null,null,null,null,null,null,null,null,null,null,null,null,null,null,null,null,null,null,null,null,null,null,"2017/18",63.7,148,null,null,null,null,null,null,null,null,null,null,null,null,null,"0",0,null,null,null,null,null,null,null,"*"]
[4399,"YUSFI RIZKY AZIZAH",null,null,0,0,null,"P",null,null,"ISLAM","WNI",null,null,null,null,0,0,null,null,null,null,null,null,null,null,null,null,null,null,null,null,null,null,null,null,null,null,null,null,null,null,null,null,null,null,null,null,null,null,null,null,null,null,null,null,null,null,null,null,null,null,null,null,null,null,null,null,null,"2017/18",29.6,139,null,null,null,null,null,null,null,null,"0",0,null,null,null,null,null,null,null,"*"]
[4400,null,null,null,0,0,null,null,null,null,"ISLAM","WNI",null,null,null,null,0,0,null,null,null,null,null,null,null,null,null,null,null,null,null,null,null,null,null,null,null,null,null,null,null,null,null,null,null,null,null,null,null,null,null,null,null,null,null,null,null,null,null,null,null,null,null,null,null,null,null,null,null,null,null,null,null,null,null,null,null,null,null,null,"0",0]
[4401,null,null,null,0,0,null,null,null,null,"ISLAM","WNI",null,null,null,null,0,0,null,null,null,null,null,null,null,null,null,null,null,null,null,null,null,null,null,null,null,null,null,null,null,null,null,null,null,null,null,null,null,null,null,null,null,null,null,null,null,null,null,null,null,null,null,null,null,null,null,null,null,null,null,null,null,null,null,null,null,null,null,null,"0",0]
[4402,null,null,null,0,0,null,null,null,null,"ISLAM","WNI",null,null,null,null,0,0,null,null,null,null,null,null,null,null,null,null,null,null,null,null,null,null,null,null,null,null,null,null,null,null,null,null,null,null,null,null,null,null,null,null,null,null,null,null,null,null,null,null,null,null,null,null,null,null,null,null,null,null,null,null,null,null,null,null,null,null,null,null,"0",0]
[4403,null,null,null,0,0,null,null,null,null,"ISLAM","WNI",null,null,null,null,0,0,null,null,null,null,null,null,null,null,null,null,null,null,null,null,null,null,null,null,null,null,null,null,null,null,null,null,null,null,null,null,null,null,null,null,null,null,null,null,null,null,null,null,null,null,null,null,null,null,null,null,null,null,null,null,null,null,null,null,null,null,null,null,"0",0]
[4404,null,null,null,0,0,null,null,null,null,"ISLAM","WNI",null,null,null,null,0,0,null,null,null,null,null,null,null,null,null,null,null,null,null,null,null,null,null,null,null,null,null,null,null,null,null,null,null,null,null,null,null,null,null,null,null,null,null,null,null,null,null,null,null,null,null,null,null,null,null,null,null,null,null,null,null,null,null,null,null,null,null,null,"0",0]
[4405,null,null,null,0,0,null,null,null,null,"ISLAM","WNI",null,null,null,null,0,0,null,null,null,null,null,null,null,null,null,null,null,null,null,null,null,null,null,null,null,null,null,null,null,null,null,null,null,null,null,null,null,null,null,null,null,null,null,null,null,null,null,null,null,null,null,null,null,null,null,null,null,null,null,null,null,null,null,null,null,null,null,null,"0",0]
[4406,null,null,null,0,0,null,null,null,null,"ISLAM","WNI",null,null,null,null,0,0,null,null,null,null,null,null,null,null,null,null,null,null,null,null,null,null,null,null,null,null,null,null,null,null,null,null,null,null,null,null,null,null,null,null,null,null,null,null,null,null,null,null,null,null,null,null,null,null,null,null,null,null,null,null,null,null,null,null,null,null,null,null,"0",0]
[4407,null,null,null,0,0,null,null,null,null,"ISLAM","WNI",null,null,null,null,0,0,null,null,null,null,null,null,null,null,null,null,null,null,null,null,null,null,null,null,null,null,null,null,null,null,null,null,null,null,null,null,null,null,null,null,null,null,null,null,null,null,null,null,null,null,null,null,null,null,null,null,null,null,null,null,null,null,null,null,null,null,null,null,"0",0]
[4408,null,null,null,0,0,null,null,null,null,"ISLAM","WNI",null,null,null,null,0,0,null,null,null,null,null,null,null,null,null,null,null,null,null,null,null,null,null,null,null,null,null,null,null,null,null,null,null,null,null,null,null,null,null,null,null,null,null,null,null,null,null,null,null,null,null,null,null,null,null,null,null,null,null,null,null,null,null,null,null,null,null,null,"0",0]
[4409,null,null,null,0,0,null,null,null,null,"ISLAM","WNI",null,null,null,null,0,0,null,null,null,null,null,null,null,null,null,null,null,null,null,null,null,null,null,null,null,null,null,null,null,null,null,null,null,null,null,null,null,null,null,null,null,null,null,null,null,null,null,null,null,null,null,null,null,null,null,null,null,null,null,null,null,null,null,null,null,null,null,null,"0",0]
[4410,null,null,null,0,0,null,null,null,null,"ISLAM","WNI",null,null,null,null,0,0,null,null,null,null,null,null,null,null,null,null,null,null,null,null,null,null,null,null,null,null,null,null,null,null,null,null,null,null,null,null,null,null,null,null,null,null,null,null,null,null,null,null,null,null,null,null,null,null,null,null,null,null,null,null,null,null,null,null,null,null,null,null,"0",0]
[4411,null,null,null,0,0,null,null,null,null,"ISLAM","WNI",null,null,null,null,0,0,null,null,null,null,null,null,null,null,null,null,null,null,null,null,null,null,null,null,null,null,null,null,null,null,null,null,null,null,null,null,null,null,null,null,null,null,null,null,null,null,null,null,null,null,null,null,null,null,null,null,null,null,null,null,null,null,null,null,null,null,null,null,"0",0]
[4412,null,null,null,0,0,null,null,null,null,"ISLAM","WNI",null,null,null,null,0,0,null,null,null,null,null,null,null,null,null,null,null,null,null,null,null,null,null,null,null,null,null,null,null,null,null,null,null,null,null,null,null,null,null,null,null,null,null,null,null,null,null,null,null,null,null,null,null,null,null,null,null,null,null,null,null,null,null,null,null,null,null,null,"0",0]
[4413,null,null,null,0,0,null,null,null,null,"ISLAM","WNI",null,null,null,null,0,0,null,null,null,null,null,null,null,null,null,null,null,null,null,null,null,null,null,null,null,null,null,null,null,null,null,null,null,null,null,null,null,null,null,null,null,null,null,null,null,null,null,null,null,null,null,null,null,null,null,null,null,null,null,null,null,null,null,null,null,null,null,null,"0",0]
[4414,null,null,null,0,0,null,null,null,null,"ISLAM","WNI",null,null,null,null,0,0,null,null,null,null,null,null,null,null,null,null,null,null,null,null,null,null,null,null,null,null,null,null,null,null,null,null,null,null,null,null,null,null,null,null,null,null,null,null,null,null,null,null,null,null,null,null,null,null,null,null,null,null,null,null,null,null,null,null,null,null,null,null,"0",0]
[4415,null,null,null,0,0,null,null,null,null,"ISLAM","WNI",null,null,null,null,0,0,null,null,null,null,null,null,null,null,null,null,null,null,null,null,null,null,null,null,null,null,null,null,null,null,null,null,null,null,null,null,null,null,null,null,null,null,null,null,null,null,null,null,null,null,null,null,null,null,null,null,null,null,null,null,null,null,null,null,null,null,null,null,"0",0]
[4416,null,null,null,0,0,null,null,null,null,"ISLAM","WNI",null,null,null,null,0,0,null,null,null,null,null,null,null,null,null,null,null,null,null,null,null,null,null,null,null,null,null,null,null,null,null,null,null,null,null,null,null,null,null,null,null,null,null,null,null,null,null,null,null,null,null,null,null,null,null,null,null,null,null,null,null,null,null,null,null,null,null,null,"0",0]
[4417,null,null,null,0,0,null,null,null,null,"ISLAM","WNI",null,null,null,null,0,0,null,null,null,null,null,null,null,null,null,null,null,null,null,null,null,null,null,null,null,null,null,null,null,null,null,null,null,null,null,null,null,null,null,null,null,null,null,null,null,null,null,null,null,null,null,null,null,null,null,null,null,null,null,null,null,null,null,null,null,null,null,null,"0",0]
[4418,null,null,null,0,0,null,null,null,null,"ISLAM","WNI",null,null,null,null,0,0,null,null,null,null,null,null,null,null,null,null,null,null,null,null,null,null,null,null,null,null,null,null,null,null,null,null,null,null,null,null,null,null,null,null,null,null,null,null,null,null,null,null,null,null,null,null,null,null,null,null,null,null,null,null,null,null,null,null,null,null,null,null,"0",0]
[4419,null,null,null,0,0,null,null,null,null,"ISLAM","WNI",null,null,null,null,0,0,null,null,null,null,null,null,null,null,null,null,null,null,null,null,null,null,null,null,null,null,null,null,null,null,null,null,null,null,null,null,null,null,null,null,null,null,null,null,null,null,null,null,null,null,null,null,null,null,null,null,null,null,null,null,null,null,null,null,null,null,null,null,"0",0]
[4420,null,null,null,0,0,null,null,null,null,"ISLAM","WNI",null,null,null,null,0,0,null,null,null,null,null,null,null,null,null,null,null,null,null,null,null,null,null,null,null,null,null,null,null,null,null,null,null,null,null,null,null,null,null,null,null,null,null,null,null,null,null,null,null,null,null,null,null,null,null,null,null,null,null,null,null,null,null,null,null,null,null,null,"0",0]
[4421,null,null,null,0,0,null,null,null,null,"ISLAM","WNI",null,null,null,null,0,0,null,null,null,null,null,null,null,null,null,null,null,null,null,null,null,null,null,null,null,null,null,null,null,null,null,null,null,null,null,null,null,null,null,null,null,null,null,null,null,null,null,null,null,null,null,null,null,null,null,null,null,null,null,null,null,null,null,null,null,null,null,null,"0",0]
[4422,null,null,null,0,0,null,null,null,null,"ISLAM","WNI",null,null,null,null,0,0,null,null,null,null,null,null,null,null,null,null,null,null,null,null,null,null,null,null,null,null,null,null,null,null,null,null,null,null,null,null,null,null,null,null,null,null,null,null,null,null,null,null,null,null,null,null,null,null,null,null,null,null,null,null,null,null,null,null,null,null,null,null,"0",0]
[4423,null,null,null,0,0,null,null,null,null,"ISLAM","WNI",null,null,null,null,0,0,null,null,null,null,null,null,null,null,null,null,null,null,null,null,null,null,null,null,null,null,null,null,null,null,null,null,null,null,null,null,null,null,null,null,null,null,null,null,null,null,null,null,null,null,null,null,null,null,null,null,null,null,null,null,null,null,null,null,null,null,null,null,"0",0]
[4424,null,null,null,0,0,null,null,null,null,"ISLAM","WNI",null,null,null,null,0,0,null,null,null,null,null,null,null,null,null,null,null,null,null,null,null,null,null,null,null,null,null,null,null,null,null,null,null,null,null,null,null,null,null,null,null,null,null,null,null,null,null,null,null,null,null,null,null,null,null,null,null,null,null,null,null,null,null,null,null,null,null,null,"0",0]
[4425,null,null,null,0,0,null,null,null,null,"ISLAM","WNI",null,null,null,null,0,0,null,null,null,null,null,null,null,null,null,null,null,null,null,null,null,null,null,null,null,null,null,null,null,null,null,null,null,null,null,null,null,null,null,null,null,null,null,null,null,null,null,null,null,null,null,null,null,null,null,null,null,null,null,null,null,null,null,null,null,null,null,null,"0",0]
[4426,null,null,null,0,0,null,null,null,null,"ISLAM","WNI",null,null,null,null,{"$f":"AT431","v":0},{"$f":"AU431","v":0},null,null,null,null,null,null,null,null,null,null,null,null,null,null,null,null,null,null,null,null,null,null,null,null,null,null,null,null,null,null,null,null,null,null,null,null,null,null,null,null,null,null,null,null,null,null,null,null,null,null,null,null,null,null,null,null,null,null,null,null,null,null,"0",0]
[4427,null,null,null,0,0,null,null,null,null,"ISLAM","WNI",null,null,null,null,0,0,null,null,null,null,null,null,null,null,null,null,null,null,null,null,null,null,null,null,null,null,null,null,null,null,null,null,null,null,null,null,null,null,null,null,null,null,null,null,null,null,null,null,null,null,null,null,null,null,null,null,null,null,null,null,null,null,null,null,null,null,null,null,{"$f":"RIGHT(CD432,4)","v":"0"},{"$f":"PR432","v":0}]
[4428,null,null,null,0,0,null,null,null,null,"ISLAM","WNI",null,null,null,null,0,0,null,null,null,null,null,null,null,null,null,null,null,null,null,null,null,null,null,null,null,null,null,null,null,null,null,null,null,null,null,null,null,null,null,null,null,null,null,null,null,null,null,null,null,null,null,null,null,null,null,null,null,null,null,null,null,null,null,null,null,null,null,null,"0",0]
[4429,null,null,null,0,0,null,null,null,null,"ISLAM","WNI",null,null,null,null,0,0,null,null,null,null,null,null,null,null,null,null,null,null,null,null,null,null,null,null,null,null,null,null,null,null,null,null,null,null,null,null,null,null,null,null,null,null,null,null,null,null,null,null,null,null,null,null,null,null,null,null,null,null,null,null,null,null,null,null,null,null,null,null,"0",0]
[4430,null,null,null,0,0,null,null,null,null,"ISLAM","WNI",null,null,null,null,0,0,null,null,null,null,null,null,null,null,null,null,null,null,null,null,null,null,null,null,null,null,null,null,null,null,null,null,null,null,null,null,null,null,null,null,null,null,null,null,null,null,null,null,null,null,null,null,null,null,null,null,null,null,null,null,null,null,null,null,null,null,null,null,"0",0]
[4431,null,null,null,0,0,null,null,null,null,"ISLAM","WNI",null,null,null,null,0,0,null,null,null,null,null,null,null,null,null,null,null,null,null,null,null,null,null,null,null,null,null,null,null,null,null,null,null,null,null,null,null,null,null,null,null,null,null,null,null,null,null,null,null,null,null,null,null,null,null,null,null,null,null,null,null,null,null,null,null,null,null,null,"0",0]
[4432,null,null,null,0,0,null,null,null,null,"ISLAM","WNI",null,null,null,null,0,0,null,null,null,null,null,null,null,null,null,null,null,null,null,null,null,null,null,null,null,null,null,null,null,null,null,null,null,null,null,null,null,null,null,null,null,null,null,null,null,null,null,null,null,null,null,null,null,null,null,null,null,null,null,null,null,null,null,null,null,null,null,null,"0",0]
[4433,null,null,null,0,0,null,null,null,null,"ISLAM","WNI",null,null,null,null,0,0,null,null,null,null,null,null,null,null,null,null,null,null,null,null,null,null,null,null,null,null,null,null,null,null,null,null,null,null,null,null,null,null,null,null,null,null,null,null,null,null,null,null,null,null,null,null,null,null,null,null,null,null,null,null,null,null,null,null,null,null,null,null,"0",0]
[4434,null,null,null,0,0,null,null,null,null,"ISLAM","WNI",null,null,null,null,0,0,null,null,null,null,null,null,null,null,null,null,null,null,null,null,null,null,null,null,null,null,null,null,null,null,null,null,null,null,null,null,null,null,null,null,null,null,null,null,null,null,null,null,null,null,null,null,null,null,null,null,null,null,null,null,null,null,null,null,null,null,null,null,"0",0]
[4435,null,null,null,0,0,null,null,null,null,"ISLAM","WNI",null,null,null,null,0,0,null,null,null,null,null,null,null,null,null,null,null,null,null,null,null,null,null,null,null,null,null,null,null,null,null,null,null,null,null,null,null,null,null,null,null,null,null,null,null,null,null,null,null,null,null,null,null,null,null,null,null,null,null,null,null,null,null,null,null,null,null,null,"0",0]
[4436,null,null,null,0,0,null,null,null,null,"ISLAM","WNI",null,null,null,null,0,0,null,null,null,null,null,null,null,null,null,null,null,null,null,null,null,null,null,null,null,null,null,null,null,null,null,null,null,null,null,null,null,null,null,null,null,null,null,null,null,null,null,null,null,null,null,null,null,null,null,null,null,null,null,null,null,null,null,null,null,null,null,null,"0",0]
[4437,null,null,null,0,0,null,null,null,null,"ISLAM","WNI",null,null,null,null,0,0,null,null,null,null,null,null,null,null,null,null,null,null,null,null,null,null,null,null,null,null,null,null,null,null,null,null,null,null,null,null,null,null,null,null,null,null,null,null,null,null,null,null,null,null,null,null,null,null,null,null,null,null,null,null,null,null,null,null,null,null,null,null,"0",0]
[4438,null,null,null,0,0,null,null,null,null,"ISLAM","WNI",null,null,null,null,0,0,null,null,null,null,null,null,null,null,null,null,null,null,null,null,null,null,null,null,null,null,null,null,null,null,null,null,null,null,null,null,null,null,null,null,null,null,null,null,null,null,null,null,null,null,null,null,null,null,null,null,null,null,null,null,null,null,null,null,null,null,null,null,"0",0]
[4439,null,null,null,0,0,null,null,null,null,"ISLAM","WNI",null,null,null,null,0,0,null,null,null,null,null,null,null,null,null,null,null,null,null,null,null,null,null,null,null,null,null,null,null,null,null,null,null,null,null,null,null,null,null,null,null,null,null,null,null,null,null,null,null,null,null,null,null,null,null,null,null,null,null,null,null,null,null,null,null,null,null,null,"0",0]
[4440,null,null,null,0,0,null,null,null,null,"ISLAM","WNI",null,null,null,null,0,0,null,null,null,null,null,null,null,null,null,null,null,null,null,null,null,null,null,null,null,null,null,null,null,null,null,null,null,null,null,null,null,null,null,null,null,null,null,null,null,null,null,null,null,null,null,null,null,null,null,null,null,null,null,null,null,null,null,null,null,null,null,null,"0",0]
[4441,null,null,null,0,0,null,null,null,null,"ISLAM","WNI",null,null,null,null,0,0,null,null,null,null,null,null,null,null,null,null,null,null,null,null,null,null,null,null,null,null,null,null,null,null,null,null,null,null,null,null,null,null,null,null,null,null,null,null,null,null,null,null,null,null,null,null,null,null,null,null,null,null,null,null,null,null,null,null,null,null,null,null,"0",0]
[4442,null,null,null,0,0,null,null,null,null,"ISLAM","WNI",null,null,null,null,0,0,null,null,null,null,null,null,null,null,null,null,null,null,null,null,null,null,null,null,null,null,null,null,null,null,null,null,null,null,null,null,null,null,null,null,null,null,null,null,null,null,null,null,null,null,null,null,null,null,null,null,null,null,null,null,null,null,null,null,null,null,null,null,"0",0]
[4443,null,null,null,0,0,null,null,null,null,"ISLAM","WNI",null,null,null,null,0,0,null,null,null,null,null,null,null,null,null,null,null,null,null,null,null,null,null,null,null,null,null,null,null,null,null,null,null,null,null,null,null,null,null,null,null,null,null,null,null,null,null,null,null,null,null,null,null,null,null,null,null,null,null,null,null,null,null,null,null,null,null,null,"0",0]
[4444,"HAPS",null,null,0,0,null,"L","LUMAJANG",null,"ISLAM","WNI",null,null,null,null,0,0,null,null,null,null,null,null,null,null,null,null,null,null,null,null,null,null,null,null,null,null,null,null,null,null,null,null,null,null,null,null,null,null,null,null,null,null,null,null,null,null,null,null,null,null,null,null,null,null,null,null,null,null,null,null,null,null,null,null,null,null,null,null,"0",0,null,null,null,null,null,null,null,"*"]
[4445,null,null,null,0,0,null,null,null,null,"ISLAM","WNI",null,null,null,null,0,0,null,null,null,null,null,null,null,null,null,null,null,null,null,null,null,null,null,null,null,null,null,null,null,null,null,null,null,null,null,null,null,null,null,null,null,null,null,null,null,null,null,null,null,null,null,null,null,null,null,null,null,null,null,null,null,null,null,null,null,null,null,null,"0",0]
[4446,null,null,null,0,0,null,null,null,null,"ISLAM","WNI",null,null,null,null,0,0,null,null,null,null,null,null,null,null,null,null,null,null,null,null,null,null,null,null,null,null,null,null,null,null,null,null,null,null,null,null,null,null,null,null,null,null,null,null,null,null,null,null,null,null,null,null,null,null,null,null,null,null,null,null,null,null,null,null,null,null,null,null,"0",0]
[4447,null,null,null,0,0,null,null,null,null,"ISLAM","WNI",null,null,null,null,0,0,null,null,null,null,null,null,null,null,null,null,null,null,null,null,null,null,null,null,null,null,null,null,null,null,null,null,null,null,null,null,null,null,null,null,null,null,null,null,null,null,null,null,null,null,null,null,null,null,null,null,null,null,null,null,null,null,null,null,null,null,null,null,"0",0]
[4448,null,null,null,0,0,null,null,null,null,"ISLAM","WNI",null,null,null,null,0,0,null,null,null,null,null,null,null,null,null,null,null,null,null,null,null,null,null,null,null,null,null,null,null,null,null,null,null,null,null,null,null,null,null,null,null,null,null,null,null,null,null,null,null,null,null,null,null,null,null,null,null,null,null,null,null,null,null,null,null,null,null,null,"0",0]
[4449,null,null,null,0,0,null,null,null,null,"ISLAM","WNI",null,null,null,null,0,0,null,null,null,null,null,null,null,null,null,null,null,null,null,null,null,null,null,null,null,null,null,null,null,null,null,null,null,null,null,null,null,null,null,null,null,null,null,null,null,null,null,null,null,null,null,null,null,null,null,null,null,null,null,null,null,null,null,null,null,null,null,null,"0",0]
[4450,null,null,null,0,0,null,null,null,null,"ISLAM","WNI",null,null,null,null,0,0,null,null,null,null,null,null,null,null,null,null,null,null,null,null,null,null,null,null,null,null,null,null,null,null,null,null,null,null,null,null,null,null,null,null,null,null,null,null,null,null,null,null,null,null,null,null,null,null,null,null,null,null,null,null,null,null,null,null,null,null,null,null,"0",0]
[4451,null,null,null,{"$f":"AQ456","v":0},{"$f":"QG456","v":0},null,null,null,null,"ISLAM","WNI",null,null,null,null,0,0,null,null,null,null,null,null,null,null,null,null,null,null,null,null,null,null,null,null,null,null,null,null,null,null,null,null,null,null,null,null,null,null,null,null,null,null,null,null,null,null,null,null,null,null,null,null,null,null,null,null,null,null,null,null,null,null,null,null,null,null,null,null,"0",0]
[4452,null,null,null,0,0,null,null,null,null,"ISLAM","WNI",null,null,null,null,0,0,null,null,null,null,null,null,null,null,null,null,null,null,null,null,null,null,null,null,null,null,null,null,null,null,null,null,null,null,null,null,null,null,null,null,null,null,null,null,null,null,null,null,null,null,null,null,null,null,null,null,null,null,null,null,null,null,null,null,null,null,null,null,"0",0]
[4453,null,null,null,0,0,null,null,null,null,"ISLAM","WNI",null,null,null,null,0,0,null,null,null,null,null,null,null,null,null,null,null,null,null,null,null,null,null,null,null,null,null,null,null,null,null,null,null,null,null,null,null,null,null,null,null,null,null,null,null,null,null,null,null,null,null,null,null,null,null,null,null,null,null,null,null,null,null,null,null,null,null,null,"0",0]
[4454,null,null,null,0,0,null,null,null,null,"ISLAM","WNI",null,null,null,null,0,0,null,null,null,null,null,null,null,null,null,null,null,null,null,null,null,null,null,null,null,null,null,null,null,null,null,null,null,null,null,null,null,null,null,null,null,null,null,null,null,null,null,null,null,null,null,null,null,null,null,null,null,null,null,null,null,null,null,null,null,null,null,null,"0",0]
[4455,null,null,null,0,0,null,null,null,null,"ISLAM","WNI",null,null,null,null,0,0,null,null,null,null,null,null,null,null,null,null,null,null,null,null,null,null,null,null,null,null,null,null,null,null,null,null,null,null,null,null,null,null,null,null,null,null,null,null,null,null,null,null,null,null,null,null,null,null,null,null,null,null,null,null,null,null,null,null,null,null,null,null,"0",0]
[4456,null,null,null,0,0,null,null,null,null,"ISLAM","WNI",null,null,null,null,0,0,null,null,null,null,null,null,null,null,null,null,null,null,null,null,null,null,null,null,null,null,null,null,null,null,null,null,null,null,null,null,null,null,null,null,null,null,null,null,null,null,null,null,null,null,null,null,null,null,null,null,null,null,null,null,null,null,null,null,null,null,null,null,"0",0]
[4457,null,null,null,0,0,null,null,null,null,"ISLAM","WNI",null,null,null,null,0,0,null,null,null,null,null,null,null,null,null,null,null,null,null,null,null,null,null,null,null,null,null,null,null,null,null,null,null,null,null,null,null,null,null,null,null,null,null,null,null,null,null,null,null,null,null,null,null,null,null,null,null,null,null,null,null,null,null,null,null,null,null,null,"0",0]
[4458,null,null,null,0,0,null,null,null,null,"ISLAM","WNI",null,null,null,null,0,0,null,null,null,null,null,null,null,null,null,null,null,null,null,null,null,null,null,null,null,null,null,null,null,null,null,null,null,null,null,null,null,null,null,null,null,null,null,null,null,null,null,null,null,null,null,null,null,null,null,null,null,null,null,null,null,null,null,null,null,null,null,null,"0",0]
[4459,null,null,null,0,0,null,null,null,null,"ISLAM","WNI",null,null,null,null,0,0,null,null,null,null,null,null,null,null,null,null,null,null,null,null,null,null,null,null,null,null,null,null,null,null,null,null,null,null,null,null,null,null,null,null,null,null,null,null,null,null,null,null,null,null,null,null,null,null,null,null,null,null,null,null,null,null,null,null,null,null,null,null,"0",0]
[4460,null,null,null,0,0,null,null,null,null,"ISLAM","WNI",null,null,null,null,0,0,null,null,null,null,null,null,null,null,null,null,null,null,null,null,null,null,null,null,null,null,null,null,null,null,null,null,null,null,null,null,null,null,null,null,null,null,null,null,null,null,null,null,null,null,null,null,null,null,null,null,null,null,null,null,null,null,null,null,null,null,null,null,"0",0]
[4461,null,null,null,0,0,null,null,null,null,"ISLAM","WNI",null,null,null,null,0,0,null,null,null,null,null,null,null,null,null,null,null,null,null,null,null,null,null,null,null,null,null,null,null,null,null,null,null,null,null,null,null,null,null,null,null,null,null,null,null,null,null,null,null,null,null,null,null,null,null,null,null,null,null,null,null,null,null,null,null,null,null,null,"0",0]
[4462,null,null,null,0,0,null,null,null,null,"ISLAM","WNI",null,null,null,null,0,0,null,null,null,null,null,null,null,null,null,null,null,null,null,null,null,null,null,null,null,null,null,null,null,null,null,null,null,null,null,null,null,null,null,null,null,null,null,null,null,null,null,null,null,null,null,null,null,null,null,null,null,null,null,null,null,null,null,null,null,null,null,null,"0",0]
[4463,null,null,null,0,0,null,null,null,null,"ISLAM","WNI",null,null,null,null,0,0,null,null,null,null,null,null,null,null,null,null,null,null,null,null,null,null,null,null,null,null,null,null,null,null,null,null,null,null,null,null,null,null,null,null,null,null,null,null,null,null,null,null,null,null,null,null,null,null,null,null,null,null,null,null,null,null,null,null,null,null,null,null,"0",0]
[4464,null,null,null,0,0,null,null,null,null,"ISLAM","WNI",null,null,null,null,0,0,null,null,null,null,null,null,null,null,null,null,null,null,null,null,null,null,null,null,null,null,null,null,null,null,null,null,null,null,null,null,null,null,null,null,null,null,null,null,null,null,null,null,null,null,null,null,null,null,null,null,null,null,null,null,null,null,null,null,null,null,null,null,"0",0]
[4465,"AZZA PRISHAL DWI PUTRA",null,null,0,0,null,null,null,null,"ISLAM","WNI",null,null,null,null,0,0,null,null,null,null,null,null,null,null,null,null,null,null,null,null,null,null,null,null,null,null,null,null,null,null,null,null,null,null,null,null,null,null,null,null,null,null,null,null,null,null,null,null,null,null,null,null,null,null,null,null,null,null,null,null,null,null,null,null,null,null,null,null,"0",0]
[4466,"HIBATULLAH MUSTAGHFIRY RUSLI",null,null,0,0,null,null,null,null,"ISLAM","WNI",null,null,null,null,0,0,null,null,null,null,null,null,null,null,null,null,null,null,null,null,null,null,null,null,null,null,null,null,null,null,null,null,null,null,null,null,null,null,null,null,null,null,null,null,null,null,null,null,null,null,null,null,null,null,null,null,null,null,null,null,null,null,null,null,null,null,null,null,"0",0]
[4467,null,null,null,0,0,null,null,null,null,"ISLAM","WNI",null,null,null,null,0,0,null,null,null,null,null,null,null,null,null,null,null,null,null,null,null,null,null,null,null,null,null,null,null,null,null,null,null,null,null,null,null,null,null,null,null,null,null,null,null,null,null,null,null,null,null,null,null,null,null,null,null,null,null,null,null,null,null,null,null,null,null,null,"0",0]
[4468,null,null,null,0,0,null,null,null,null,"ISLAM","WNI",null,null,null,null,0,0,null,null,null,null,null,null,null,null,null,null,null,null,null,null,null,null,null,null,null,null,null,null,null,null,null,null,null,null,null,null,null,null,null,null,null,null,null,null,null,null,null,null,null,null,null,null,null,null,null,null,null,null,null,null,null,null,null,null,null,null,null,null,"0",0]
[4469,null,null,null,0,0,null,null,null,null,"ISLAM","WNI",null,null,null,null,0,0,null,null,null,null,null,null,null,null,null,null,null,null,null,null,null,null,null,null,null,null,null,null,null,null,null,null,null,null,null,null,null,null,null,null,null,null,null,null,null,null,null,null,null,null,null,null,null,null,null,null,null,null,null,null,null,null,null,null,null,null,null,null,"0",0]
[4470,null,null,null,0,0,null,null,null,null,"ISLAM","WNI",null,null,null,null,0,0,null,null,null,null,null,null,null,null,null,null,null,null,null,null,null,null,null,null,null,null,null,null,null,null,null,null,null,null,null,null,null,null,null,null,null,null,null,null,null,null,null,null,null,null,null,null,null,null,null,null,null,null,null,null,null,null,null,null,null,null,null,null,"0",0]
[4471,null,null,null,0,0,null,null,null,null,"ISLAM","WNI",null,null,null,null,0,0,null,null,null,null,null,null,null,null,null,null,null,null,null,null,null,null,null,null,null,null,null,null,null,null,null,null,null,null,null,null,null,null,null,null,null,null,null,null,null,null,null,null,null,null,null,null,null,null,null,null,null,null,null,null,null,null,null,null,null,null,null,null,"0",0]
[4472,null,null,null,0,0,null,null,null,null,"ISLAM","WNI",null,null,null,null,0,0,null,null,null,null,null,null,null,null,null,null,null,null,null,null,null,null,null,null,null,null,null,null,null,null,null,null,null,null,null,null,null,null,null,null,null,null,null,null,null,null,null,null,null,null,null,null,null,null,null,null,null,null,null,null,null,null,null,null,null,null,null,null,"0",0]
[4473,null,null,null,0,0,null,null,null,null,"ISLAM","WNI",null,null,null,null,0,0,null,null,null,null,null,null,null,null,null,null,null,null,null,null,null,null,null,null,null,null,null,null,null,null,null,null,null,null,null,null,null,null,null,null,null,null,null,null,null,null,null,null,null,null,null,null,null,null,null,null,null,null,null,null,null,null,null,null,null,null,null,null,"0",0]
[4474,null,null,null,0,0,null,null,null,null,"ISLAM","WNI",null,null,null,null,0,0,null,null,null,null,null,null,null,null,null,null,null,null,null,null,null,null,null,null,null,null,null,null,null,null,null,null,null,null,null,null,null,null,null,null,null,null,null,null,null,null,null,null,null,null,null,null,null,null,null,null,null,null,null,null,null,null,null,null,null,null,null,null,"0",0]
[4475,null,null,null,0,0,null,null,null,null,"ISLAM","WNI",null,null,null,null,0,0,null,null,null,null,null,null,null,null,null,null,null,null,null,null,null,null,null,null,null,null,null,null,null,null,null,null,null,null,null,null,null,null,null,null,null,null,null,null,null,null,null,null,null,null,null,null,null,null,null,null,null,null,null,null,null,null,null,null,null,null,null,null,"0",0]
[4476,null,null,null,0,0,null,null,null,null,"ISLAM","WNI",null,null,null,null,0,0,null,null,null,null,null,null,null,null,null,null,null,null,null,null,null,null,null,null,null,null,null,null,null,null,null,null,null,null,null,null,null,null,null,null,null,null,null,null,null,null,null,null,null,null,null,null,null,null,null,null,null,null,null,null,null,null,null,null,null,null,null,null,"0",0]
[4477,null,null,null,0,0,null,null,null,null,"ISLAM","WNI",null,null,null,null,0,0,null,null,null,null,null,null,null,null,null,null,null,null,null,null,null,null,null,null,null,null,null,null,null,null,null,null,null,null,null,null,null,null,null,null,null,null,null,null,null,null,null,null,null,null,null,null,null,null,null,null,null,null,null,null,null,null,null,null,null,null,null,null,"0",0]
[4478,null,null,null,0,0,null,null,null,null,"ISLAM","WNI",null,null,null,null,0,0,null,null,null,null,null,null,null,null,null,null,null,null,null,null,null,null,null,null,null,null,null,null,null,null,null,null,null,null,null,null,null,null,null,null,null,null,null,null,null,null,null,null,null,null,null,null,null,null,null,null,null,null,null,null,null,null,null,null,null,null,null,null,"0",0]
[4479,null,null,null,0,0,null,null,null,null,"ISLAM","WNI",null,null,null,null,0,0,null,null,null,null,null,null,null,null,null,null,null,null,null,null,null,null,null,null,null,null,null,null,null,null,null,null,null,null,null,null,null,null,null,null,null,null,null,null,null,null,null,null,null,null,null,null,null,null,null,null,null,null,null,null,null,null,null,null,null,null,null,null,"0",0]
[4480,null,null,null,0,0,null,null,null,null,"ISLAM","WNI",null,null,null,null,0,0,null,null,null,null,null,null,null,null,null,null,null,null,null,null,null,null,null,null,null,null,null,null,null,null,null,null,null,null,null,null,null,null,null,null,null,null,null,null,null,null,null,null,null,null,null,null,null,null,null,null,null,null,null,null,null,null,null,null,null,null,null,null,"0",0]
[4481,null,null,null,0,0,null,null,null,null,"ISLAM","WNI",null,null,null,null,0,0,null,null,null,null,null,null,null,null,null,null,null,null,null,null,null,null,null,null,null,null,null,null,null,null,null,null,null,null,null,null,null,null,null,null,null,null,null,null,null,null,null,null,null,null,null,null,null,null,null,null,null,null,null,null,null,null,null,null,null,null,null,null,"0",0]
[4482,null,null,null,0,0,null,null,null,null,"ISLAM","WNI",null,null,null,null,0,0,null,null,null,null,null,null,null,null,null,null,null,null,null,null,null,null,null,null,null,null,null,null,null,null,null,null,null,null,null,null,null,null,null,null,null,null,null,null,null,null,null,null,null,null,null,null,null,null,null,null,null,null,null,null,null,null,null,null,null,null,null,null,"0",0]
[4483,null,null,null,0,0,null,null,null,null,"ISLAM","WNI",null,null,null,null,0,0,null,null,null,null,null,null,null,null,null,null,null,null,null,null,null,null,null,null,null,null,null,null,null,null,null,null,null,null,null,null,null,null,null,null,null,null,null,null,null,null,null,null,null,null,null,null,null,null,null,null,null,null,null,null,null,null,null,null,null,null,null,null,"0",0]
[4484,null,null,null,0,0,null,null,null,null,"ISLAM","WNI",null,null,null,null,0,0,null,null,null,null,null,null,null,null,null,null,null,null,null,null,null,null,null,null,null,null,null,null,null,null,null,null,null,null,null,null,null,null,null,null,null,null,null,null,null,null,null,null,null,null,null,null,null,null,null,null,null,null,null,null,null,null,null,null,null,null,null,null,"0",0]
[4485,null,null,null,0,0,null,null,null,null,"ISLAM","WNI",null,null,null,null,0,0,null,null,null,null,null,null,null,null,null,null,null,null,null,null,null,null,null,null,null,null,null,null,null,null,null,null,null,null,null,null,null,null,null,null,null,null,null,null,null,null,null,null,null,null,null,null,null,null,null,null,null,null,null,null,null,null,null,null,null,null,null,null,"0",0]
[4486,null,null,null,0,0,null,null,null,null,"ISLAM","WNI",null,null,null,null,0,0,null,null,null,null,null,null,null,null,null,null,null,null,null,null,null,null,null,null,null,null,null,null,null,null,null,null,null,null,null,null,null,null,null,null,null,null,null,null,null,null,null,null,null,null,null,null,null,null,null,null,null,null,null,null,null,null,null,null,null,null,null,null,"0",0]
[4487,null,null,null,0,0,null,null,null,null,"ISLAM","WNI",null,null,null,null,0,0,null,null,null,null,null,null,null,null,null,null,null,null,null,null,null,null,null,null,null,null,null,null,null,null,null,null,null,null,null,null,null,null,null,null,null,null,null,null,null,null,null,null,null,null,null,null,null,null,null,null,null,null,null,null,null,null,null,null,null,null,null,null,"0",0]
[4488,null,null,null,0,0,null,null,null,null,"ISLAM","WNI",null,null,null,null,0,0,null,null,null,null,null,null,null,null,null,null,null,null,null,null,null,null,null,null,null,null,null,null,null,null,null,null,null,null,null,null,null,null,null,null,null,null,null,null,null,null,null,null,null,null,null,null,null,null,null,null,null,null,null,null,null,null,null,null,null,null,null,null,"0",0]
[4489,null,null,null,0,0,null,null,null,null,"ISLAM","WNI",null,null,null,null,0,0,null,null,null,null,null,null,null,null,null,null,null,null,null,null,null,null,null,null,null,null,null,null,null,null,null,null,null,null,null,null,null,null,null,null,null,null,null,null,null,null,null,null,null,null,null,null,null,null,null,null,null,null,null,null,null,null,null,null,null,null,null,null,"0",0]
[4490,null,null,null,0,0,null,null,null,null,"ISLAM","WNI",null,null,null,null,{"$f":"AT495","v":0},{"$f":"AU495","v":0},null,null,null,null,null,null,null,null,null,null,null,null,null,null,null,null,null,null,null,null,null,null,null,null,null,null,null,null,null,null,null,null,null,null,null,null,null,null,null,null,null,null,null,null,null,null,null,null,null,null,null,null,null,null,null,null,null,null,null,null,null,null,"0",0]
[4491,null,null,null,0,0,null,null,null,null,"ISLAM","WNI",null,null,null,null,0,0,null,null,null,null,null,null,null,null,null,null,null,null,null,null,null,null,null,null,null,null,null,null,null,null,null,null,null,null,null,null,null,null,null,null,null,null,null,null,null,null,null,null,null,null,null,null,null,null,null,null,null,null,null,null,null,null,null,null,null,null,null,null,{"$f":"RIGHT(CD496,4)","v":"0"},{"$f":"PR496","v":0}]
[4492,null,null,null,0,0,null,null,null,null,"ISLAM","WNI",null,null,null,null,0,0,null,null,null,null,null,null,null,null,null,null,null,null,null,null,null,null,null,null,null,null,null,null,null,null,null,null,null,null,null,null,null,null,null,null,null,null,null,null,null,null,null,null,null,null,null,null,null,null,null,null,null,null,null,null,null,null,null,null,null,null,null,null,"0",0]
[4493,null,null,null,0,0,null,null,null,null,"ISLAM","WNI",null,null,null,null,0,0,null,null,null,null,null,null,null,null,null,null,null,null,null,null,null,null,null,null,null,null,null,null,null,null,null,null,null,null,null,null,null,null,null,null,null,null,null,null,null,null,null,null,null,null,null,null,null,null,null,null,null,null,null,null,null,null,null,null,null,null,null,null,"0",0]
[4494,null,null,null,0,0,null,null,null,null,"ISLAM","WNI",null,null,null,null,0,0,null,null,null,null,null,null,null,null,null,null,null,null,null,null,null,null,null,null,null,null,null,null,null,null,null,null,null,null,null,null,null,null,null,null,null,null,null,null,null,null,null,null,null,null,null,null,null,null,null,null,null,null,null,null,null,null,null,null,null,null,null,null,"0",0]
[4495,null,null,null,0,0,null,null,null,null,"ISLAM","WNI",null,null,null,null,0,0,null,null,null,null,null,null,null,null,null,null,null,null,null,null,null,null,null,null,null,null,null,null,null,null,null,null,null,null,null,null,null,null,null,null,null,null,null,null,null,null,null,null,null,null,null,null,null,null,null,null,null,null,null,null,null,null,null,null,null,null,null,null,"0",0]
[4496,null,null,null,0,0,null,null,null,null,"ISLAM","WNI",null,null,null,null,0,0,null,null,null,null,null,null,null,null,null,null,null,null,null,null,null,null,null,null,null,null,null,null,null,null,null,null,null,null,null,null,null,null,null,null,null,null,null,null,null,null,null,null,null,null,null,null,null,null,null,null,null,null,null,null,null,null,null,null,null,null,null,null,"0",0]
[4497,null,null,null,0,0,null,null,null,null,"ISLAM","WNI",null,null,null,null,0,0,null,null,null,null,null,null,null,null,null,null,null,null,null,null,null,null,null,null,null,null,null,null,null,null,null,null,null,null,null,null,null,null,null,null,null,null,null,null,null,null,null,null,null,null,null,null,null,null,null,null,null,null,null,null,null,null,null,null,null,null,null,null,"0",0]
[4498,null,null,null,0,0,null,null,null,null,"ISLAM","WNI",null,null,null,null,0,0,null,null,null,null,null,null,null,null,null,null,null,null,null,null,null,null,null,null,null,null,null,null,null,null,null,null,null,null,null,null,null,null,null,null,null,null,null,null,null,null,null,null,null,null,null,null,null,null,null,null,null,null,null,null,null,null,null,null,null,null,null,null,"0",0]
[4499,null,null,null,0,0,null,null,null,null,"ISLAM","WNI",null,null,null,null,0,0,null,null,null,null,null,null,null,null,null,null,null,null,null,null,null,null,null,null,null,null,null,null,null,null,null,null,null,null,null,null,null,null,null,null,null,null,null,null,null,null,null,null,null,null,null,null,null,null,null,null,null,null,null,null,null,null,null,null,null,null,null,null,"0",0]
[4500,null,null,null,0,0,null,null,null,null,"ISLAM","WNI",null,null,null,null,0,0,null,null,null,null,null,null,null,null,null,null,null,null,null,null,null,null,null,null,null,null,null,null,null,null,null,null,null,null,null,null,null,null,null,null,null,null,null,null,null,null,null,null,null,null,null,null,null,null,null,null,null,null,null,null,null,null,null,null,null,null,null,null,"0",0]
[4501,null,null,null,0,0,null,null,null,null,"ISLAM","WNI",null,null,null,null,0,0,null,null,null,null,null,null,null,null,null,null,null,null,null,null,null,null,null,null,null,null,null,null,null,null,null,null,null,null,null,null,null,null,null,null,null,null,null,null,null,null,null,null,null,null,null,null,null,null,null,null,null,null,null,null,null,null,null,null,null,null,null,null,"0",0]
[4502,null,null,null,0,0,null,null,null,null,"ISLAM","WNI",null,null,null,null,0,0,null,null,null,null,null,null,null,null,null,null,null,null,null,null,null,null,null,null,null,null,null,null,null,null,null,null,null,null,null,null,null,null,null,null,null,null,null,null,null,null,null,null,null,null,null,null,null,null,null,null,null,null,null,null,null,null,null,null,null,null,null,null,"0",0]
[4503,null,null,null,0,0,null,null,null,null,"ISLAM","WNI",null,null,null,null,0,0,null,null,null,null,null,null,null,null,null,null,null,null,null,null,null,null,null,null,null,null,null,null,null,null,null,null,null,null,null,null,null,null,null,null,null,null,null,null,null,null,null,null,null,null,null,null,null,null,null,null,null,null,null,null,null,null,null,null,null,null,null,null,"0",0]
[4504,null,null,null,0,0,null,null,null,null,"ISLAM","WNI",null,null,null,null,0,0,null,null,null,null,null,null,null,null,null,null,null,null,null,null,null,null,null,null,null,null,null,null,null,null,null,null,null,null,null,null,null,null,null,null,null,null,null,null,null,null,null,null,null,null,null,null,null,null,null,null,null,null,null,null,null,null,null,null,null,null,null,null,"0",0]
[4505,null,null,null,0,0,null,null,null,null,"ISLAM","WNI",null,null,null,null,0,0,null,null,null,null,null,null,null,null,null,null,null,null,null,null,null,null,null,null,null,null,null,null,null,null,null,null,null,null,null,null,null,null,null,null,null,null,null,null,null,null,null,null,null,null,null,null,null,null,null,null,null,null,null,null,null,null,null,null,null,null,null,null,"0",0]
[4506,null,null,null,0,0,null,null,null,null,"ISLAM","WNI",null,null,null,null,0,0,null,null,null,null,null,null,null,null,null,null,null,null,null,null,null,null,null,null,null,null,null,null,null,null,null,null,null,null,null,null,null,null,null,null,null,null,null,null,null,null,null,null,null,null,null,null,null,null,null,null,null,null,null,null,null,null,null,null,null,null,null,null,"0",0]
[4507,null,null,null,0,0,null,null,null,null,"ISLAM","WNI",null,null,null,null,0,0,null,null,null,null,null,null,null,null,null,null,null,null,null,null,null,null,null,null,null,null,null,null,null,null,null,null,null,null,null,null,null,null,null,null,null,null,null,null,null,null,null,null,null,null,null,null,null,null,null,null,null,null,null,null,null,null,null,null,null,null,null,null,"0",0]
[4508,null,null,null,0,0,null,null,null,null,"ISLAM","WNI",null,null,null,null,0,0,null,null,null,null,null,null,null,null,null,null,null,null,null,null,null,null,null,null,null,null,null,null,null,null,null,null,null,null,null,null,null,null,null,null,null,null,null,null,null,null,null,null,null,null,null,null,null,null,null,null,null,null,null,null,null,null,null,null,null,null,null,null,"0",0]
[4509,null,null,null,0,0,null,null,null,null,"ISLAM","WNI",null,null,null,null,0,0,null,null,null,null,null,null,null,null,null,null,null,null,null,null,null,null,null,null,null,null,null,null,null,null,null,null,null,null,null,null,null,null,null,null,null,null,null,null,null,null,null,null,null,null,null,null,null,null,null,null,null,null,null,null,null,null,null,null,null,null,null,null,"0",0]
[4510,null,null,null,0,0,null,null,null,null,"ISLAM","WNI",null,null,null,null,0,0,null,null,null,null,null,null,null,null,null,null,null,null,null,null,null,null,null,null,null,null,null,null,null,null,null,null,null,null,null,null,null,null,null,null,null,null,null,null,null,null,null,null,null,null,null,null,null,null,null,null,null,null,null,null,null,null,null,null,null,null,null,null,"0",0]
[4511,null,null,null,0,0,null,null,null,null,"ISLAM","WNI",null,null,null,null,0,0,null,null,null,null,null,null,null,null,null,null,null,null,null,null,null,null,null,null,null,null,null,null,null,null,null,null,null,null,null,null,null,null,null,null,null,null,null,null,null,null,null,null,null,null,null,null,null,null,null,null,null,null,null,null,null,null,null,null,null,null,null,null,"0",0]
[4512,null,null,null,0,0,null,null,null,null,"ISLAM","WNI",null,null,null,null,0,0,null,null,null,null,null,null,null,null,null,null,null,null,null,null,null,null,null,null,null,null,null,null,null,null,null,null,null,null,null,null,null,null,null,null,null,null,null,null,null,null,null,null,null,null,null,null,null,null,null,null,null,null,null,null,null,null,null,null,null,null,null,null,"0",0]
[4513,null,null,null,0,0,null,null,null,null,"ISLAM","WNI",null,null,null,null,0,0,null,null,null,null,null,null,null,null,null,null,null,null,null,null,null,null,null,null,null,null,null,null,null,null,null,null,null,null,null,null,null,null,null,null,null,null,null,null,null,null,null,null,null,null,null,null,null,null,null,null,null,null,null,null,null,null,null,null,null,null,null,null,"0",0]
[4514,null,null,null,0,0,null,null,null,null,"ISLAM","WNI",null,null,null,null,0,0,null,null,null,null,null,null,null,null,null,null,null,null,null,null,null,null,null,null,null,null,null,null,null,null,null,null,null,null,null,null,null,null,null,null,null,null,null,null,null,null,null,null,null,null,null,null,null,null,null,null,null,null,null,null,null,null,null,null,null,null,null,null,"0",0]
[4515,null,null,null,{"$f":"AQ520","v":0},{"$f":"QG520","v":0},null,null,null,null,"ISLAM","WNI",null,null,null,null,0,0,null,null,null,null,null,null,null,null,null,null,null,null,null,null,null,null,null,null,null,null,null,null,null,null,null,null,null,null,null,null,null,null,null,null,null,null,null,null,null,null,null,null,null,null,null,null,null,null,null,null,null,null,null,null,null,null,null,null,null,null,null,null,"0",0]
[4516,null,null,null,0,0,null,null,null,null,"ISLAM","WNI",null,null,null,null,0,0,null,null,null,null,null,null,null,null,null,null,null,null,null,null,null,null,null,null,null,null,null,null,null,null,null,null,null,null,null,null,null,null,null,null,null,null,null,null,null,null,null,null,null,null,null,null,null,null,null,null,null,null,null,null,null,null,null,null,null,null,null,null,"0",0]
[4517,null,null,null,0,0,null,null,null,null,"ISLAM","WNI",null,null,null,null,0,0,null,null,null,null,null,null,null,null,null,null,null,null,null,null,null,null,null,null,null,null,null,null,null,null,null,null,null,null,null,null,null,null,null,null,null,null,null,null,null,null,null,null,null,null,null,null,null,null,null,null,null,null,null,null,null,null,null,null,null,null,null,null,"0",0]
[4518,null,null,null,0,0,null,null,null,null,"ISLAM","WNI",null,null,null,null,0,0,null,null,null,null,null,null,null,null,null,null,null,null,null,null,null,null,null,null,null,null,null,null,null,null,null,null,null,null,null,null,null,null,null,null,null,null,null,null,null,null,null,null,null,null,null,null,null,null,null,null,null,null,null,null,null,null,null,null,null,null,null,null,"0",0]
[4519,null,null,null,0,0,null,null,null,null,"ISLAM","WNI",null,null,null,null,0,0,null,null,null,null,null,null,null,null,null,null,null,null,null,null,null,null,null,null,null,null,null,null,null,null,null,null,null,null,null,null,null,null,null,null,null,null,null,null,null,null,null,null,null,null,null,null,null,null,null,null,null,null,null,null,null,null,null,null,null,null,null,null,"0",0]
[4520,null,null,null,0,0,null,null,null,null,"ISLAM","WNI",null,null,null,null,0,0,null,null,null,null,null,null,null,null,null,null,null,null,null,null,null,null,null,null,null,null,null,null,null,null,null,null,null,null,null,null,null,null,null,null,null,null,null,null,null,null,null,null,null,null,null,null,null,null,null,null,null,null,null,null,null,null,null,null,null,null,null,null,"0",0]
[4521,null,null,null,0,0,null,null,null,null,"ISLAM","WNI",null,null,null,null,0,0,null,null,null,null,null,null,null,null,null,null,null,null,null,null,null,null,null,null,null,null,null,null,null,null,null,null,null,null,null,null,null,null,null,null,null,null,null,null,null,null,null,null,null,null,null,null,null,null,null,null,null,null,null,null,null,null,null,null,null,null,null,null,"0",0]
[4522,null,null,null,0,0,null,null,null,null,"ISLAM","WNI",null,null,null,null,0,0,null,null,null,null,null,null,null,null,null,null,null,null,null,null,null,null,null,null,null,null,null,null,null,null,null,null,null,null,null,null,null,null,null,null,null,null,null,null,null,null,null,null,null,null,null,null,null,null,null,null,null,null,null,null,null,null,null,null,null,null,null,null,"0",0]
[4523,null,null,null,0,0,null,null,null,null,"ISLAM","WNI",null,null,null,null,0,0,null,null,null,null,null,null,null,null,null,null,null,null,null,null,null,null,null,null,null,null,null,null,null,null,null,null,null,null,null,null,null,null,null,null,null,null,null,null,null,null,null,null,null,null,null,null,null,null,null,null,null,null,null,null,null,null,null,null,null,null,null,null,"0",0]
[4524,null,null,null,0,0,null,null,null,null,"ISLAM","WNI",null,null,null,null,0,0,null,null,null,null,null,null,null,null,null,null,null,null,null,null,null,null,null,null,null,null,null,null,null,null,null,null,null,null,null,null,null,null,null,null,null,null,null,null,null,null,null,null,null,null,null,null,null,null,null,null,null,null,null,null,null,null,null,null,null,null,null,null,"0",0]
[4525,null,null,null,0,0,null,null,null,null,"ISLAM","WNI",null,null,null,null,0,0,null,null,null,null,null,null,null,null,null,null,null,null,null,null,null,null,null,null,null,null,null,null,null,null,null,null,null,null,null,null,null,null,null,null,null,null,null,null,null,null,null,null,null,null,null,null,null,null,null,null,null,null,null,null,null,null,null,null,null,null,null,null,"0",0]
[4526,null,null,null,0,0,null,null,null,null,"ISLAM","WNI",null,null,null,null,0,0,null,null,null,null,null,null,null,null,null,null,null,null,null,null,null,null,null,null,null,null,null,null,null,null,null,null,null,null,null,null,null,null,null,null,null,null,null,null,null,null,null,null,null,null,null,null,null,null,null,null,null,null,null,null,null,null,null,null,null,null,null,null,"0",0]
[4527,null,null,null,0,0,null,null,null,null,"ISLAM","WNI",null,null,null,null,0,0,null,null,null,null,null,null,null,null,null,null,null,null,null,null,null,null,null,null,null,null,null,null,null,null,null,null,null,null,null,null,null,null,null,null,null,null,null,null,null,null,null,null,null,null,null,null,null,null,null,null,null,null,null,null,null,null,null,null,null,null,null,null,"0",0]
[4528,null,null,null,0,0,null,null,null,null,"ISLAM","WNI",null,null,null,null,0,0,null,null,null,null,null,null,null,null,null,null,null,null,null,null,null,null,null,null,null,null,null,null,null,null,null,null,null,null,null,null,null,null,null,null,null,null,null,null,null,null,null,null,null,null,null,null,null,null,null,null,null,null,null,null,null,null,null,null,null,null,null,null,"0",0]
[4529,null,null,null,0,0,null,null,null,null,"ISLAM","WNI",null,null,null,null,0,0,null,null,null,null,null,null,null,null,null,null,null,null,null,null,null,null,null,null,null,null,null,null,null,null,null,null,null,null,null,null,null,null,null,null,null,null,null,null,null,null,null,null,null,null,null,null,null,null,null,null,null,null,null,null,null,null,null,null,null,null,null,null,"0",0]
[4530,null,null,null,0,0,null,null,null,null,"ISLAM","WNI",null,null,null,null,0,0,null,null,null,null,null,null,null,null,null,null,null,null,null,null,null,null,null,null,null,null,null,null,null,null,null,null,null,null,null,null,null,null,null,null,null,null,null,null,null,null,null,null,null,null,null,null,null,null,null,null,null,null,null,null,null,null,null,null,null,null,null,null,"0",0]
[4531,null,null,null,0,0,null,null,null,null,"ISLAM","WNI",null,null,null,null,0,0,null,null,null,null,null,null,null,null,null,null,null,null,null,null,null,null,null,null,null,null,null,null,null,null,null,null,null,null,null,null,null,null,null,null,null,null,null,null,null,null,null,null,null,null,null,null,null,null,null,null,null,null,null,null,null,null,null,null,null,null,null,null,"0",0]
[4532,null,null,null,0,0,null,null,null,null,"ISLAM","WNI",null,null,null,null,0,0,null,null,null,null,null,null,null,null,null,null,null,null,null,null,null,null,null,null,null,null,null,null,null,null,null,null,null,null,null,null,null,null,null,null,null,null,null,null,null,null,null,null,null,null,null,null,null,null,null,null,null,null,null,null,null,null,null,null,null,null,null,null,"0",0]
[4533,null,null,null,0,0,null,null,null,null,"ISLAM","WNI",null,null,null,null,0,0,null,null,null,null,null,null,null,null,null,null,null,null,null,null,null,null,null,null,null,null,null,null,null,null,null,null,null,null,null,null,null,null,null,null,null,null,null,null,null,null,null,null,null,null,null,null,null,null,null,null,null,null,null,null,null,null,null,null,null,null,null,null,"0",0]
[4534,null,null,null,0,0,null,null,null,null,"ISLAM","WNI",null,null,null,null,0,0,null,null,null,null,null,null,null,null,null,null,null,null,null,null,null,null,null,null,null,null,null,null,null,null,null,null,null,null,null,null,null,null,null,null,null,null,null,null,null,null,null,null,null,null,null,null,null,null,null,null,null,null,null,null,null,null,null,null,null,null,null,null,"0",0]
[4535,null,null,null,0,0,null,null,null,null,"ISLAM","WNI",null,null,null,null,0,0,null,null,null,null,null,null,null,null,null,null,null,null,null,null,null,null,null,null,null,null,null,null,null,null,null,null,null,null,null,null,null,null,null,null,null,null,null,null,null,null,null,null,null,null,null,null,null,null,null,null,null,null,null,null,null,null,null,null,null,null,null,null,"0",0]
[4536,null,null,null,0,0,null,null,null,null,"ISLAM","WNI",null,null,null,null,0,0,null,null,null,null,null,null,null,null,null,null,null,null,null,null,null,null,null,null,null,null,null,null,null,null,null,null,null,null,null,null,null,null,null,null,null,null,null,null,null,null,null,null,null,null,null,null,null,null,null,null,null,null,null,null,null,null,null,null,null,null,null,null,"0",0]
[4537,null,null,null,0,0,null,null,null,null,"ISLAM","WNI",null,null,null,null,0,0,null,null,null,null,null,null,null,null,null,null,null,null,null,null,null,null,null,null,null,null,null,null,null,null,null,null,null,null,null,null,null,null,null,null,null,null,null,null,null,null,null,null,null,null,null,null,null,null,null,null,null,null,null,null,null,null,null,null,null,null,null,null,"0",0]
[4538,null,null,null,0,0,null,null,null,null,"ISLAM","WNI",null,null,null,null,0,0,null,null,null,null,null,null,null,null,null,null,null,null,null,null,null,null,null,null,null,null,null,null,null,null,null,null,null,null,null,null,null,null,null,null,null,null,null,null,null,null,null,null,null,null,null,null,null,null,null,null,null,null,null,null,null,null,null,null,null,null,null,null,"0",0]
[4539,null,null,null,0,0,null,null,null,null,"ISLAM","WNI",null,null,null,null,0,0,null,null,null,null,null,null,null,null,null,null,null,null,null,null,null,null,null,null,null,null,null,null,null,null,null,null,null,null,null,null,null,null,null,null,null,null,null,null,null,null,null,null,null,null,null,null,null,null,null,null,null,null,null,null,null,null,null,null,null,null,null,null,"0",0]
[4540,null,null,null,0,0,null,null,null,null,"ISLAM","WNI",null,null,null,null,0,0,null,null,null,null,null,null,null,null,null,null,null,null,null,null,null,null,null,null,null,null,null,null,null,null,null,null,null,null,null,null,null,null,null,null,null,null,null,null,null,null,null,null,null,null,null,null,null,null,null,null,null,null,null,null,null,null,null,null,null,null,null,null,"0",0]
[4541,null,null,null,0,0,null,null,null,null,"ISLAM","WNI",null,null,null,null,0,0,null,null,null,null,null,null,null,null,null,null,null,null,null,null,null,null,null,null,null,null,null,null,null,null,null,null,null,null,null,null,null,null,null,null,null,null,null,null,null,null,null,null,null,null,null,null,null,null,null,null,null,null,null,null,null,null,null,null,null,null,null,null,"0",0]
[4542,null,null,null,0,0,null,null,null,null,"ISLAM","WNI",null,null,null,null,0,0,null,null,null,null,null,null,null,null,null,null,null,null,null,null,null,null,null,null,null,null,null,null,null,null,null,null,null,null,null,null,null,null,null,null,null,null,null,null,null,null,null,null,null,null,null,null,null,null,null,null,null,null,null,null,null,null,null,null,null,null,null,null,"0",0]
[4543,null,null,null,0,0,null,null,null,null,"ISLAM","WNI",null,null,null,null,0,0,null,null,null,null,null,null,null,null,null,null,null,null,null,null,null,null,null,null,null,null,null,null,null,null,null,null,null,null,null,null,null,null,null,null,null,null,null,null,null,null,null,null,null,null,null,null,null,null,null,null,null,null,null,null,null,null,null,null,null,null,null,null,"0",0]
[4544,null,null,null,0,0,null,null,null,null,"ISLAM","WNI",null,null,null,null,0,0,null,null,null,null,null,null,null,null,null,null,null,null,null,null,null,null,null,null,null,null,null,null,null,null,null,null,null,null,null,null,null,null,null,null,null,null,null,null,null,null,null,null,null,null,null,null,null,null,null,null,null,null,null,null,null,null,null,null,null,null,null,null,"0",0]
[4545,null,null,null,0,0,null,null,null,null,"ISLAM","WNI",null,null,null,null,0,0,null,null,null,null,null,null,null,null,null,null,null,null,null,null,null,null,null,null,null,null,null,null,null,null,null,null,null,null,null,null,null,null,null,null,null,null,null,null,null,null,null,null,null,null,null,null,null,null,null,null,null,null,null,null,null,null,null,null,null,null,null,null,"0",0]
[4546,null,null,null,0,0,null,null,null,null,"ISLAM","WNI",null,null,null,null,0,0,null,null,null,null,null,null,null,null,null,null,null,null,null,null,null,null,null,null,null,null,null,null,null,null,null,null,null,null,null,null,null,null,null,null,null,null,null,null,null,null,null,null,null,null,null,null,null,null,null,null,null,null,null,null,null,null,null,null,null,null,null,null,"0",0]
[4547,null,null,null,0,0,null,null,null,null,"ISLAM","WNI",null,null,null,null,0,0,null,null,null,null,null,null,null,null,null,null,null,null,null,null,null,null,null,null,null,null,null,null,null,null,null,null,null,null,null,null,null,null,null,null,null,null,null,null,null,null,null,null,null,null,null,null,null,null,null,null,null,null,null,null,null,null,null,null,null,null,null,null,"0",0]
[4548,null,null,null,0,0,null,null,null,null,"ISLAM","WNI",null,null,null,null,0,0,null,null,null,null,null,null,null,null,null,null,null,null,null,null,null,null,null,null,null,null,null,null,null,null,null,null,null,null,null,null,null,null,null,null,null,null,null,null,null,null,null,null,null,null,null,null,null,null,null,null,null,null,null,null,null,null,null,null,null,null,null,null,"0",0]
[4549,null,null,null,0,0,null,null,null,null,"ISLAM","WNI",null,null,null,null,0,0,null,null,null,null,null,null,null,null,null,null,null,null,null,null,null,null,null,null,null,null,null,null,null,null,null,null,null,null,null,null,null,null,null,null,null,null,null,null,null,null,null,null,null,null,null,null,null,null,null,null,null,null,null,null,null,null,null,null,null,null,null,null,"0",0]
[4550,null,null,null,0,0,null,null,null,null,"ISLAM","WNI",null,null,null,null,0,0,null,null,null,null,null,null,null,null,null,null,null,null,null,null,null,null,null,null,null,null,null,null,null,null,null,null,null,null,null,null,null,null,null,null,null,null,null,null,null,null,null,null,null,null,null,null,null,null,null,null,null,null,null,null,null,null,null,null,null,null,null,null,"0",0]
[4551,null,null,null,0,0,null,null,null,null,"ISLAM","WNI",null,null,null,null,0,0,null,null,null,null,null,null,null,null,null,null,null,null,null,null,null,null,null,null,null,null,null,null,null,null,null,null,null,null,null,null,null,null,null,null,null,null,null,null,null,null,null,null,null,null,null,null,null,null,null,null,null,null,null,null,null,null,null,null,null,null,null,null,"0",0]
[4552,null,null,null,0,0,null,null,null,null,"ISLAM","WNI",null,null,null,null,0,0,null,null,null,null,null,null,null,null,null,null,null,null,null,null,null,null,null,null,null,null,null,null,null,null,null,null,null,null,null,null,null,null,null,null,null,null,null,null,null,null,null,null,null,null,null,null,null,null,null,null,null,null,null,null,null,null,null,null,null,null,null,null,"0",0]
[4553,null,null,null,0,0,null,null,null,null,"ISLAM","WNI",null,null,null,null,0,0,null,null,null,null,null,null,null,null,null,null,null,null,null,null,null,null,null,null,null,null,null,null,null,null,null,null,null,null,null,null,null,null,null,null,null,null,null,null,null,null,null,null,null,null,null,null,null,null,null,null,null,null,null,null,null,null,null,null,null,null,null,null,"0",0]
[4554,null,null,null,0,0,null,null,null,null,"ISLAM","WNI",null,null,null,null,{"$f":"AT559","v":0},{"$f":"AU559","v":0},null,null,null,null,null,null,null,null,null,null,null,null,null,null,null,null,null,null,null,null,null,null,null,null,null,null,null,null,null,null,null,null,null,null,null,null,null,null,null,null,null,null,null,null,null,null,null,null,null,null,null,null,null,null,null,null,null,null,null,null,null,null,"0",0]
[4555,null,null,null,0,0,null,null,null,null,"ISLAM","WNI",null,null,null,null,0,0,null,null,null,null,null,null,null,null,null,null,null,null,null,null,null,null,null,null,null,null,null,null,null,null,null,null,null,null,null,null,null,null,null,null,null,null,null,null,null,null,null,null,null,null,null,null,null,null,null,null,null,null,null,null,null,null,null,null,null,null,null,null,{"$f":"RIGHT(CD560,4)","v":"0"},{"$f":"PR560","v":0}]
[4556,null,null,null,0,0,null,null,null,null,"ISLAM","WNI",null,null,null,null,0,0,null,null,null,null,null,null,null,null,null,null,null,null,null,null,null,null,null,null,null,null,null,null,null,null,null,null,null,null,null,null,null,null,null,null,null,null,null,null,null,null,null,null,null,null,null,null,null,null,null,null,null,null,null,null,null,null,null,null,null,null,null,null,"0",0]
[4557,null,null,null,0,0,null,null,null,null,"ISLAM","WNI",null,null,null,null,0,0,null,null,null,null,null,null,null,null,null,null,null,null,null,null,null,null,null,null,null,null,null,null,null,null,null,null,null,null,null,null,null,null,null,null,null,null,null,null,null,null,null,null,null,null,null,null,null,null,null,null,null,null,null,null,null,null,null,null,null,null,null,null,"0",0]
[4558,null,null,null,0,0,null,null,null,null,"ISLAM","WNI",null,null,null,null,0,0,null,null,null,null,null,null,null,null,null,null,null,null,null,null,null,null,null,null,null,null,null,null,null,null,null,null,null,null,null,null,null,null,null,null,null,null,null,null,null,null,null,null,null,null,null,null,null,null,null,null,null,null,null,null,null,null,null,null,null,null,null,null,"0",0]
[4559,null,null,null,0,0,null,null,null,null,"ISLAM","WNI",null,null,null,null,0,0,null,null,null,null,null,null,null,null,null,null,null,null,null,null,null,null,null,null,null,null,null,null,null,null,null,null,null,null,null,null,null,null,null,null,null,null,null,null,null,null,null,null,null,null,null,null,null,null,null,null,null,null,null,null,null,null,null,null,null,null,null,null,"0",0]
[4560,null,null,null,0,0,null,null,null,null,"ISLAM","WNI",null,null,null,null,0,0,null,null,null,null,null,null,null,null,null,null,null,null,null,null,null,null,null,null,null,null,null,null,null,null,null,null,null,null,null,null,null,null,null,null,null,null,null,null,null,null,null,null,null,null,null,null,null,null,null,null,null,null,null,null,null,null,null,null,null,null,null,null,"0",0]
[4561,null,null,null,0,0,null,null,null,null,"ISLAM","WNI",null,null,null,null,0,0,null,null,null,null,null,null,null,null,null,null,null,null,null,null,null,null,null,null,null,null,null,null,null,null,null,null,null,null,null,null,null,null,null,null,null,null,null,null,null,null,null,null,null,null,null,null,null,null,null,null,null,null,null,null,null,null,null,null,null,null,null,null,"0",0]
[4562,null,null,null,0,0,null,null,null,null,"ISLAM","WNI",null,null,null,null,0,0,null,null,null,null,null,null,null,null,null,null,null,null,null,null,null,null,null,null,null,null,null,null,null,null,null,null,null,null,null,null,null,null,null,null,null,null,null,null,null,null,null,null,null,null,null,null,null,null,null,null,null,null,null,null,null,null,null,null,null,null,null,null,"0",0]
[4563,null,null,null,0,0,null,null,null,null,"ISLAM","WNI",null,null,null,null,0,0,null,null,null,null,null,null,null,null,null,null,null,null,null,null,null,null,null,null,null,null,null,null,null,null,null,null,null,null,null,null,null,null,null,null,null,null,null,null,null,null,null,null,null,null,null,null,null,null,null,null,null,null,null,null,null,null,null,null,null,null,null,null,"0",0]
[4564,null,null,null,0,0,null,null,null,null,"ISLAM","WNI",null,null,null,null,0,0,null,null,null,null,null,null,null,null,null,null,null,null,null,null,null,null,null,null,null,null,null,null,null,null,null,null,null,null,null,null,null,null,null,null,null,null,null,null,null,null,null,null,null,null,null,null,null,null,null,null,null,null,null,null,null,null,null,null,null,null,null,null,"0",0]
[4565,null,null,null,0,0,null,null,null,null,"ISLAM","WNI",null,null,null,null,0,0,null,null,null,null,null,null,null,null,null,null,null,null,null,null,null,null,null,null,null,null,null,null,null,null,null,null,null,null,null,null,null,null,null,null,null,null,null,null,null,null,null,null,null,null,null,null,null,null,null,null,null,null,null,null,null,null,null,null,null,null,null,null,"0",0]
[4566,null,null,null,0,0,null,null,null,null,"ISLAM","WNI",null,null,null,null,0,0,null,null,null,null,null,null,null,null,null,null,null,null,null,null,null,null,null,null,null,null,null,null,null,null,null,null,null,null,null,null,null,null,null,null,null,null,null,null,null,null,null,null,null,null,null,null,null,null,null,null,null,null,null,null,null,null,null,null,null,null,null,null,"0",0]
[4567,null,null,null,0,0,null,null,null,null,"ISLAM","WNI",null,null,null,null,0,0,null,null,null,null,null,null,null,null,null,null,null,null,null,null,null,null,null,null,null,null,null,null,null,null,null,null,null,null,null,null,null,null,null,null,null,null,null,null,null,null,null,null,null,null,null,null,null,null,null,null,null,null,null,null,null,null,null,null,null,null,null,null,"0",0]
[4568,null,null,null,0,0,null,null,null,null,"ISLAM","WNI",null,null,null,null,0,0,null,null,null,null,null,null,null,null,null,null,null,null,null,null,null,null,null,null,null,null,null,null,null,null,null,null,null,null,null,null,null,null,null,null,null,null,null,null,null,null,null,null,null,null,null,null,null,null,null,null,null,null,null,null,null,null,null,null,null,null,null,null,"0",0]
[4569,null,null,null,0,0,null,null,null,null,"ISLAM","WNI",null,null,null,null,0,0,null,null,null,null,null,null,null,null,null,null,null,null,null,null,null,null,null,null,null,null,null,null,null,null,null,null,null,null,null,null,null,null,null,null,null,null,null,null,null,null,null,null,null,null,null,null,null,null,null,null,null,null,null,null,null,null,null,null,null,null,null,null,"0",0]
[4570,null,null,null,0,0,null,null,null,null,"ISLAM","WNI",null,null,null,null,0,0,null,null,null,null,null,null,null,null,null,null,null,null,null,null,null,null,null,null,null,null,null,null,null,null,null,null,null,null,null,null,null,null,null,null,null,null,null,null,null,null,null,null,null,null,null,null,null,null,null,null,null,null,null,null,null,null,null,null,null,null,null,null,"0",0]
[4571,null,null,null,0,0,null,null,null,null,"ISLAM","WNI",null,null,null,null,0,0,null,null,null,null,null,null,null,null,null,null,null,null,null,null,null,null,null,null,null,null,null,null,null,null,null,null,null,null,null,null,null,null,null,null,null,null,null,null,null,null,null,null,null,null,null,null,null,null,null,null,null,null,null,null,null,null,null,null,null,null,null,null,"0",0]
[4572,null,null,null,0,0,null,null,null,null,"ISLAM","WNI",null,null,null,null,0,0,null,null,null,null,null,null,null,null,null,null,null,null,null,null,null,null,null,null,null,null,null,null,null,null,null,null,null,null,null,null,null,null,null,null,null,null,null,null,null,null,null,null,null,null,null,null,null,null,null,null,null,null,null,null,null,null,null,null,null,null,null,null,"0",0]
[4573,null,null,null,0,0,null,null,null,null,"ISLAM","WNI",null,null,null,null,0,0,null,null,null,null,null,null,null,null,null,null,null,null,null,null,null,null,null,null,null,null,null,null,null,null,null,null,null,null,null,null,null,null,null,null,null,null,null,null,null,null,null,null,null,null,null,null,null,null,null,null,null,null,null,null,null,null,null,null,null,null,null,null,"0",0]
[4574,null,null,null,0,0,null,null,null,null,"ISLAM","WNI",null,null,null,null,0,0,null,null,null,null,null,null,null,null,null,null,null,null,null,null,null,null,null,null,null,null,null,null,null,null,null,null,null,null,null,null,null,null,null,null,null,null,null,null,null,null,null,null,null,null,null,null,null,null,null,null,null,null,null,null,null,null,null,null,null,null,null,null,"0",0]
[4575,null,null,null,0,0,null,null,null,null,"ISLAM","WNI",null,null,null,null,0,0,null,null,null,null,null,null,null,null,null,null,null,null,null,null,null,null,null,null,null,null,null,null,null,null,null,null,null,null,null,null,null,null,null,null,null,null,null,null,null,null,null,null,null,null,null,null,null,null,null,null,null,null,null,null,null,null,null,null,null,null,null,null,"0",0]
[4576,null,null,null,0,0,null,null,null,null,"ISLAM","WNI",null,null,null,null,0,0,null,null,null,null,null,null,null,null,null,null,null,null,null,null,null,null,null,null,null,null,null,null,null,null,null,null,null,null,null,null,null,null,null,null,null,null,null,null,null,null,null,null,null,null,null,null,null,null,null,null,null,null,null,null,null,null,null,null,null,null,null,null,"0",0]
[4577,null,null,null,0,0,null,null,null,null,"ISLAM","WNI",null,null,null,null,0,0,null,null,null,null,null,null,null,null,null,null,null,null,null,null,null,null,null,null,null,null,null,null,null,null,null,null,null,null,null,null,null,null,null,null,null,null,null,null,null,null,null,null,null,null,null,null,null,null,null,null,null,null,null,null,null,null,null,null,null,null,null,null,"0",0]
[4578,null,null,null,0,0,null,null,null,null,"ISLAM","WNI",null,null,null,null,0,0,null,null,null,null,null,null,null,null,null,null,null,null,null,null,null,null,null,null,null,null,null,null,null,null,null,null,null,null,null,null,null,null,null,null,null,null,null,null,null,null,null,null,null,null,null,null,null,null,null,null,null,null,null,null,null,null,null,null,null,null,null,null,"0",0]
[4579,null,null,null,{"$f":"AQ584","v":0},{"$f":"QG584","v":0},null,null,null,null,"ISLAM","WNI",null,null,null,null,0,0,null,null,null,null,null,null,null,null,null,null,null,null,null,null,null,null,null,null,null,null,null,null,null,null,null,null,null,null,null,null,null,null,null,null,null,null,null,null,null,null,null,null,null,null,null,null,null,null,null,null,null,null,null,null,null,null,null,null,null,null,null,null,"0",0]
[4580,null,null,null,0,0,null,null,null,null,"ISLAM","WNI",null,null,null,null,0,0,null,null,null,null,null,null,null,null,null,null,null,null,null,null,null,null,null,null,null,null,null,null,null,null,null,null,null,null,null,null,null,null,null,null,null,null,null,null,null,null,null,null,null,null,null,null,null,null,null,null,null,null,null,null,null,null,null,null,null,null,null,null,"0",0]
[4581,null,null,null,0,0,null,null,null,null,"ISLAM","WNI",null,null,null,null,0,0,null,null,null,null,null,null,null,null,null,null,null,null,null,null,null,null,null,null,null,null,null,null,null,null,null,null,null,null,null,null,null,null,null,null,null,null,null,null,null,null,null,null,null,null,null,null,null,null,null,null,null,null,null,null,null,null,null,null,null,null,null,null,"0",0]
[4582,null,null,null,0,0,null,null,null,null,"ISLAM","WNI",null,null,null,null,0,0,null,null,null,null,null,null,null,null,null,null,null,null,null,null,null,null,null,null,null,null,null,null,null,null,null,null,null,null,null,null,null,null,null,null,null,null,null,null,null,null,null,null,null,null,null,null,null,null,null,null,null,null,null,null,null,null,null,null,null,null,null,null,"0",0]
[4583,null,null,null,0,0,null,null,null,null,"ISLAM","WNI",null,null,null,null,0,0,null,null,null,null,null,null,null,null,null,null,null,null,null,null,null,null,null,null,null,null,null,null,null,null,null,null,null,null,null,null,null,null,null,null,null,null,null,null,null,null,null,null,null,null,null,null,null,null,null,null,null,null,null,null,null,null,null,null,null,null,null,null,"0",0]
[4584,null,null,null,0,0,null,null,null,null,"ISLAM","WNI",null,null,null,null,0,0,null,null,null,null,null,null,null,null,null,null,null,null,null,null,null,null,null,null,null,null,null,null,null,null,null,null,null,null,null,null,null,null,null,null,null,null,null,null,null,null,null,null,null,null,null,null,null,null,null,null,null,null,null,null,null,null,null,null,null,null,null,null,"0",0]
[4585,null,null,null,0,0,null,null,null,null,"ISLAM","WNI",null,null,null,null,0,0,null,null,null,null,null,null,null,null,null,null,null,null,null,null,null,null,null,null,null,null,null,null,null,null,null,null,null,null,null,null,null,null,null,null,null,null,null,null,null,null,null,null,null,null,null,null,null,null,null,null,null,null,null,null,null,null,null,null,null,null,null,null,"0",0]
[4586,null,null,null,0,0,null,null,null,null,"ISLAM","WNI",null,null,null,null,0,0,null,null,null,null,null,null,null,null,null,null,null,null,null,null,null,null,null,null,null,null,null,null,null,null,null,null,null,null,null,null,null,null,null,null,null,null,null,null,null,null,null,null,null,null,null,null,null,null,null,null,null,null,null,null,null,null,null,null,null,null,null,null,"0",0]
[4587,null,null,null,0,0,null,null,null,null,"ISLAM","WNI",null,null,null,null,0,0,null,null,null,null,null,null,null,null,null,null,null,null,null,null,null,null,null,null,null,null,null,null,null,null,null,null,null,null,null,null,null,null,null,null,null,null,null,null,null,null,null,null,null,null,null,null,null,null,null,null,null,null,null,null,null,null,null,null,null,null,null,null,"0",0]
[4588,null,null,null,0,0,null,null,null,null,"ISLAM","WNI",null,null,null,null,0,0,null,null,null,null,null,null,null,null,null,null,null,null,null,null,null,null,null,null,null,null,null,null,null,null,null,null,null,null,null,null,null,null,null,null,null,null,null,null,null,null,null,null,null,null,null,null,null,null,null,null,null,null,null,null,null,null,null,null,null,null,null,null,"0",0]
[4589,null,null,null,0,0,null,null,null,null,"ISLAM","WNI",null,null,null,null,0,0,null,null,null,null,null,null,null,null,null,null,null,null,null,null,null,null,null,null,null,null,null,null,null,null,null,null,null,null,null,null,null,null,null,null,null,null,null,null,null,null,null,null,null,null,null,null,null,null,null,null,null,null,null,null,null,null,null,null,null,null,null,null,"0",0]
[4590,null,null,null,0,0,null,null,null,null,"ISLAM","WNI",null,null,null,null,0,0,null,null,null,null,null,null,null,null,null,null,null,null,null,null,null,null,null,null,null,null,null,null,null,null,null,null,null,null,null,null,null,null,null,null,null,null,null,null,null,null,null,null,null,null,null,null,null,null,null,null,null,null,null,null,null,null,null,null,null,null,null,null,"0",0]
[4591,null,null,null,0,0,null,null,null,null,"ISLAM","WNI",null,null,null,null,0,0,null,null,null,null,null,null,null,null,null,null,null,null,null,null,null,null,null,null,null,null,null,null,null,null,null,null,null,null,null,null,null,null,null,null,null,null,null,null,null,null,null,null,null,null,null,null,null,null,null,null,null,null,null,null,null,null,null,null,null,null,null,null,"0",0]
[4592,null,null,null,0,0,null,null,null,null,"ISLAM","WNI",null,null,null,null,0,0,null,null,null,null,null,null,null,null,null,null,null,null,null,null,null,null,null,null,null,null,null,null,null,null,null,null,null,null,null,null,null,null,null,null,null,null,null,null,null,null,null,null,null,null,null,null,null,null,null,null,null,null,null,null,null,null,null,null,null,null,null,null,"0",0]
[4593,null,null,null,0,0,null,null,null,null,"ISLAM","WNI",null,null,null,null,0,0,null,null,null,null,null,null,null,null,null,null,null,null,null,null,null,null,null,null,null,null,null,null,null,null,null,null,null,null,null,null,null,null,null,null,null,null,null,null,null,null,null,null,null,null,null,null,null,null,null,null,null,null,null,null,null,null,null,null,null,null,null,null,"0",0]
[4594,null,null,null,0,0,null,null,null,null,"ISLAM","WNI",null,null,null,null,0,0,null,null,null,null,null,null,null,null,null,null,null,null,null,null,null,null,null,null,null,null,null,null,null,null,null,null,null,null,null,null,null,null,null,null,null,null,null,null,null,null,null,null,null,null,null,null,null,null,null,null,null,null,null,null,null,null,null,null,null,null,null,null,"0",0]
[4595,null,null,null,0,0,null,null,null,null,"ISLAM","WNI",null,null,null,null,0,0,null,null,null,null,null,null,null,null,null,null,null,null,null,null,null,null,null,null,null,null,null,null,null,null,null,null,null,null,null,null,null,null,null,null,null,null,null,null,null,null,null,null,null,null,null,null,null,null,null,null,null,null,null,null,null,null,null,null,null,null,null,null,"0",0]
[4596,null,null,null,0,0,null,null,null,null,"ISLAM","WNI",null,null,null,null,0,0,null,null,null,null,null,null,null,null,null,null,null,null,null,null,null,null,null,null,null,null,null,null,null,null,null,null,null,null,null,null,null,null,null,null,null,null,null,null,null,null,null,null,null,null,null,null,null,null,null,null,null,null,null,null,null,null,null,null,null,null,null,null,"0",0]
[4597,null,null,null,0,0,null,null,null,null,"ISLAM","WNI",null,null,null,null,0,0,null,null,null,null,null,null,null,null,null,null,null,null,null,null,null,null,null,null,null,null,null,null,null,null,null,null,null,null,null,null,null,null,null,null,null,null,null,null,null,null,null,null,null,null,null,null,null,null,null,null,null,null,null,null,null,null,null,null,null,null,null,null,"0",0]
[4598,null,null,null,0,0,null,null,null,null,"ISLAM","WNI",null,null,null,null,0,0,null,null,null,null,null,null,null,null,null,null,null,null,null,null,null,null,null,null,null,null,null,null,null,null,null,null,null,null,null,null,null,null,null,null,null,null,null,null,null,null,null,null,null,null,null,null,null,null,null,null,null,null,null,null,null,null,null,null,null,null,null,null,"0",0]
[4599,null,null,null,0,0,null,null,null,null,"ISLAM","WNI",null,null,null,null,0,0,null,null,null,null,null,null,null,null,null,null,null,null,null,null,null,null,null,null,null,null,null,null,null,null,null,null,null,null,null,null,null,null,null,null,null,null,null,null,null,null,null,null,null,null,null,null,null,null,null,null,null,null,null,null,null,null,null,null,null,null,null,null,"0",0]
[4600,null,null,null,0,0,null,null,null,null,"ISLAM","WNI",null,null,null,null,0,0,null,null,null,null,null,null,null,null,null,null,null,null,null,null,null,null,null,null,null,null,null,null,null,null,null,null,null,null,null,null,null,null,null,null,null,null,null,null,null,null,null,null,null,null,null,null,null,null,null,null,null,null,null,null,null,null,null,null,null,null,null,null,"0",0]
[4601,null,null,null,0,0,null,null,null,null,"ISLAM","WNI",null,null,null,null,0,0,null,null,null,null,null,null,null,null,null,null,null,null,null,null,null,null,null,null,null,null,null,null,null,null,null,null,null,null,null,null,null,null,null,null,null,null,null,null,null,null,null,null,null,null,null,null,null,null,null,null,null,null,null,null,null,null,null,null,null,null,null,null,"0",0]
[4602,null,null,null,0,0,null,null,null,null,"ISLAM","WNI",null,null,null,null,0,0,null,null,null,null,null,null,null,null,null,null,null,null,null,null,null,null,null,null,null,null,null,null,null,null,null,null,null,null,null,null,null,null,null,null,null,null,null,null,null,null,null,null,null,null,null,null,null,null,null,null,null,null,null,null,null,null,null,null,null,null,null,null,"0",0]
[4603,null,null,null,0,0,null,null,null,null,"ISLAM","WNI",null,null,null,null,0,0,null,null,null,null,null,null,null,null,null,null,null,null,null,null,null,null,null,null,null,null,null,null,null,null,null,null,null,null,null,null,null,null,null,null,null,null,null,null,null,null,null,null,null,null,null,null,null,null,null,null,null,null,null,null,null,null,null,null,null,null,null,null,"0",0]
[4604,null,null,null,0,0,null,null,null,null,"ISLAM","WNI",null,null,null,null,0,0,null,null,null,null,null,null,null,null,null,null,null,null,null,null,null,null,null,null,null,null,null,null,null,null,null,null,null,null,null,null,null,null,null,null,null,null,null,null,null,null,null,null,null,null,null,null,null,null,null,null,null,null,null,null,null,null,null,null,null,null,null,null,"0",0]
[4605,null,null,null,0,0,null,null,null,null,"ISLAM","WNI",null,null,null,null,0,0,null,null,null,null,null,null,null,null,null,null,null,null,null,null,null,null,null,null,null,null,null,null,null,null,null,null,null,null,null,null,null,null,null,null,null,null,null,null,null,null,null,null,null,null,null,null,null,null,null,null,null,null,null,null,null,null,null,null,null,null,null,null,"0",0]
[4606,null,null,null,0,0,null,null,null,null,"ISLAM","WNI",null,null,null,null,0,0,null,null,null,null,null,null,null,null,null,null,null,null,null,null,null,null,null,null,null,null,null,null,null,null,null,null,null,null,null,null,null,null,null,null,null,null,null,null,null,null,null,null,null,null,null,null,null,null,null,null,null,null,null,null,null,null,null,null,null,null,null,null,"0",0]
[4607,null,null,null,0,0,null,null,null,null,"ISLAM","WNI",null,null,null,null,0,0,null,null,null,null,null,null,null,null,null,null,null,null,null,null,null,null,null,null,null,null,null,null,null,null,null,null,null,null,null,null,null,null,null,null,null,null,null,null,null,null,null,null,null,null,null,null,null,null,null,null,null,null,null,null,null,null,null,null,null,null,null,null,"0",0]
[4608,null,null,null,0,0,null,null,null,null,"ISLAM","WNI",null,null,null,null,0,0,null,null,null,null,null,null,null,null,null,null,null,null,null,null,null,null,null,null,null,null,null,null,null,null,null,null,null,null,null,null,null,null,null,null,null,null,null,null,null,null,null,null,null,null,null,null,null,null,null,null,null,null,null,null,null,null,null,null,null,null,null,null,"0",0]
[4609,null,null,null,0,0,null,null,null,null,"ISLAM","WNI",null,null,null,null,0,0,null,null,null,null,null,null,null,null,null,null,null,null,null,null,null,null,null,null,null,null,null,null,null,null,null,null,null,null,null,null,null,null,null,null,null,null,null,null,null,null,null,null,null,null,null,null,null,null,null,null,null,null,null,null,null,null,null,null,null,null,null,null,"0",0]
[4610,null,null,null,0,0,null,null,null,null,"ISLAM","WNI",null,null,null,null,0,0,null,null,null,null,null,null,null,null,null,null,null,null,null,null,null,null,null,null,null,null,null,null,null,null,null,null,null,null,null,null,null,null,null,null,null,null,null,null,null,null,null,null,null,null,null,null,null,null,null,null,null,null,null,null,null,null,null,null,null,null,null,null,"0",0]
[4611,null,null,null,0,0,null,null,null,null,"ISLAM","WNI",null,null,null,null,0,0,null,null,null,null,null,null,null,null,null,null,null,null,null,null,null,null,null,null,null,null,null,null,null,null,null,null,null,null,null,null,null,null,null,null,null,null,null,null,null,null,null,null,null,null,null,null,null,null,null,null,null,null,null,null,null,null,null,null,null,null,null,null,"0",0]
[4612,null,null,null,0,0,null,null,null,null,"ISLAM","WNI",null,null,null,null,0,0,null,null,null,null,null,null,null,null,null,null,null,null,null,null,null,null,null,null,null,null,null,null,null,null,null,null,null,null,null,null,null,null,null,null,null,null,null,null,null,null,null,null,null,null,null,null,null,null,null,null,null,null,null,null,null,null,null,null,null,null,null,null,"0",0]
[4613,null,null,null,0,0,null,null,null,null,"ISLAM","WNI",null,null,null,null,0,0,null,null,null,null,null,null,null,null,null,null,null,null,null,null,null,null,null,null,null,null,null,null,null,null,null,null,null,null,null,null,null,null,null,null,null,null,null,null,null,null,null,null,null,null,null,null,null,null,null,null,null,null,null,null,null,null,null,null,null,null,null,null,"0",0]
[4614,null,null,null,0,0,null,null,null,null,"ISLAM","WNI",null,null,null,null,0,0,null,null,null,null,null,null,null,null,null,null,null,null,null,null,null,null,null,null,null,null,null,null,null,null,null,null,null,null,null,null,null,null,null,null,null,null,null,null,null,null,null,null,null,null,null,null,null,null,null,null,null,null,null,null,null,null,null,null,null,null,null,null,"0",0]
[4615,null,null,null,0,0,null,null,null,null,"ISLAM","WNI",null,null,null,null,0,0,null,null,null,null,null,null,null,null,null,null,null,null,null,null,null,null,null,null,null,null,null,null,null,null,null,null,null,null,null,null,null,null,null,null,null,null,null,null,null,null,null,null,null,null,null,null,null,null,null,null,null,null,null,null,null,null,null,null,null,null,null,null,"0",0]
[4616,null,null,null,0,0,null,null,null,null,"ISLAM","WNI",null,null,null,null,0,0,null,null,null,null,null,null,null,null,null,null,null,null,null,null,null,null,null,null,null,null,null,null,null,null,null,null,null,null,null,null,null,null,null,null,null,null,null,null,null,null,null,null,null,null,null,null,null,null,null,null,null,null,null,null,null,null,null,null,null,null,null,null,"0",0]
[4617,null,null,null,0,0,null,null,null,null,"ISLAM","WNI",null,null,null,null,0,0,null,null,null,null,null,null,null,null,null,null,null,null,null,null,null,null,null,null,null,null,null,null,null,null,null,null,null,null,null,null,null,null,null,null,null,null,null,null,null,null,null,null,null,null,null,null,null,null,null,null,null,null,null,null,null,null,null,null,null,null,null,null,"0",0]
[4618,null,null,null,0,0,null,null,null,null,"ISLAM","WNI",null,null,null,null,{"$f":"AT623","v":0},{"$f":"AU623","v":0},null,null,null,null,null,null,null,null,null,null,null,null,null,null,null,null,null,null,null,null,null,null,null,null,null,null,null,null,null,null,null,null,null,null,null,null,null,null,null,null,null,null,null,null,null,null,null,null,null,null,null,null,null,null,null,null,null,null,null,null,null,null,"0",0]
[4619,null,null,null,0,0,null,null,null,null,"ISLAM","WNI",null,null,null,null,0,0,null,null,null,null,null,null,null,null,null,null,null,null,null,null,null,null,null,null,null,null,null,null,null,null,null,null,null,null,null,null,null,null,null,null,null,null,null,null,null,null,null,null,null,null,null,null,null,null,null,null,null,null,null,null,null,null,null,null,null,null,null,null,{"$f":"RIGHT(CD624,4)","v":"0"},{"$f":"PR624","v":0}]
[4620,null,null,null,0,0,null,null,null,null,"ISLAM","WNI",null,null,null,null,0,0,null,null,null,null,null,null,null,null,null,null,null,null,null,null,null,null,null,null,null,null,null,null,null,null,null,null,null,null,null,null,null,null,null,null,null,null,null,null,null,null,null,null,null,null,null,null,null,null,null,null,null,null,null,null,null,null,null,null,null,null,null,null,"0",0]
[4621,null,null,null,0,0,null,null,null,null,"ISLAM","WNI",null,null,null,null,0,0,null,null,null,null,null,null,null,null,null,null,null,null,null,null,null,null,null,null,null,null,null,null,null,null,null,null,null,null,null,null,null,null,null,null,null,null,null,null,null,null,null,null,null,null,null,null,null,null,null,null,null,null,null,null,null,null,null,null,null,null,null,null,"0",0]
[4622,null,null,null,0,0,null,null,null,null,"ISLAM","WNI",null,null,null,null,0,0,null,null,null,null,null,null,null,null,null,null,null,null,null,null,null,null,null,null,null,null,null,null,null,null,null,null,null,null,null,null,null,null,null,null,null,null,null,null,null,null,null,null,null,null,null,null,null,null,null,null,null,null,null,null,null,null,null,null,null,null,null,null,"0",0]
[4623,null,null,null,0,0,null,null,null,null,"ISLAM","WNI",null,null,null,null,0,0,null,null,null,null,null,null,null,null,null,null,null,null,null,null,null,null,null,null,null,null,null,null,null,null,null,null,null,null,null,null,null,null,null,null,null,null,null,null,null,null,null,null,null,null,null,null,null,null,null,null,null,null,null,null,null,null,null,null,null,null,null,null,"0",0]
[4624,null,null,null,0,0,null,null,null,null,"ISLAM","WNI",null,null,null,null,0,0,null,null,null,null,null,null,null,null,null,null,null,null,null,null,null,null,null,null,null,null,null,null,null,null,null,null,null,null,null,null,null,null,null,null,null,null,null,null,null,null,null,null,null,null,null,null,null,null,null,null,null,null,null,null,null,null,null,null,null,null,null,null,"0",0]
[4625,null,null,null,0,0,null,null,null,null,"ISLAM","WNI",null,null,null,null,0,0,null,null,null,null,null,null,null,null,null,null,null,null,null,null,null,null,null,null,null,null,null,null,null,null,null,null,null,null,null,null,null,null,null,null,null,null,null,null,null,null,null,null,null,null,null,null,null,null,null,null,null,null,null,null,null,null,null,null,null,null,null,null,"0",0]
[4626,null,null,null,0,0,null,null,null,null,"ISLAM","WNI",null,null,null,null,0,0,null,null,null,null,null,null,null,null,null,null,null,null,null,null,null,null,null,null,null,null,null,null,null,null,null,null,null,null,null,null,null,null,null,null,null,null,null,null,null,null,null,null,null,null,null,null,null,null,null,null,null,null,null,null,null,null,null,null,null,null,null,null,"0",0]
[4627,null,null,null,0,0,null,null,null,null,"ISLAM","WNI",null,null,null,null,0,0,null,null,null,null,null,null,null,null,null,null,null,null,null,null,null,null,null,null,null,null,null,null,null,null,null,null,null,null,null,null,null,null,null,null,null,null,null,null,null,null,null,null,null,null,null,null,null,null,null,null,null,null,null,null,null,null,null,null,null,null,null,null,"0",0]
[4628,null,null,null,0,0,null,null,null,null,"ISLAM","WNI",null,null,null,null,0,0,null,null,null,null,null,null,null,null,null,null,null,null,null,null,null,null,null,null,null,null,null,null,null,null,null,null,null,null,null,null,null,null,null,null,null,null,null,null,null,null,null,null,null,null,null,null,null,null,null,null,null,null,null,null,null,null,null,null,null,null,null,null,"0",0]
[4629,null,null,null,0,0,null,null,null,null,"ISLAM","WNI",null,null,null,null,0,0,null,null,null,null,null,null,null,null,null,null,null,null,null,null,null,null,null,null,null,null,null,null,null,null,null,null,null,null,null,null,null,null,null,null,null,null,null,null,null,null,null,null,null,null,null,null,null,null,null,null,null,null,null,null,null,null,null,null,null,null,null,null,"0",0]
[4630,null,null,null,0,0,null,null,null,null,"ISLAM","WNI",null,null,null,null,0,0,null,null,null,null,null,null,null,null,null,null,null,null,null,null,null,null,null,null,null,null,null,null,null,null,null,null,null,null,null,null,null,null,null,null,null,null,null,null,null,null,null,null,null,null,null,null,null,null,null,null,null,null,null,null,null,null,null,null,null,null,null,null,"0",0]
[4631,null,null,null,0,0,null,null,null,null,"ISLAM","WNI",null,null,null,null,0,0,null,null,null,null,null,null,null,null,null,null,null,null,null,null,null,null,null,null,null,null,null,null,null,null,null,null,null,null,null,null,null,null,null,null,null,null,null,null,null,null,null,null,null,null,null,null,null,null,null,null,null,null,null,null,null,null,null,null,null,null,null,null,"0",0]
[4632,null,null,null,0,0,null,null,null,null,"ISLAM","WNI",null,null,null,null,0,0,null,null,null,null,null,null,null,null,null,null,null,null,null,null,null,null,null,null,null,null,null,null,null,null,null,null,null,null,null,null,null,null,null,null,null,null,null,null,null,null,null,null,null,null,null,null,null,null,null,null,null,null,null,null,null,null,null,null,null,null,null,null,"0",0]
[4633,"MOCHAMAD RIFKY ROSAN",null,null,0,0,null,"L","17/06/2006",null,"ISLAM","WNI",null,null,null,null,0,0,null,null,null,null,null,null,null,null,null,null,null,null,null,null,null,null,null,null,null,null,null,null,null,null,null,null,null,null,null,null,null,null,null,null,null,null,null,null,null,null,null,null,null,null,null,null,"2017/18",40.799999999999997,147,null,null,null,null,null,null,null,null,null,null,null,null,null,"0",0,null,null,null,null,null,null,null,"*"]
[4634,null,null,null,0,0,null,null,null,null,"ISLAM","WNI",null,null,null,null,0,0,null,null,null,null,null,null,null,null,null,null,null,null,null,null,null,null,null,null,null,null,null,null,null,null,null,null,null,null,null,null,null,null,null,null,null,null,null,null,null,null,null,null,null,null,null,null,null,null,null,null,null,null,null,null,null,null,null,null,null,null,null,null,"0",0]
[4635,null,null,null,0,0,null,null,null,null,"ISLAM","WNI",null,null,null,null,0,0,null,null,null,null,null,null,null,null,null,null,null,null,null,null,null,null,null,null,null,null,null,null,null,null,null,null,null,null,null,null,null,null,null,null,null,null,null,null,null,null,null,null,null,null,null,null,null,null,null,null,null,null,null,null,null,null,null,null,null,null,null,null,"0",0]
[4636,null,null,null,0,0,null,null,null,null,"ISLAM","WNI",null,null,null,null,0,0,null,null,null,null,null,null,null,null,null,null,null,null,null,null,null,null,null,null,null,null,null,null,null,null,null,null,null,null,null,null,null,null,null,null,null,null,null,null,null,null,null,null,null,null,null,null,null,null,null,null,null,null,null,null,null,null,null,null,null,null,null,null,"0",0]
[4637,null,null,null,0,0,null,null,null,null,"ISLAM","WNI",null,null,null,null,0,0,null,null,null,null,null,null,null,null,null,null,null,null,null,null,null,null,null,null,null,null,null,null,null,null,null,null,null,null,null,null,null,null,null,null,null,null,null,null,null,null,null,null,null,null,null,null,null,null,null,null,null,null,null,null,null,null,null,null,null,null,null,null,"0",0]
[4638,null,null,null,0,0,null,null,null,null,"ISLAM","WNI",null,null,null,null,0,0,null,null,null,null,null,null,null,null,null,null,null,null,null,null,null,null,null,null,null,null,null,null,null,null,null,null,null,null,null,null,null,null,null,null,null,null,null,null,null,null,null,null,null,null,null,null,null,null,null,null,null,null,null,null,null,null,null,null,null,null,null,null,"0",0]
[4639,null,null,null,0,0,null,null,null,null,"ISLAM","WNI",null,null,null,null,0,0,null,null,null,null,null,null,null,null,null,null,null,null,null,null,null,null,null,null,null,null,null,null,null,null,null,null,null,null,null,null,null,null,null,null,null,null,null,null,null,null,null,null,null,null,null,null,null,null,null,null,null,null,null,null,null,null,null,null,null,null,null,null,"0",0]
[4640,null,null,null,0,0,null,null,null,null,"ISLAM","WNI",null,null,null,null,0,0,null,null,null,null,null,null,null,null,null,null,null,null,null,null,null,null,null,null,null,null,null,null,null,null,null,null,null,null,null,null,null,null,null,null,null,null,null,null,null,null,null,null,null,null,null,null,null,null,null,null,null,null,null,null,null,null,null,null,null,null,null,null,"0",0]
[4641,null,null,null,0,0,null,null,null,null,"ISLAM","WNI",null,null,null,null,0,0,null,null,null,null,null,null,null,null,null,null,null,null,null,null,null,null,null,null,null,null,null,null,null,null,null,null,null,null,null,null,null,null,null,null,null,null,null,null,null,null,null,null,null,null,null,null,null,null,null,null,null,null,null,null,null,null,null,null,null,null,null,null,"0",0]
[4642,null,null,null,0,0,null,null,null,null,"ISLAM","WNI",null,null,null,null,0,0,null,null,null,null,null,null,null,null,null,null,null,null,null,null,null,null,null,null,null,null,null,null,null,null,null,null,null,null,null,null,null,null,null,null,null,null,null,null,null,null,null,null,null,null,null,null,null,null,null,null,null,null,null,null,null,null,null,null,null,null,null,null,"0",0]
[4643,null,null,null,{"$f":"AQ648","v":0},{"$f":"QG648","v":0},null,null,null,null,"ISLAM","WNI",null,null,null,null,0,0,null,null,null,null,null,null,null,null,null,null,null,null,null,null,null,null,null,null,null,null,null,null,null,null,null,null,null,null,null,null,null,null,null,null,null,null,null,null,null,null,null,null,null,null,null,null,null,null,null,null,null,null,null,null,null,null,null,null,null,null,null,null,"0",0]
[4644,null,null,null,0,0,null,null,null,null,"ISLAM","WNI",null,null,null,null,0,0,null,null,null,null,null,null,null,null,null,null,null,null,null,null,null,null,null,null,null,null,null,null,null,null,null,null,null,null,null,null,null,null,null,null,null,null,null,null,null,null,null,null,null,null,null,null,null,null,null,null,null,null,null,null,null,null,null,null,null,null,null,null,"0",0]
[4645,null,null,null,0,0,null,null,null,null,"ISLAM","WNI",null,null,null,null,0,0,null,null,null,null,null,null,null,null,null,null,null,null,null,null,null,null,null,null,null,null,null,null,null,null,null,null,null,null,null,null,null,null,null,null,null,null,null,null,null,null,null,null,null,null,null,null,null,null,null,null,null,null,null,null,null,null,null,null,null,null,null,null,"0",0]
[4646,null,null,null,0,0,null,null,null,null,"ISLAM","WNI",null,null,null,null,0,0,null,null,null,null,null,null,null,null,null,null,null,null,null,null,null,null,null,null,null,null,null,null,null,null,null,null,null,null,null,null,null,null,null,null,null,null,null,null,null,null,null,null,null,null,null,null,null,null,null,null,null,null,null,null,null,null,null,null,null,null,null,null,"0",0]
[4647,null,null,null,0,0,null,null,null,null,"ISLAM","WNI",null,null,null,null,0,0,null,null,null,null,null,null,null,null,null,null,null,null,null,null,null,null,null,null,null,null,null,null,null,null,null,null,null,null,null,null,null,null,null,null,null,null,null,null,null,null,null,null,null,null,null,null,null,null,null,null,null,null,null,null,null,null,null,null,null,null,null,null,"0",0]
[4648,null,null,null,0,0,null,null,null,null,"ISLAM","WNI",null,null,null,null,0,0,null,null,null,null,null,null,null,null,null,null,null,null,null,null,null,null,null,null,null,null,null,null,null,null,null,null,null,null,null,null,null,null,null,null,null,null,null,null,null,null,null,null,null,null,null,null,null,null,null,null,null,null,null,null,null,null,null,null,null,null,null,null,"0",0]
[4649,null,null,null,0,0,null,null,null,null,"ISLAM","WNI",null,null,null,null,0,0,null,null,null,null,null,null,null,null,null,null,null,null,null,null,null,null,null,null,null,null,null,null,null,null,null,null,null,null,null,null,null,null,null,null,null,null,null,null,null,null,null,null,null,null,null,null,null,null,null,null,null,null,null,null,null,null,null,null,null,null,null,null,"0",0]
[4650,null,null,null,0,0,null,null,null,null,"ISLAM","WNI",null,null,null,null,0,0,null,null,null,null,null,null,null,null,null,null,null,null,null,null,null,null,null,null,null,null,null,null,null,null,null,null,null,null,null,null,null,null,null,null,null,null,null,null,null,null,null,null,null,null,null,null,null,null,null,null,null,null,null,null,null,null,null,null,null,null,null,null,"0",0]
[4651,null,null,null,0,0,null,null,null,null,"ISLAM","WNI",null,null,null,null,0,0,null,null,null,null,null,null,null,null,null,null,null,null,null,null,null,null,null,null,null,null,null,null,null,null,null,null,null,null,null,null,null,null,null,null,null,null,null,null,null,null,null,null,null,null,null,null,null,null,null,null,null,null,null,null,null,null,null,null,null,null,null,null,"0",0]
[4652,null,null,null,0,0,null,null,null,null,"ISLAM","WNI",null,null,null,null,0,0,null,null,null,null,null,null,null,null,null,null,null,null,null,null,null,null,null,null,null,null,null,null,null,null,null,null,null,null,null,null,null,null,null,null,null,null,null,null,null,null,null,null,null,null,null,null,null,null,null,null,null,null,null,null,null,null,null,null,null,null,null,null,"0",0]
[4653,null,null,null,0,0,null,null,null,null,"ISLAM","WNI",null,null,null,null,0,0,null,null,null,null,null,null,null,null,null,null,null,null,null,null,null,null,null,null,null,null,null,null,null,null,null,null,null,null,null,null,null,null,null,null,null,null,null,null,null,null,null,null,null,null,null,null,null,null,null,null,null,null,null,null,null,null,null,null,null,null,null,null,"0",0]
[4654,null,null,null,0,0,null,null,null,null,"ISLAM","WNI",null,null,null,null,0,0,null,null,null,null,null,null,null,null,null,null,null,null,null,null,null,null,null,null,null,null,null,null,null,null,null,null,null,null,null,null,null,null,null,null,null,null,null,null,null,null,null,null,null,null,null,null,null,null,null,null,null,null,null,null,null,null,null,null,null,null,null,null,"0",0]
[4655,null,null,null,0,0,null,null,null,null,"ISLAM","WNI",null,null,null,null,0,0,null,null,null,null,null,null,null,null,null,null,null,null,null,null,null,null,null,null,null,null,null,null,null,null,null,null,null,null,null,null,null,null,null,null,null,null,null,null,null,null,null,null,null,null,null,null,null,null,null,null,null,null,null,null,null,null,null,null,null,null,null,null,"0",0]
[4656,null,null,null,0,0,null,null,null,null,"ISLAM","WNI",null,null,null,null,0,0,null,null,null,null,null,null,null,null,null,null,null,null,null,null,null,null,null,null,null,null,null,null,null,null,null,null,null,null,null,null,null,null,null,null,null,null,null,null,null,null,null,null,null,null,null,null,null,null,null,null,null,null,null,null,null,null,null,null,null,null,null,null,"0",0]
[4657,null,null,null,0,0,null,null,null,null,"ISLAM","WNI",null,null,null,null,0,0,null,null,null,null,null,null,null,null,null,null,null,null,null,null,null,null,null,null,null,null,null,null,null,null,null,null,null,null,null,null,null,null,null,null,null,null,null,null,null,null,null,null,null,null,null,null,null,null,null,null,null,null,null,null,null,null,null,null,null,null,null,null,"0",0]
[4658,null,null,null,0,0,null,null,null,null,"ISLAM","WNI",null,null,null,null,0,0,null,null,null,null,null,null,null,null,null,null,null,null,null,null,null,null,null,null,null,null,null,null,null,null,null,null,null,null,null,null,null,null,null,null,null,null,null,null,null,null,null,null,null,null,null,null,null,null,null,null,null,null,null,null,null,null,null,null,null,null,null,null,"0",0]
[4659,null,null,null,0,0,null,null,null,null,"ISLAM","WNI",null,null,null,null,0,0,null,null,null,null,null,null,null,null,null,null,null,null,null,null,null,null,null,null,null,null,null,null,null,null,null,null,null,null,null,null,null,null,null,null,null,null,null,null,null,null,null,null,null,null,null,null,null,null,null,null,null,null,null,null,null,null,null,null,null,null,null,null,"0",0]
[4660,null,null,null,0,0,null,null,null,null,"ISLAM","WNI",null,null,null,null,0,0,null,null,null,null,null,null,null,null,null,null,null,null,null,null,null,null,null,null,null,null,null,null,null,null,null,null,null,null,null,null,null,null,null,null,null,null,null,null,null,null,null,null,null,null,null,null,null,null,null,null,null,null,null,null,null,null,null,null,null,null,null,null,"0",0]
[4661,null,null,null,0,0,null,null,null,null,"ISLAM","WNI",null,null,null,null,0,0,null,null,null,null,null,null,null,null,null,null,null,null,null,null,null,null,null,null,null,null,null,null,null,null,null,null,null,null,null,null,null,null,null,null,null,null,null,null,null,null,null,null,null,null,null,null,null,null,null,null,null,null,null,null,null,null,null,null,null,null,null,null,"0",0]
[4662,null,null,null,0,0,null,null,null,null,"ISLAM","WNI",null,null,null,null,0,0,null,null,null,null,null,null,null,null,null,null,null,null,null,null,null,null,null,null,null,null,null,null,null,null,null,null,null,null,null,null,null,null,null,null,null,null,null,null,null,null,null,null,null,null,null,null,null,null,null,null,null,null,null,null,null,null,null,null,null,null,null,null,"0",0]
[4663,null,null,null,0,0,null,null,null,null,"ISLAM","WNI",null,null,null,null,0,0,null,null,null,null,null,null,null,null,null,null,null,null,null,null,null,null,null,null,null,null,null,null,null,null,null,null,null,null,null,null,null,null,null,null,null,null,null,null,null,null,null,null,null,null,null,null,null,null,null,null,null,null,null,null,null,null,null,null,null,null,null,null,"0",0]
[4664,null,null,null,0,0,null,null,null,null,"ISLAM","WNI",null,null,null,null,0,0,null,null,null,null,null,null,null,null,null,null,null,null,null,null,null,null,null,null,null,null,null,null,null,null,null,null,null,null,null,null,null,null,null,null,null,null,null,null,null,null,null,null,null,null,null,null,null,null,null,null,null,null,null,null,null,null,null,null,null,null,null,null,"0",0]
[4665,null,null,null,0,0,null,null,null,null,"ISLAM","WNI",null,null,null,null,0,0,null,null,null,null,null,null,null,null,null,null,null,null,null,null,null,null,null,null,null,null,null,null,null,null,null,null,null,null,null,null,null,null,null,null,null,null,null,null,null,null,null,null,null,null,null,null,null,null,null,null,null,null,null,null,null,null,null,null,null,null,null,null,"0",0]
[4666,null,null,null,0,0,null,null,null,null,"ISLAM","WNI",null,null,null,null,0,0,null,null,null,null,null,null,null,null,null,null,null,null,null,null,null,null,null,null,null,null,null,null,null,null,null,null,null,null,null,null,null,null,null,null,null,null,null,null,null,null,null,null,null,null,null,null,null,null,null,null,null,null,null,null,null,null,null,null,null,null,null,null,"0",0]
[4667,null,null,null,0,0,null,null,null,null,"ISLAM","WNI",null,null,null,null,0,0,null,null,null,null,null,null,null,null,null,null,null,null,null,null,null,null,null,null,null,null,null,null,null,null,null,null,null,null,null,null,null,null,null,null,null,null,null,null,null,null,null,null,null,null,null,null,null,null,null,null,null,null,null,null,null,null,null,null,null,null,null,null,"0",0]
[4668,null,null,null,0,0,null,null,null,null,"ISLAM","WNI",null,null,null,null,0,0,null,null,null,null,null,null,null,null,null,null,null,null,null,null,null,null,null,null,null,null,null,null,null,null,null,null,null,null,null,null,null,null,null,null,null,null,null,null,null,null,null,null,null,null,null,null,null,null,null,null,null,null,null,null,null,null,null,null,null,null,null,null,"0",0]
[4669,null,null,null,0,0,null,null,null,null,"ISLAM","WNI",null,null,null,null,0,0,null,null,null,null,null,null,null,null,null,null,null,null,null,null,null,null,null,null,null,null,null,null,null,null,null,null,null,null,null,null,null,null,null,null,null,null,null,null,null,null,null,null,null,null,null,null,null,null,null,null,null,null,null,null,null,null,null,null,null,null,null,null,"0",0]
[4670,null,null,null,0,0,null,null,null,null,"ISLAM","WNI",null,null,null,null,0,0,null,null,null,null,null,null,null,null,null,null,null,null,null,null,null,null,null,null,null,null,null,null,null,null,null,null,null,null,null,null,null,null,null,null,null,null,null,null,null,null,null,null,null,null,null,null,null,null,null,null,null,null,null,null,null,null,null,null,null,null,null,null,"0",0]
[4671,null,null,null,0,0,null,null,null,null,"ISLAM","WNI",null,null,null,null,0,0,null,null,null,null,null,null,null,null,null,null,null,null,null,null,null,null,null,null,null,null,null,null,null,null,null,null,null,null,null,null,null,null,null,null,null,null,null,null,null,null,null,null,null,null,null,null,null,null,null,null,null,null,null,null,null,null,null,null,null,null,null,null,"0",0]
[4672,null,null,null,0,0,null,null,null,null,"ISLAM","WNI",null,null,null,null,0,0,null,null,null,null,null,null,null,null,null,null,null,null,null,null,null,null,null,null,null,null,null,null,null,null,null,null,null,null,null,null,null,null,null,null,null,null,null,null,null,null,null,null,null,null,null,null,null,null,null,null,null,null,null,null,null,null,null,null,null,null,null,null,"0",0]
[4673,null,null,null,0,0,null,null,null,null,"ISLAM","WNI",null,null,null,null,0,0,null,null,null,null,null,null,null,null,null,null,null,null,null,null,null,null,null,null,null,null,null,null,null,null,null,null,null,null,null,null,null,null,null,null,null,null,null,null,null,null,null,null,null,null,null,null,null,null,null,null,null,null,null,null,null,null,null,null,null,null,null,null,"0",0]
[4674,null,null,null,0,0,null,null,null,null,"ISLAM","WNI",null,null,null,null,0,0,null,null,null,null,null,null,null,null,null,null,null,null,null,null,null,null,null,null,null,null,null,null,null,null,null,null,null,null,null,null,null,null,null,null,null,null,null,null,null,null,null,null,null,null,null,null,null,null,null,null,null,null,null,null,null,null,null,null,null,null,null,null,"0",0]
[4675,null,null,null,0,0,null,null,null,null,"ISLAM","WNI",null,null,null,null,0,0,null,null,null,null,null,null,null,null,null,null,null,null,null,null,null,null,null,null,null,null,null,null,null,null,null,null,null,null,null,null,null,null,null,null,null,null,null,null,null,null,null,null,null,null,null,null,null,null,null,null,null,null,null,null,null,null,null,null,null,null,null,null,"0",0]
[4676,null,null,null,0,0,null,null,null,null,"ISLAM","WNI",null,null,null,null,0,0,null,null,null,null,null,null,null,null,null,null,null,null,null,null,null,null,null,null,null,null,null,null,null,null,null,null,null,null,null,null,null,null,null,null,null,null,null,null,null,null,null,null,null,null,null,null,null,null,null,null,null,null,null,null,null,null,null,null,null,null,null,null,"0",0]
[4677,null,null,null,0,0,null,null,null,null,"ISLAM","WNI",null,null,null,null,0,0,null,null,null,null,null,null,null,null,null,null,null,null,null,null,null,null,null,null,null,null,null,null,null,null,null,null,null,null,null,null,null,null,null,null,null,null,null,null,null,null,null,null,null,null,null,null,null,null,null,null,null,null,null,null,null,null,null,null,null,null,null,null,"0",0]
[4678,null,null,null,0,0,null,null,null,null,"ISLAM","WNI",null,null,null,null,0,0,null,null,null,null,null,null,null,null,null,null,null,null,null,null,null,null,null,null,null,null,null,null,null,null,null,null,null,null,null,null,null,null,null,null,null,null,null,null,null,null,null,null,null,null,null,null,null,null,null,null,null,null,null,null,null,null,null,null,null,null,null,null,"0",0]
[4679,null,null,null,0,0,null,null,null,null,"ISLAM","WNI",null,null,null,null,0,0,null,null,null,null,null,null,null,null,null,null,null,null,null,null,null,null,null,null,null,null,null,null,null,null,null,null,null,null,null,null,null,null,null,null,null,null,null,null,null,null,null,null,null,null,null,null,null,null,null,null,null,null,null,null,null,null,null,null,null,null,null,null,"0",0]
[4680,null,null,null,0,0,null,null,null,null,"ISLAM","WNI",null,null,null,null,0,0,null,null,null,null,null,null,null,null,null,null,null,null,null,null,null,null,null,null,null,null,null,null,null,null,null,null,null,null,null,null,null,null,null,null,null,null,null,null,null,null,null,null,null,null,null,null,null,null,null,null,null,null,null,null,null,null,null,null,null,null,null,null,"0",0]
[4681,null,null,null,0,0,null,null,null,null,"ISLAM","WNI",null,null,null,null,0,0,null,null,null,null,null,null,null,null,null,null,null,null,null,null,null,null,null,null,null,null,null,null,null,null,null,null,null,null,null,null,null,null,null,null,null,null,null,null,null,null,null,null,null,null,null,null,null,null,null,null,null,null,null,null,null,null,null,null,null,null,null,null,"0",0]
[4682,null,null,null,0,0,null,null,null,null,"ISLAM","WNI",null,null,null,null,{"$f":"AT687","v":0},{"$f":"AU687","v":0},null,null,null,null,null,null,null,null,null,null,null,null,null,null,null,null,null,null,null,null,null,null,null,null,null,null,null,null,null,null,null,null,null,null,null,null,null,null,null,null,null,null,null,null,null,null,null,null,null,null,null,null,null,null,null,null,null,null,null,null,null,null,"0",0]
[4683,null,null,null,0,0,null,null,null,null,"ISLAM","WNI",null,null,null,null,0,0,null,null,null,null,null,null,null,null,null,null,null,null,null,null,null,null,null,null,null,null,null,null,null,null,null,null,null,null,null,null,null,null,null,null,null,null,null,null,null,null,null,null,null,null,null,null,null,null,null,null,null,null,null,null,null,null,null,null,null,null,null,null,{"$f":"RIGHT(CD688,4)","v":"0"},{"$f":"PR688","v":0}]
[4684,null,null,null,0,0,null,null,null,null,"ISLAM","WNI",null,null,null,null,0,0,null,null,null,null,null,null,null,null,null,null,null,null,null,null,null,null,null,null,null,null,null,null,null,null,null,null,null,null,null,null,null,null,null,null,null,null,null,null,null,null,null,null,null,null,null,null,null,null,null,null,null,null,null,null,null,null,null,null,null,null,null,null,"0",0]
[4685,null,null,null,0,0,null,null,null,null,"ISLAM","WNI",null,null,null,null,0,0,null,null,null,null,null,null,null,null,null,null,null,null,null,null,null,null,null,null,null,null,null,null,null,null,null,null,null,null,null,null,null,null,null,null,null,null,null,null,null,null,null,null,null,null,null,null,null,null,null,null,null,null,null,null,null,null,null,null,null,null,null,null,"0",0]
[4686,null,null,null,0,0,null,null,null,null,"ISLAM","WNI",null,null,null,null,0,0,null,null,null,null,null,null,null,null,null,null,null,null,null,null,null,null,null,null,null,null,null,null,null,null,null,null,null,null,null,null,null,null,null,null,null,null,null,null,null,null,null,null,null,null,null,null,null,null,null,null,null,null,null,null,null,null,null,null,null,null,null,null,"0",0]
[4687,null,null,null,0,0,null,null,null,null,"ISLAM","WNI",null,null,null,null,0,0,null,null,null,null,null,null,null,null,null,null,null,null,null,null,null,null,null,null,null,null,null,null,null,null,null,null,null,null,null,null,null,null,null,null,null,null,null,null,null,null,null,null,null,null,null,null,null,null,null,null,null,null,null,null,null,null,null,null,null,null,null,null,"0",0]
[4688,null,null,null,0,0,null,null,null,null,"ISLAM","WNI",null,null,null,null,0,0,null,null,null,null,null,null,null,null,null,null,null,null,null,null,null,null,null,null,null,null,null,null,null,null,null,null,null,null,null,null,null,null,null,null,null,null,null,null,null,null,null,null,null,null,null,null,null,null,null,null,null,null,null,null,null,null,null,null,null,null,null,null,"0",0]
[4689,null,null,null,0,0,null,null,null,null,"ISLAM","WNI",null,null,null,null,0,0,null,null,null,null,null,null,null,null,null,null,null,null,null,null,null,null,null,null,null,null,null,null,null,null,null,null,null,null,null,null,null,null,null,null,null,null,null,null,null,null,null,null,null,null,null,null,null,null,null,null,null,null,null,null,null,null,null,null,null,null,null,null,"0",0]
[4690,null,null,null,0,0,null,null,null,null,"ISLAM","WNI",null,null,null,null,0,0,null,null,null,null,null,null,null,null,null,null,null,null,null,null,null,null,null,null,null,null,null,null,null,null,null,null,null,null,null,null,null,null,null,null,null,null,null,null,null,null,null,null,null,null,null,null,null,null,null,null,null,null,null,null,null,null,null,null,null,null,null,null,"0",0]
[4691,null,null,null,0,0,null,null,null,null,"ISLAM","WNI",null,null,null,null,0,0,null,null,null,null,null,null,null,null,null,null,null,null,null,null,null,null,null,null,null,null,null,null,null,null,null,null,null,null,null,null,null,null,null,null,null,null,null,null,null,null,null,null,null,null,null,null,null,null,null,null,null,null,null,null,null,null,null,null,null,null,null,null,"0",0]
[4692,null,null,null,0,0,null,null,null,null,"ISLAM","WNI",null,null,null,null,0,0,null,null,null,null,null,null,null,null,null,null,null,null,null,null,null,null,null,null,null,null,null,null,null,null,null,null,null,null,null,null,null,null,null,null,null,null,null,null,null,null,null,null,null,null,null,null,null,null,null,null,null,null,null,null,null,null,null,null,null,null,null,null,"0",0]
[4693,null,null,null,0,0,null,null,null,null,"ISLAM","WNI",null,null,null,null,0,0,null,null,null,null,null,null,null,null,null,null,null,null,null,null,null,null,null,null,null,null,null,null,null,null,null,null,null,null,null,null,null,null,null,null,null,null,null,null,null,null,null,null,null,null,null,null,null,null,null,null,null,null,null,null,null,null,null,null,null,null,null,null,"0",0]
[4694,null,null,null,0,0,null,null,null,null,"ISLAM","WNI",null,null,null,null,0,0,null,null,null,null,null,null,null,null,null,null,null,null,null,null,null,null,null,null,null,null,null,null,null,null,null,null,null,null,null,null,null,null,null,null,null,null,null,null,null,null,null,null,null,null,null,null,null,null,null,null,null,null,null,null,null,null,null,null,null,null,null,null,"0",0]
[4695,null,null,null,0,0,null,null,null,null,"ISLAM","WNI",null,null,null,null,0,0,null,null,null,null,null,null,null,null,null,null,null,null,null,null,null,null,null,null,null,null,null,null,null,null,null,null,null,null,null,null,null,null,null,null,null,null,null,null,null,null,null,null,null,null,null,null,null,null,null,null,null,null,null,null,null,null,null,null,null,null,null,null,"0",0]
[4696,null,null,null,0,0,null,null,null,null,"ISLAM","WNI",null,null,null,null,0,0,null,null,null,null,null,null,null,null,null,null,null,null,null,null,null,null,null,null,null,null,null,null,null,null,null,null,null,null,null,null,null,null,null,null,null,null,null,null,null,null,null,null,null,null,null,null,null,null,null,null,null,null,null,null,null,null,null,null,null,null,null,null,"0",0]
[4697,null,null,null,0,0,null,null,null,null,"ISLAM","WNI",null,null,null,null,0,0,null,null,null,null,null,null,null,null,null,null,null,null,null,null,null,null,null,null,null,null,null,null,null,null,null,null,null,null,null,null,null,null,null,null,null,null,null,null,null,null,null,null,null,null,null,null,null,null,null,null,null,null,null,null,null,null,null,null,null,null,null,null,"0",0]
[4698,null,null,null,0,0,null,null,null,null,"ISLAM","WNI",null,null,null,null,0,0,null,null,null,null,null,null,null,null,null,null,null,null,null,null,null,null,null,null,null,null,null,null,null,null,null,null,null,null,null,null,null,null,null,null,null,null,null,null,null,null,null,null,null,null,null,null,null,null,null,null,null,null,null,null,null,null,null,null,null,null,null,null,"0",0]
[4699,null,null,null,0,0,null,null,null,null,"ISLAM","WNI",null,null,null,null,0,0,null,null,null,null,null,null,null,null,null,null,null,null,null,null,null,null,null,null,null,null,null,null,null,null,null,null,null,null,null,null,null,null,null,null,null,null,null,null,null,null,null,null,null,null,null,null,null,null,null,null,null,null,null,null,null,null,null,null,null,null,null,null,"0",0]
[4700,null,null,null,0,0,null,null,null,null,"ISLAM","WNI",null,null,null,null,0,0,null,null,null,null,null,null,null,null,null,null,null,null,null,null,null,null,null,null,null,null,null,null,null,null,null,null,null,null,null,null,null,null,null,null,null,null,null,null,null,null,null,null,null,null,null,null,null,null,null,null,null,null,null,null,null,null,null,null,null,null,null,null,"0",0]
[4701,null,null,null,0,0,null,null,null,null,"ISLAM","WNI",null,null,null,null,0,0,null,null,null,null,null,null,null,null,null,null,null,null,null,null,null,null,null,null,null,null,null,null,null,null,null,null,null,null,null,null,null,null,null,null,null,null,null,null,null,null,null,null,null,null,null,null,null,null,null,null,null,null,null,null,null,null,null,null,null,null,null,null,"0",0]
[4702,null,null,null,0,0,null,null,null,null,"ISLAM","WNI",null,null,null,null,0,0,null,null,null,null,null,null,null,null,null,null,null,null,null,null,null,null,null,null,null,null,null,null,null,null,null,null,null,null,null,null,null,null,null,null,null,null,null,null,null,null,null,null,null,null,null,null,null,null,null,null,null,null,null,null,null,null,null,null,null,null,null,null,"0",0]
[4703,null,null,null,0,0,null,null,null,null,"ISLAM","WNI",null,null,null,null,0,0,null,null,null,null,null,null,null,null,null,null,null,null,null,null,null,null,null,null,null,null,null,null,null,null,null,null,null,null,null,null,null,null,null,null,null,null,null,null,null,null,null,null,null,null,null,null,null,null,null,null,null,null,null,null,null,null,null,null,null,null,null,null,"0",0]
[4704,null,null,null,0,0,null,null,null,null,"ISLAM","WNI",null,null,null,null,0,0,null,null,null,null,null,null,null,null,null,null,null,null,null,null,null,null,null,null,null,null,null,null,null,null,null,null,null,null,null,null,null,null,null,null,null,null,null,null,null,null,null,null,null,null,null,null,null,null,null,null,null,null,null,null,null,null,null,null,null,null,null,null,"0",0]
[4705,null,null,null,0,0,null,null,null,null,"ISLAM","WNI",null,null,null,null,0,0,null,null,null,null,null,null,null,null,null,null,null,null,null,null,null,null,null,null,null,null,null,null,null,null,null,null,null,null,null,null,null,null,null,null,null,null,null,null,null,null,null,null,null,null,null,null,null,null,null,null,null,null,null,null,null,null,null,null,null,null,null,null,"0",0]
[4706,null,null,null,0,0,null,null,null,null,"ISLAM","WNI",null,null,null,null,0,0,null,null,null,null,null,null,null,null,null,null,null,null,null,null,null,null,null,null,null,null,null,null,null,null,null,null,null,null,null,null,null,null,null,null,null,null,null,null,null,null,null,null,null,null,null,null,null,null,null,null,null,null,null,null,null,null,null,null,null,null,null,null,"0",0]
[4707,null,null,null,{"$f":"AQ712","v":0},{"$f":"QG712","v":0},null,null,null,null,"ISLAM","WNI",null,null,null,null,0,0,null,null,null,null,null,null,null,null,null,null,null,null,null,null,null,null,null,null,null,null,null,null,null,null,null,null,null,null,null,null,null,null,null,null,null,null,null,null,null,null,null,null,null,null,null,null,null,null,null,null,null,null,null,null,null,null,null,null,null,null,null,null,"0",0]
[4708,null,null,null,0,0,null,null,null,null,"ISLAM","WNI",null,null,null,null,0,0,null,null,null,null,null,null,null,null,null,null,null,null,null,null,null,null,null,null,null,null,null,null,null,null,null,null,null,null,null,null,null,null,null,null,null,null,null,null,null,null,null,null,null,null,null,null,null,null,null,null,null,null,null,null,null,null,null,null,null,null,null,null,"0",0]
[4709,null,null,null,0,0,null,null,null,null,"ISLAM","WNI",null,null,null,null,0,0,null,null,null,null,null,null,null,null,null,null,null,null,null,null,null,null,null,null,null,null,null,null,null,null,null,null,null,null,null,null,null,null,null,null,null,null,null,null,null,null,null,null,null,null,null,null,null,null,null,null,null,null,null,null,null,null,null,null,null,null,null,null,"0",0]
[4710,null,null,null,0,0,null,null,null,null,"ISLAM","WNI",null,null,null,null,0,0,null,null,null,null,null,null,null,null,null,null,null,null,null,null,null,null,null,null,null,null,null,null,null,null,null,null,null,null,null,null,null,null,null,null,null,null,null,null,null,null,null,null,null,null,null,null,null,null,null,null,null,null,null,null,null,null,null,null,null,null,null,null,"0",0]
[4711,null,null,null,0,0,null,null,null,null,"ISLAM","WNI",null,null,null,null,0,0,null,null,null,null,null,null,null,null,null,null,null,null,null,null,null,null,null,null,null,null,null,null,null,null,null,null,null,null,null,null,null,null,null,null,null,null,null,null,null,null,null,null,null,null,null,null,null,null,null,null,null,null,null,null,null,null,null,null,null,null,null,null,"0",0]
[4712,null,null,null,0,0,null,null,null,null,"ISLAM","WNI",null,null,null,null,0,0,null,null,null,null,null,null,null,null,null,null,null,null,null,null,null,null,null,null,null,null,null,null,null,null,null,null,null,null,null,null,null,null,null,null,null,null,null,null,null,null,null,null,null,null,null,null,null,null,null,null,null,null,null,null,null,null,null,null,null,null,null,null,"0",0]
[4713,null,null,null,0,0,null,null,null,null,"ISLAM","WNI",null,null,null,null,0,0,null,null,null,null,null,null,null,null,null,null,null,null,null,null,null,null,null,null,null,null,null,null,null,null,null,null,null,null,null,null,null,null,null,null,null,null,null,null,null,null,null,null,null,null,null,null,null,null,null,null,null,null,null,null,null,null,null,null,null,null,null,null,"0",0]
[4714,null,null,null,0,0,null,null,null,null,"ISLAM","WNI",null,null,null,null,0,0,null,null,null,null,null,null,null,null,null,null,null,null,null,null,null,null,null,null,null,null,null,null,null,null,null,null,null,null,null,null,null,null,null,null,null,null,null,null,null,null,null,null,null,null,null,null,null,null,null,null,null,null,null,null,null,null,null,null,null,null,null,null,"0",0]
[4715,null,null,null,0,0,null,null,null,null,"ISLAM","WNI",null,null,null,null,0,0,null,null,null,null,null,null,null,null,null,null,null,null,null,null,null,null,null,null,null,null,null,null,null,null,null,null,null,null,null,null,null,null,null,null,null,null,null,null,null,null,null,null,null,null,null,null,null,null,null,null,null,null,null,null,null,null,null,null,null,null,null,null,"0",0]
[4716,null,null,null,0,0,null,null,null,null,"ISLAM","WNI",null,null,null,null,0,0,null,null,null,null,null,null,null,null,null,null,null,null,null,null,null,null,null,null,null,null,null,null,null,null,null,null,null,null,null,null,null,null,null,null,null,null,null,null,null,null,null,null,null,null,null,null,null,null,null,null,null,null,null,null,null,null,null,null,null,null,null,null,"0",0]
[4717,null,null,null,0,0,null,null,null,null,"ISLAM","WNI",null,null,null,null,0,0,null,null,null,null,null,null,null,null,null,null,null,null,null,null,null,null,null,null,null,null,null,null,null,null,null,null,null,null,null,null,null,null,null,null,null,null,null,null,null,null,null,null,null,null,null,null,null,null,null,null,null,null,null,null,null,null,null,null,null,null,null,null,"0",0]
[4718,null,null,null,0,0,null,null,null,null,"ISLAM","WNI",null,null,null,null,0,0,null,null,null,null,null,null,null,null,null,null,null,null,null,null,null,null,null,null,null,null,null,null,null,null,null,null,null,null,null,null,null,null,null,null,null,null,null,null,null,null,null,null,null,null,null,null,null,null,null,null,null,null,null,null,null,null,null,null,null,null,null,null,"0",0]
[4719,null,null,null,0,0,null,null,null,null,"ISLAM","WNI",null,null,null,null,0,0,null,null,null,null,null,null,null,null,null,null,null,null,null,null,null,null,null,null,null,null,null,null,null,null,null,null,null,null,null,null,null,null,null,null,null,null,null,null,null,null,null,null,null,null,null,null,null,null,null,null,null,null,null,null,null,null,null,null,null,null,null,null,"0",0]
[4720,null,null,null,0,0,null,null,null,null,"ISLAM","WNI",null,null,null,null,0,0,null,null,null,null,null,null,null,null,null,null,null,null,null,null,null,null,null,null,null,null,null,null,null,null,null,null,null,null,null,null,null,null,null,null,null,null,null,null,null,null,null,null,null,null,null,null,null,null,null,null,null,null,null,null,null,null,null,null,null,null,null,null,"0",0]
[4721,null,null,null,0,0,null,null,null,null,"ISLAM","WNI",null,null,null,null,0,0,null,null,null,null,null,null,null,null,null,null,null,null,null,null,null,null,null,null,null,null,null,null,null,null,null,null,null,null,null,null,null,null,null,null,null,null,null,null,null,null,null,null,null,null,null,null,null,null,null,null,null,null,null,null,null,null,null,null,null,null,null,null,"0",0]
[4722,null,null,null,0,0,null,null,null,null,"ISLAM","WNI",null,null,null,null,0,0,null,null,null,null,null,null,null,null,null,null,null,null,null,null,null,null,null,null,null,null,null,null,null,null,null,null,null,null,null,null,null,null,null,null,null,null,null,null,null,null,null,null,null,null,null,null,null,null,null,null,null,null,null,null,null,null,null,null,null,null,null,null,"0",0]
[4723,null,null,null,0,0,null,null,null,null,"ISLAM","WNI",null,null,null,null,0,0,null,null,null,null,null,null,null,null,null,null,null,null,null,null,null,null,null,null,null,null,null,null,null,null,null,null,null,null,null,null,null,null,null,null,null,null,null,null,null,null,null,null,null,null,null,null,null,null,null,null,null,null,null,null,null,null,null,null,null,null,null,null,"0",0]
[4724,null,null,null,0,0,null,null,null,null,"ISLAM","WNI",null,null,null,null,0,0,null,null,null,null,null,null,null,null,null,null,null,null,null,null,null,null,null,null,null,null,null,null,null,null,null,null,null,null,null,null,null,null,null,null,null,null,null,null,null,null,null,null,null,null,null,null,null,null,null,null,null,null,null,null,null,null,null,null,null,null,null,null,"0",0]
[4725,null,null,null,0,0,null,null,null,null,"ISLAM","WNI",null,null,null,null,0,0,null,null,null,null,null,null,null,null,null,null,null,null,null,null,null,null,null,null,null,null,null,null,null,null,null,null,null,null,null,null,null,null,null,null,null,null,null,null,null,null,null,null,null,null,null,null,null,null,null,null,null,null,null,null,null,null,null,null,null,null,null,null,"0",0]
[4726,null,null,null,0,0,null,null,null,null,"ISLAM","WNI",null,null,null,null,0,0,null,null,null,null,null,null,null,null,null,null,null,null,null,null,null,null,null,null,null,null,null,null,null,null,null,null,null,null,null,null,null,null,null,null,null,null,null,null,null,null,null,null,null,null,null,null,null,null,null,null,null,null,null,null,null,null,null,null,null,null,null,null,"0",0]
[4727,null,null,null,0,0,null,null,null,null,"ISLAM","WNI",null,null,null,null,0,0,null,null,null,null,null,null,null,null,null,null,null,null,null,null,null,null,null,null,null,null,null,null,null,null,null,null,null,null,null,null,null,null,null,null,null,null,null,null,null,null,null,null,null,null,null,null,null,null,null,null,null,null,null,null,null,null,null,null,null,null,null,null,"0",0]
[4728,null,null,null,0,0,null,null,null,null,"ISLAM","WNI",null,null,null,null,0,0,null,null,null,null,null,null,null,null,null,null,null,null,null,null,null,null,null,null,null,null,null,null,null,null,null,null,null,null,null,null,null,null,null,null,null,null,null,null,null,null,null,null,null,null,null,null,null,null,null,null,null,null,null,null,null,null,null,null,null,null,null,null,"0",0]
[4729,null,null,null,0,0,null,null,null,null,"ISLAM","WNI",null,null,null,null,0,0,null,null,null,null,null,null,null,null,null,null,null,null,null,null,null,null,null,null,null,null,null,null,null,null,null,null,null,null,null,null,null,null,null,null,null,null,null,null,null,null,null,null,null,null,null,null,null,null,null,null,null,null,null,null,null,null,null,null,null,null,null,null,"0",0]
[4730,null,null,null,0,0,null,null,null,null,"ISLAM","WNI",null,null,null,null,0,0,null,null,null,null,null,null,null,null,null,null,null,null,null,null,null,null,null,null,null,null,null,null,null,null,null,null,null,null,null,null,null,null,null,null,null,null,null,null,null,null,null,null,null,null,null,null,null,null,null,null,null,null,null,null,null,null,null,null,null,null,null,null,"0",0]
[4731,null,null,null,0,0,null,null,null,null,"ISLAM","WNI",null,null,null,null,0,0,null,null,null,null,null,null,null,null,null,null,null,null,null,null,null,null,null,null,null,null,null,null,null,null,null,null,null,null,null,null,null,null,null,null,null,null,null,null,null,null,null,null,null,null,null,null,null,null,null,null,null,null,null,null,null,null,null,null,null,null,null,null,"0",0]
[4732,null,null,null,0,0,null,null,null,null,"ISLAM","WNI",null,null,null,null,0,0,null,null,null,null,null,null,null,null,null,null,null,null,null,null,null,null,null,null,null,null,null,null,null,null,null,null,null,null,null,null,null,null,null,null,null,null,null,null,null,null,null,null,null,null,null,null,null,null,null,null,null,null,null,null,null,null,null,null,null,null,null,null,"0",0]
[4733,null,null,null,0,0,null,null,null,null,"ISLAM","WNI",null,null,null,null,0,0,null,null,null,null,null,null,null,null,null,null,null,null,null,null,null,null,null,null,null,null,null,null,null,null,null,null,null,null,null,null,null,null,null,null,null,null,null,null,null,null,null,null,null,null,null,null,null,null,null,null,null,null,null,null,null,null,null,null,null,null,null,null,"0",0]
[4734,null,null,null,0,0,null,null,null,null,"ISLAM","WNI",null,null,null,null,0,0,null,null,null,null,null,null,null,null,null,null,null,null,null,null,null,null,null,null,null,null,null,null,null,null,null,null,null,null,null,null,null,null,null,null,null,null,null,null,null,null,null,null,null,null,null,null,null,null,null,null,null,null,null,null,null,null,null,null,null,null,null,null,"0",0]
[4735,null,null,null,0,0,null,null,null,null,"ISLAM","WNI",null,null,null,null,0,0,null,null,null,null,null,null,null,null,null,null,null,null,null,null,null,null,null,null,null,null,null,null,null,null,null,null,null,null,null,null,null,null,null,null,null,null,null,null,null,null,null,null,null,null,null,null,null,null,null,null,null,null,null,null,null,null,null,null,null,null,null,null,"0",0]
[4736,null,null,null,0,0,null,null,null,null,"ISLAM","WNI",null,null,null,null,0,0,null,null,null,null,null,null,null,null,null,null,null,null,null,null,null,null,null,null,null,null,null,null,null,null,null,null,null,null,null,null,null,null,null,null,null,null,null,null,null,null,null,null,null,null,null,null,null,null,null,null,null,null,null,null,null,null,null,null,null,null,null,null,"0",0]
[4737,null,null,null,0,0,null,null,null,null,"ISLAM","WNI",null,null,null,null,0,0,null,null,null,null,null,null,null,null,null,null,null,null,null,null,null,null,null,null,null,null,null,null,null,null,null,null,null,null,null,null,null,null,null,null,null,null,null,null,null,null,null,null,null,null,null,null,null,null,null,null,null,null,null,null,null,null,null,null,null,null,null,null,"0",0]
[4738,null,null,null,0,0,null,null,null,null,"ISLAM","WNI",null,null,null,null,0,0,null,null,null,null,null,null,null,null,null,null,null,null,null,null,null,null,null,null,null,null,null,null,null,null,null,null,null,null,null,null,null,null,null,null,null,null,null,null,null,null,null,null,null,null,null,null,null,null,null,null,null,null,null,null,null,null,null,null,null,null,null,null,"0",0]
[4739,null,null,null,0,0,null,null,null,null,"ISLAM","WNI",null,null,null,null,0,0,null,null,null,null,null,null,null,null,null,null,null,null,null,null,null,null,null,null,null,null,null,null,null,null,null,null,null,null,null,null,null,null,null,null,null,null,null,null,null,null,null,null,null,null,null,null,null,null,null,null,null,null,null,null,null,null,null,null,null,null,null,null,"0",0]
[4740,null,null,null,0,0,null,null,null,null,"ISLAM","WNI",null,null,null,null,0,0,null,null,null,null,null,null,null,null,null,null,null,null,null,null,null,null,null,null,null,null,null,null,null,null,null,null,null,null,null,null,null,null,null,null,null,null,null,null,null,null,null,null,null,null,null,null,null,null,null,null,null,null,null,null,null,null,null,null,null,null,null,null,"0",0]
[4741,null,null,null,0,0,null,null,null,null,"ISLAM","WNI",null,null,null,null,0,0,null,null,null,null,null,null,null,null,null,null,null,null,null,null,null,null,null,null,null,null,null,null,null,null,null,null,null,null,null,null,null,null,null,null,null,null,null,null,null,null,null,null,null,null,null,null,null,null,null,null,null,null,null,null,null,null,null,null,null,null,null,null,"0",0]
[4742,null,null,null,0,0,null,null,null,null,"ISLAM","WNI",null,null,null,null,0,0,null,null,null,null,null,null,null,null,null,null,null,null,null,null,null,null,null,null,null,null,null,null,null,null,null,null,null,null,null,null,null,null,null,null,null,null,null,null,null,null,null,null,null,null,null,null,null,null,null,null,null,null,null,null,null,null,null,null,null,null,null,null,"0",0]
[4743,null,null,null,0,0,null,null,null,null,"ISLAM","WNI",null,null,null,null,0,0,null,null,null,null,null,null,null,null,null,null,null,null,null,null,null,null,null,null,null,null,null,null,null,null,null,null,null,null,null,null,null,null,null,null,null,null,null,null,null,null,null,null,null,null,null,null,null,null,null,null,null,null,null,null,null,null,null,null,null,null,null,null,"0",0]
[4744,null,null,null,0,0,null,null,null,null,"ISLAM","WNI",null,null,null,null,0,0,null,null,null,null,null,null,null,null,null,null,null,null,null,null,null,null,null,null,null,null,null,null,null,null,null,null,null,null,null,null,null,null,null,null,null,null,null,null,null,null,null,null,null,null,null,null,null,null,null,null,null,null,null,null,null,null,null,null,null,null,null,null,"0",0]
[4745,null,null,null,0,0,null,null,null,null,"ISLAM","WNI",null,null,null,null,0,0,null,null,null,null,null,null,null,null,null,null,null,null,null,null,null,null,null,null,null,null,null,null,null,null,null,null,null,null,null,null,null,null,null,null,null,null,null,null,null,null,null,null,null,null,null,null,null,null,null,null,null,null,null,null,null,null,null,null,null,null,null,null,"0",0]
[4746,null,null,null,0,0,null,null,null,null,"ISLAM","WNI",null,null,null,null,{"$f":"AT751","v":0},{"$f":"AU751","v":0},null,null,null,null,null,null,null,null,null,null,null,null,null,null,null,null,null,null,null,null,null,null,null,null,null,null,null,null,null,null,null,null,null,null,null,null,null,null,null,null,null,null,null,null,null,null,null,null,null,null,null,null,null,null,null,null,null,null,null,null,null,null,"0",0]
[4747,null,null,null,0,0,null,null,null,null,"ISLAM","WNI",null,null,null,null,0,0,null,null,null,null,null,null,null,null,null,null,null,null,null,null,null,null,null,null,null,null,null,null,null,null,null,null,null,null,null,null,null,null,null,null,null,null,null,null,null,null,null,null,null,null,null,null,null,null,null,null,null,null,null,null,null,null,null,null,null,null,null,null,{"$f":"RIGHT(CD752,4)","v":"0"},{"$f":"PR752","v":0}]
[4748,null,null,null,0,0,null,null,null,null,"ISLAM","WNI",null,null,null,null,0,0,null,null,null,null,null,null,null,null,null,null,null,null,null,null,null,null,null,null,null,null,null,null,null,null,null,null,null,null,null,null,null,null,null,null,null,null,null,null,null,null,null,null,null,null,null,null,null,null,null,null,null,null,null,null,null,null,null,null,null,null,null,null,"0",0]
[4749,null,null,null,0,0,null,null,null,null,"ISLAM","WNI",null,null,null,null,0,0,null,null,null,null,null,null,null,null,null,null,null,null,null,null,null,null,null,null,null,null,null,null,null,null,null,null,null,null,null,null,null,null,null,null,null,null,null,null,null,null,null,null,null,null,null,null,null,null,null,null,null,null,null,null,null,null,null,null,null,null,null,null,"0",0]
[4750,null,null,null,0,0,null,null,null,null,"ISLAM","WNI",null,null,null,null,0,0,null,null,null,null,null,null,null,null,null,null,null,null,null,null,null,null,null,null,null,null,null,null,null,null,null,null,null,null,null,null,null,null,null,null,null,null,null,null,null,null,null,null,null,null,null,null,null,null,null,null,null,null,null,null,null,null,null,null,null,null,null,null,"0",0]
[4751,null,null,null,0,0,null,null,null,null,"ISLAM","WNI",null,null,null,null,0,0,null,null,null,null,null,null,null,null,null,null,null,null,null,null,null,null,null,null,null,null,null,null,null,null,null,null,null,null,null,null,null,null,null,null,null,null,null,null,null,null,null,null,null,null,null,null,null,null,null,null,null,null,null,null,null,null,null,null,null,null,null,null,"0",0]
[4752,null,null,null,0,0,null,null,null,null,"ISLAM","WNI",null,null,null,null,0,0,null,null,null,null,null,null,null,null,null,null,null,null,null,null,null,null,null,null,null,null,null,null,null,null,null,null,null,null,null,null,null,null,null,null,null,null,null,null,null,null,null,null,null,null,null,null,null,null,null,null,null,null,null,null,null,null,null,null,null,null,null,null,"0",0]
[4753,null,null,null,0,0,null,null,null,null,"ISLAM","WNI",null,null,null,null,0,0,null,null,null,null,null,null,null,null,null,null,null,null,null,null,null,null,null,null,null,null,null,null,null,null,null,null,null,null,null,null,null,null,null,null,null,null,null,null,null,null,null,null,null,null,null,null,null,null,null,null,null,null,null,null,null,null,null,null,null,null,null,null,"0",0]
[4754,null,null,null,0,0,null,null,null,null,"ISLAM","WNI",null,null,null,null,0,0,null,null,null,null,null,null,null,null,null,null,null,null,null,null,null,null,null,null,null,null,null,null,null,null,null,null,null,null,null,null,null,null,null,null,null,null,null,null,null,null,null,null,null,null,null,null,null,null,null,null,null,null,null,null,null,null,null,null,null,null,null,null,"0",0]
[4755,null,null,null,0,0,null,null,null,null,"ISLAM","WNI",null,null,null,null,0,0,null,null,null,null,null,null,null,null,null,null,null,null,null,null,null,null,null,null,null,null,null,null,null,null,null,null,null,null,null,null,null,null,null,null,null,null,null,null,null,null,null,null,null,null,null,null,null,null,null,null,null,null,null,null,null,null,null,null,null,null,null,null,"0",0]
[4756,null,null,null,0,0,null,null,null,null,"ISLAM","WNI",null,null,null,null,0,0,null,null,null,null,null,null,null,null,null,null,null,null,null,null,null,null,null,null,null,null,null,null,null,null,null,null,null,null,null,null,null,null,null,null,null,null,null,null,null,null,null,null,null,null,null,null,null,null,null,null,null,null,null,null,null,null,null,null,null,null,null,null,"0",0]
[4757,null,null,null,0,0,null,null,null,null,"ISLAM","WNI",null,null,null,null,0,0,null,null,null,null,null,null,null,null,null,null,null,null,null,null,null,null,null,null,null,null,null,null,null,null,null,null,null,null,null,null,null,null,null,null,null,null,null,null,null,null,null,null,null,null,null,null,null,null,null,null,null,null,null,null,null,null,null,null,null,null,null,null,"0",0]
[4758,null,null,null,0,0,null,null,null,null,"ISLAM","WNI",null,null,null,null,0,0,null,null,null,null,null,null,null,null,null,null,null,null,null,null,null,null,null,null,null,null,null,null,null,null,null,null,null,null,null,null,null,null,null,null,null,null,null,null,null,null,null,null,null,null,null,null,null,null,null,null,null,null,null,null,null,null,null,null,null,null,null,null,"0",0]
[4759,null,null,null,0,0,null,null,null,null,"ISLAM","WNI",null,null,null,null,0,0,null,null,null,null,null,null,null,null,null,null,null,null,null,null,null,null,null,null,null,null,null,null,null,null,null,null,null,null,null,null,null,null,null,null,null,null,null,null,null,null,null,null,null,null,null,null,null,null,null,null,null,null,null,null,null,null,null,null,null,null,null,null,"0",0]
[4760,null,null,null,0,0,null,null,null,null,"ISLAM","WNI",null,null,null,null,0,0,null,null,null,null,null,null,null,null,null,null,null,null,null,null,null,null,null,null,null,null,null,null,null,null,null,null,null,null,null,null,null,null,null,null,null,null,null,null,null,null,null,null,null,null,null,null,null,null,null,null,null,null,null,null,null,null,null,null,null,null,null,null,"0",0]
[4761,null,null,null,0,0,null,null,null,null,"ISLAM","WNI",null,null,null,null,0,0,null,null,null,null,null,null,null,null,null,null,null,null,null,null,null,null,null,null,null,null,null,null,null,null,null,null,null,null,null,null,null,null,null,null,null,null,null,null,null,null,null,null,null,null,null,null,null,null,null,null,null,null,null,null,null,null,null,null,null,null,null,null,"0",0]
[4762,null,null,null,0,0,null,null,null,null,"ISLAM","WNI",null,null,null,null,0,0,null,null,null,null,null,null,null,null,null,null,null,null,null,null,null,null,null,null,null,null,null,null,null,null,null,null,null,null,null,null,null,null,null,null,null,null,null,null,null,null,null,null,null,null,null,null,null,null,null,null,null,null,null,null,null,null,null,null,null,null,null,null,"0",0]
[4763,null,null,null,0,0,null,null,null,null,"ISLAM","WNI",null,null,null,null,0,0,null,null,null,null,null,null,null,null,null,null,null,null,null,null,null,null,null,null,null,null,null,null,null,null,null,null,null,null,null,null,null,null,null,null,null,null,null,null,null,null,null,null,null,null,null,null,null,null,null,null,null,null,null,null,null,null,null,null,null,null,null,null,"0",0]
[4764,null,null,null,0,0,null,null,null,null,"ISLAM","WNI",null,null,null,null,0,0,null,null,null,null,null,null,null,null,null,null,null,null,null,null,null,null,null,null,null,null,null,null,null,null,null,null,null,null,null,null,null,null,null,null,null,null,null,null,null,null,null,null,null,null,null,null,null,null,null,null,null,null,null,null,null,null,null,null,null,null,null,null,"0",0]
[4765,null,null,null,0,0,null,null,null,null,"ISLAM","WNI",null,null,null,null,0,0,null,null,null,null,null,null,null,null,null,null,null,null,null,null,null,null,null,null,null,null,null,null,null,null,null,null,null,null,null,null,null,null,null,null,null,null,null,null,null,null,null,null,null,null,null,null,null,null,null,null,null,null,null,null,null,null,null,null,null,null,null,null,"0",0]
[4766,null,null,null,0,0,null,null,null,null,"ISLAM","WNI",null,null,null,null,0,0,null,null,null,null,null,null,null,null,null,null,null,null,null,null,null,null,null,null,null,null,null,null,null,null,null,null,null,null,null,null,null,null,null,null,null,null,null,null,null,null,null,null,null,null,null,null,null,null,null,null,null,null,null,null,null,null,null,null,null,null,null,null,"0",0]
[4767,null,null,null,0,0,null,null,null,null,"ISLAM","WNI",null,null,null,null,0,0,null,null,null,null,null,null,null,null,null,null,null,null,null,null,null,null,null,null,null,null,null,null,null,null,null,null,null,null,null,null,null,null,null,null,null,null,null,null,null,null,null,null,null,null,null,null,null,null,null,null,null,null,null,null,null,null,null,null,null,null,null,null,"0",0]
[4768,null,null,null,0,0,null,null,null,null,"ISLAM","WNI",null,null,null,null,0,0,null,null,null,null,null,null,null,null,null,null,null,null,null,null,null,null,null,null,null,null,null,null,null,null,null,null,null,null,null,null,null,null,null,null,null,null,null,null,null,null,null,null,null,null,null,null,null,null,null,null,null,null,null,null,null,null,null,null,null,null,null,null,"0",0]
[4769,null,null,null,0,0,null,null,null,null,"ISLAM","WNI",null,null,null,null,0,0,null,null,null,null,null,null,null,null,null,null,null,null,null,null,null,null,null,null,null,null,null,null,null,null,null,null,null,null,null,null,null,null,null,null,null,null,null,null,null,null,null,null,null,null,null,null,null,null,null,null,null,null,null,null,null,null,null,null,null,null,null,null,"0",0]
[4770,null,null,null,0,0,null,null,null,null,"ISLAM","WNI",null,null,null,null,0,0,null,null,null,null,null,null,null,null,null,null,null,null,null,null,null,null,null,null,null,null,null,null,null,null,null,null,null,null,null,null,null,null,null,null,null,null,null,null,null,null,null,null,null,null,null,null,null,null,null,null,null,null,null,null,null,null,null,null,null,null,null,null,"0",0]
[4771,null,null,null,{"$f":"AQ776","v":0},{"$f":"QG776","v":0},null,null,null,null,"ISLAM","WNI",null,null,null,null,0,0,null,null,null,null,null,null,null,null,null,null,null,null,null,null,null,null,null,null,null,null,null,null,null,null,null,null,null,null,null,null,null,null,null,null,null,null,null,null,null,null,null,null,null,null,null,null,null,null,null,null,null,null,null,null,null,null,null,null,null,null,null,null,"0",0]
[4772,null,null,null,0,0,null,null,null,null,"ISLAM","WNI",null,null,null,null,0,0,null,null,null,null,null,null,null,null,null,null,null,null,null,null,null,null,null,null,null,null,null,null,null,null,null,null,null,null,null,null,null,null,null,null,null,null,null,null,null,null,null,null,null,null,null,null,null,null,null,null,null,null,null,null,null,null,null,null,null,null,null,null,"0",0]
[4773,null,null,null,0,0,null,null,null,null,"ISLAM","WNI",null,null,null,null,0,0,null,null,null,null,null,null,null,null,null,null,null,null,null,null,null,null,null,null,null,null,null,null,null,null,null,null,null,null,null,null,null,null,null,null,null,null,null,null,null,null,null,null,null,null,null,null,null,null,null,null,null,null,null,null,null,null,null,null,null,null,null,null,"0",0]
[4774,null,null,null,0,0,null,null,null,null,"ISLAM","WNI",null,null,null,null,0,0,null,null,null,null,null,null,null,null,null,null,null,null,null,null,null,null,null,null,null,null,null,null,null,null,null,null,null,null,null,null,null,null,null,null,null,null,null,null,null,null,null,null,null,null,null,null,null,null,null,null,null,null,null,null,null,null,null,null,null,null,null,null,"0",0]
[4775,null,null,null,0,0,null,null,null,null,"ISLAM","WNI",null,null,null,null,0,0,null,null,null,null,null,null,null,null,null,null,null,null,null,null,null,null,null,null,null,null,null,null,null,null,null,null,null,null,null,null,null,null,null,null,null,null,null,null,null,null,null,null,null,null,null,null,null,null,null,null,null,null,null,null,null,null,null,null,null,null,null,null,"0",0]
[4776,null,null,null,0,0,null,null,null,null,"ISLAM","WNI",null,null,null,null,0,0,null,null,null,null,null,null,null,null,null,null,null,null,null,null,null,null,null,null,null,null,null,null,null,null,null,null,null,null,null,null,null,null,null,null,null,null,null,null,null,null,null,null,null,null,null,null,null,null,null,null,null,null,null,null,null,null,null,null,null,null,null,null,"0",0]
[4777,null,null,null,0,0,null,null,null,null,"ISLAM","WNI",null,null,null,null,0,0,null,null,null,null,null,null,null,null,null,null,null,null,null,null,null,null,null,null,null,null,null,null,null,null,null,null,null,null,null,null,null,null,null,null,null,null,null,null,null,null,null,null,null,null,null,null,null,null,null,null,null,null,null,null,null,null,null,null,null,null,null,null,"0",0]
[4778,null,null,null,0,0,null,null,null,null,"ISLAM","WNI",null,null,null,null,0,0,null,null,null,null,null,null,null,null,null,null,null,null,null,null,null,null,null,null,null,null,null,null,null,null,null,null,null,null,null,null,null,null,null,null,null,null,null,null,null,null,null,null,null,null,null,null,null,null,null,null,null,null,null,null,null,null,null,null,null,null,null,null,"0",0]
[4779,null,null,null,0,0,null,null,null,null,"ISLAM","WNI",null,null,null,null,0,0,null,null,null,null,null,null,null,null,null,null,null,null,null,null,null,null,null,null,null,null,null,null,null,null,null,null,null,null,null,null,null,null,null,null,null,null,null,null,null,null,null,null,null,null,null,null,null,null,null,null,null,null,null,null,null,null,null,null,null,null,null,null,"0",0]
[4780,null,null,null,0,0,null,null,null,null,"ISLAM","WNI",null,null,null,null,0,0,null,null,null,null,null,null,null,null,null,null,null,null,null,null,null,null,null,null,null,null,null,null,null,null,null,null,null,null,null,null,null,null,null,null,null,null,null,null,null,null,null,null,null,null,null,null,null,null,null,null,null,null,null,null,null,null,null,null,null,null,null,null,"0",0]
[4781,null,null,null,0,0,null,null,null,null,"ISLAM","WNI",null,null,null,null,0,0,null,null,null,null,null,null,null,null,null,null,null,null,null,null,null,null,null,null,null,null,null,null,null,null,null,null,null,null,null,null,null,null,null,null,null,null,null,null,null,null,null,null,null,null,null,null,null,null,null,null,null,null,null,null,null,null,null,null,null,null,null,null,"0",0]
[4782,null,null,null,0,0,null,null,null,null,"ISLAM","WNI",null,null,null,null,0,0,null,null,null,null,null,null,null,null,null,null,null,null,null,null,null,null,null,null,null,null,null,null,null,null,null,null,null,null,null,null,null,null,null,null,null,null,null,null,null,null,null,null,null,null,null,null,null,null,null,null,null,null,null,null,null,null,null,null,null,null,null,null,"0",0]
[4783,null,null,null,0,0,null,null,null,null,"ISLAM","WNI",null,null,null,null,0,0,null,null,null,null,null,null,null,null,null,null,null,null,null,null,null,null,null,null,null,null,null,null,null,null,null,null,null,null,null,null,null,null,null,null,null,null,null,null,null,null,null,null,null,null,null,null,null,null,null,null,null,null,null,null,null,null,null,null,null,null,null,null,"0",0]
[4784,null,null,null,0,0,null,null,null,null,"ISLAM","WNI",null,null,null,null,0,0,null,null,null,null,null,null,null,null,null,null,null,null,null,null,null,null,null,null,null,null,null,null,null,null,null,null,null,null,null,null,null,null,null,null,null,null,null,null,null,null,null,null,null,null,null,null,null,null,null,null,null,null,null,null,null,null,null,null,null,null,null,null,"0",0]
[4785,null,null,null,0,0,null,null,null,null,"ISLAM","WNI",null,null,null,null,0,0,null,null,null,null,null,null,null,null,null,null,null,null,null,null,null,null,null,null,null,null,null,null,null,null,null,null,null,null,null,null,null,null,null,null,null,null,null,null,null,null,null,null,null,null,null,null,null,null,null,null,null,null,null,null,null,null,null,null,null,null,null,null,"0",0]
[4786,null,null,null,0,0,null,null,null,null,"ISLAM","WNI",null,null,null,null,0,0,null,null,null,null,null,null,null,null,null,null,null,null,null,null,null,null,null,null,null,null,null,null,null,null,null,null,null,null,null,null,null,null,null,null,null,null,null,null,null,null,null,null,null,null,null,null,null,null,null,null,null,null,null,null,null,null,null,null,null,null,null,null,"0",0]
[4787,null,null,null,0,0,null,null,null,null,"ISLAM","WNI",null,null,null,null,0,0,null,null,null,null,null,null,null,null,null,null,null,null,null,null,null,null,null,null,null,null,null,null,null,null,null,null,null,null,null,null,null,null,null,null,null,null,null,null,null,null,null,null,null,null,null,null,null,null,null,null,null,null,null,null,null,null,null,null,null,null,null,null,"0",0]
[4788,null,null,null,0,0,null,null,null,null,"ISLAM","WNI",null,null,null,null,0,0,null,null,null,null,null,null,null,null,null,null,null,null,null,null,null,null,null,null,null,null,null,null,null,null,null,null,null,null,null,null,null,null,null,null,null,null,null,null,null,null,null,null,null,null,null,null,null,null,null,null,null,null,null,null,null,null,null,null,null,null,null,null,"0",0]
[4789,null,null,null,0,0,null,null,null,null,"ISLAM","WNI",null,null,null,null,0,0,null,null,null,null,null,null,null,null,null,null,null,null,null,null,null,null,null,null,null,null,null,null,null,null,null,null,null,null,null,null,null,null,null,null,null,null,null,null,null,null,null,null,null,null,null,null,null,null,null,null,null,null,null,null,null,null,null,null,null,null,null,null,"0",0]
[4790,null,null,null,0,0,null,null,null,null,"ISLAM","WNI",null,null,null,null,0,0,null,null,null,null,null,null,null,null,null,null,null,null,null,null,null,null,null,null,null,null,null,null,null,null,null,null,null,null,null,null,null,null,null,null,null,null,null,null,null,null,null,null,null,null,null,null,null,null,null,null,null,null,null,null,null,null,null,null,null,null,null,null,"0",0]
[4791,null,null,null,0,0,null,null,null,null,"ISLAM","WNI",null,null,null,null,0,0,null,null,null,null,null,null,null,null,null,null,null,null,null,null,null,null,null,null,null,null,null,null,null,null,null,null,null,null,null,null,null,null,null,null,null,null,null,null,null,null,null,null,null,null,null,null,null,null,null,null,null,null,null,null,null,null,null,null,null,null,null,null,"0",0]
[4792,null,null,null,0,0,null,null,null,null,"ISLAM","WNI",null,null,null,null,0,0,null,null,null,null,null,null,null,null,null,null,null,null,null,null,null,null,null,null,null,null,null,null,null,null,null,null,null,null,null,null,null,null,null,null,null,null,null,null,null,null,null,null,null,null,null,null,null,null,null,null,null,null,null,null,null,null,null,null,null,null,null,null,"0",0]
[4793,null,null,null,0,0,null,null,null,null,"ISLAM","WNI",null,null,null,null,0,0,null,null,null,null,null,null,null,null,null,null,null,null,null,null,null,null,null,null,null,null,null,null,null,null,null,null,null,null,null,null,null,null,null,null,null,null,null,null,null,null,null,null,null,null,null,null,null,null,null,null,null,null,null,null,null,null,null,null,null,null,null,null,"0",0]
[4794,null,null,null,0,0,null,null,null,null,"ISLAM","WNI",null,null,null,null,0,0,null,null,null,null,null,null,null,null,null,null,null,null,null,null,null,null,null,null,null,null,null,null,null,null,null,null,null,null,null,null,null,null,null,null,null,null,null,null,null,null,null,null,null,null,null,null,null,null,null,null,null,null,null,null,null,null,null,null,null,null,null,null,"0",0]
[4795,null,null,null,0,0,null,null,null,null,"ISLAM","WNI",null,null,null,null,0,0,null,null,null,null,null,null,null,null,null,null,null,null,null,null,null,null,null,null,null,null,null,null,null,null,null,null,null,null,null,null,null,null,null,null,null,null,null,null,null,null,null,null,null,null,null,null,null,null,null,null,null,null,null,null,null,null,null,null,null,null,null,null,"0",0]
[4796,null,null,null,0,0,null,null,null,null,"ISLAM","WNI",null,null,null,null,0,0,null,null,null,null,null,null,null,null,null,null,null,null,null,null,null,null,null,null,null,null,null,null,null,null,null,null,null,null,null,null,null,null,null,null,null,null,null,null,null,null,null,null,null,null,null,null,null,null,null,null,null,null,null,null,null,null,null,null,null,null,null,null,"0",0]
[4797,null,null,null,0,0,null,null,null,null,"ISLAM","WNI",null,null,null,null,0,0,null,null,null,null,null,null,null,null,null,null,null,null,null,null,null,null,null,null,null,null,null,null,null,null,null,null,null,null,null,null,null,null,null,null,null,null,null,null,null,null,null,null,null,null,null,null,null,null,null,null,null,null,null,null,null,null,null,null,null,null,null,null,"0",0]
[4798,null,null,null,0,0,null,null,null,null,"ISLAM","WNI",null,null,null,null,0,0,null,null,null,null,null,null,null,null,null,null,null,null,null,null,null,null,null,null,null,null,null,null,null,null,null,null,null,null,null,null,null,null,null,null,null,null,null,null,null,null,null,null,null,null,null,null,null,null,null,null,null,null,null,null,null,null,null,null,null,null,null,null,"0",0]
[4799,null,null,null,0,0,null,null,null,null,"ISLAM","WNI",null,null,null,null,0,0,null,null,null,null,null,null,null,null,null,null,null,null,null,null,null,null,null,null,null,null,null,null,null,null,null,null,null,null,null,null,null,null,null,null,null,null,null,null,null,null,null,null,null,null,null,null,null,null,null,null,null,null,null,null,null,null,null,null,null,null,null,null,"0",0]
[4800,null,null,null,0,0,null,null,null,null,"ISLAM","WNI",null,null,null,null,0,0,null,null,null,null,null,null,null,null,null,null,null,null,null,null,null,null,null,null,null,null,null,null,null,null,null,null,null,null,null,null,null,null,null,null,null,null,null,null,null,null,null,null,null,null,null,null,null,null,null,null,null,null,null,null,null,null,null,null,null,null,null,null,"0",0]
[4801,null,null,null,0,0,null,null,null,null,"ISLAM","WNI",null,null,null,null,0,0,null,null,null,null,null,null,null,null,null,null,null,null,null,null,null,null,null,null,null,null,null,null,null,null,null,null,null,null,null,null,null,null,null,null,null,null,null,null,null,null,null,null,null,null,null,null,null,null,null,null,null,null,null,null,null,null,null,null,null,null,null,null,"0",0]
[4802,null,null,null,0,0,null,null,null,null,"ISLAM","WNI",null,null,null,null,0,0,null,null,null,null,null,null,null,null,null,null,null,null,null,null,null,null,null,null,null,null,null,null,null,null,null,null,null,null,null,null,null,null,null,null,null,null,null,null,null,null,null,null,null,null,null,null,null,null,null,null,null,null,null,null,null,null,null,null,null,null,null,null,"0",0]
[4803,null,null,null,0,0,null,null,null,null,"ISLAM","WNI",null,null,null,null,0,0,null,null,null,null,null,null,null,null,null,null,null,null,null,null,null,null,null,null,null,null,null,null,null,null,null,null,null,null,null,null,null,null,null,null,null,null,null,null,null,null,null,null,null,null,null,null,null,null,null,null,null,null,null,null,null,null,null,null,null,null,null,null,"0",0]
[4804,null,null,null,0,0,null,null,null,null,"ISLAM","WNI",null,null,null,null,0,0,null,null,null,null,null,null,null,null,null,null,null,null,null,null,null,null,null,null,null,null,null,null,null,null,null,null,null,null,null,null,null,null,null,null,null,null,null,null,null,null,null,null,null,null,null,null,null,null,null,null,null,null,null,null,null,null,null,null,null,null,null,null,"0",0]
[4805,null,null,null,0,0,null,null,null,null,"ISLAM","WNI",null,null,null,null,0,0,null,null,null,null,null,null,null,null,null,null,null,null,null,null,null,null,null,null,null,null,null,null,null,null,null,null,null,null,null,null,null,null,null,null,null,null,null,null,null,null,null,null,null,null,null,null,null,null,null,null,null,null,null,null,null,null,null,null,null,null,null,null,"0",0]
[4806,null,null,null,0,0,null,null,null,null,"ISLAM","WNI",null,null,null,null,0,0,null,null,null,null,null,null,null,null,null,null,null,null,null,null,null,null,null,null,null,null,null,null,null,null,null,null,null,null,null,null,null,null,null,null,null,null,null,null,null,null,null,null,null,null,null,null,null,null,null,null,null,null,null,null,null,null,null,null,null,null,null,null,"0",0]
[4807,null,null,null,0,0,null,null,null,null,"ISLAM","WNI",null,null,null,null,0,0,null,null,null,null,null,null,null,null,null,null,null,null,null,null,null,null,null,null,null,null,null,null,null,null,null,null,null,null,null,null,null,null,null,null,null,null,null,null,null,null,null,null,null,null,null,null,null,null,null,null,null,null,null,null,null,null,null,null,null,null,null,null,"0",0]
[4808,null,null,null,0,0,null,null,null,null,"ISLAM","WNI",null,null,null,null,0,0,null,null,null,null,null,null,null,null,null,null,null,null,null,null,null,null,null,null,null,null,null,null,null,null,null,null,null,null,null,null,null,null,null,null,null,null,null,null,null,null,null,null,null,null,null,null,null,null,null,null,null,null,null,null,null,null,null,null,null,null,null,null,"0",0]
[4809,null,null,null,0,0,null,null,null,null,"ISLAM","WNI",null,null,null,null,0,0,null,null,null,null,null,null,null,null,null,null,null,null,null,null,null,null,null,null,null,null,null,null,null,null,null,null,null,null,null,null,null,null,null,null,null,null,null,null,null,null,null,null,null,null,null,null,null,null,null,null,null,null,null,null,null,null,null,null,null,null,null,null,"0",0]
[4810,null,null,null,0,0,null,null,null,null,"ISLAM","WNI",null,null,null,null,{"$f":"AT815","v":0},{"$f":"AU815","v":0},null,null,null,null,null,null,null,null,null,null,null,null,null,null,null,null,null,null,null,null,null,null,null,null,null,null,null,null,null,null,null,null,null,null,null,null,null,null,null,null,null,null,null,null,null,null,null,null,null,null,null,null,null,null,null,null,null,null,null,null,null,null,"0",0]
[4811,null,null,null,0,0,null,null,null,null,"ISLAM","WNI",null,null,null,null,0,0,null,null,null,null,null,null,null,null,null,null,null,null,null,null,null,null,null,null,null,null,null,null,null,null,null,null,null,null,null,null,null,null,null,null,null,null,null,null,null,null,null,null,null,null,null,null,null,null,null,null,null,null,null,null,null,null,null,null,null,null,null,null,{"$f":"RIGHT(CD816,4)","v":"0"},{"$f":"PR816","v":0}]
[4812,null,null,null,0,0,null,null,null,null,"ISLAM","WNI",null,null,null,null,0,0,null,null,null,null,null,null,null,null,null,null,null,null,null,null,null,null,null,null,null,null,null,null,null,null,null,null,null,null,null,null,null,null,null,null,null,null,null,null,null,null,null,null,null,null,null,null,null,null,null,null,null,null,null,null,null,null,null,null,null,null,null,null,"0",0]
[4813,null,null,null,0,0,null,null,null,null,"ISLAM","WNI",null,null,null,null,0,0,null,null,null,null,null,null,null,null,null,null,null,null,null,null,null,null,null,null,null,null,null,null,null,null,null,null,null,null,null,null,null,null,null,null,null,null,null,null,null,null,null,null,null,null,null,null,null,null,null,null,null,null,null,null,null,null,null,null,null,null,null,null,"0",0]
[4814,null,null,null,0,0,null,null,null,null,"ISLAM","WNI",null,null,null,null,0,0,null,null,null,null,null,null,null,null,null,null,null,null,null,null,null,null,null,null,null,null,null,null,null,null,null,null,null,null,null,null,null,null,null,null,null,null,null,null,null,null,null,null,null,null,null,null,null,null,null,null,null,null,null,null,null,null,null,null,null,null,null,null,"0",0]
[4815,null,null,null,0,0,null,null,null,null,"ISLAM","WNI",null,null,null,null,0,0,null,null,null,null,null,null,null,null,null,null,null,null,null,null,null,null,null,null,null,null,null,null,null,null,null,null,null,null,null,null,null,null,null,null,null,null,null,null,null,null,null,null,null,null,null,null,null,null,null,null,null,null,null,null,null,null,null,null,null,null,null,null,"0",0]
[4816,null,null,null,0,0,null,null,null,null,"ISLAM","WNI",null,null,null,null,0,0,null,null,null,null,null,null,null,null,null,null,null,null,null,null,null,null,null,null,null,null,null,null,null,null,null,null,null,null,null,null,null,null,null,null,null,null,null,null,null,null,null,null,null,null,null,null,null,null,null,null,null,null,null,null,null,null,null,null,null,null,null,null,"0",0]
[4817,null,null,null,0,0,null,null,null,null,"ISLAM","WNI",null,null,null,null,0,0,null,null,null,null,null,null,null,null,null,null,null,null,null,null,null,null,null,null,null,null,null,null,null,null,null,null,null,null,null,null,null,null,null,null,null,null,null,null,null,null,null,null,null,null,null,null,null,null,null,null,null,null,null,null,null,null,null,null,null,null,null,null,"0",0]
[4818,null,null,null,0,0,null,null,null,null,"ISLAM","WNI",null,null,null,null,0,0,null,null,null,null,null,null,null,null,null,null,null,null,null,null,null,null,null,null,null,null,null,null,null,null,null,null,null,null,null,null,null,null,null,null,null,null,null,null,null,null,null,null,null,null,null,null,null,null,null,null,null,null,null,null,null,null,null,null,null,null,null,null,"0",0]
[4819,null,null,null,0,0,null,null,null,null,"ISLAM","WNI",null,null,null,null,0,0,null,null,null,null,null,null,null,null,null,null,null,null,null,null,null,null,null,null,null,null,null,null,null,null,null,null,null,null,null,null,null,null,null,null,null,null,null,null,null,null,null,null,null,null,null,null,null,null,null,null,null,null,null,null,null,null,null,null,null,null,null,null,"0",0]
[4820,null,null,null,0,0,null,null,null,null,"ISLAM","WNI",null,null,null,null,0,0,null,null,null,null,null,null,null,null,null,null,null,null,null,null,null,null,null,null,null,null,null,null,null,null,null,null,null,null,null,null,null,null,null,null,null,null,null,null,null,null,null,null,null,null,null,null,null,null,null,null,null,null,null,null,null,null,null,null,null,null,null,null,"0",0]
[4821,null,null,null,0,0,null,null,null,null,"ISLAM","WNI",null,null,null,null,0,0,null,null,null,null,null,null,null,null,null,null,null,null,null,null,null,null,null,null,null,null,null,null,null,null,null,null,null,null,null,null,null,null,null,null,null,null,null,null,null,null,null,null,null,null,null,null,null,null,null,null,null,null,null,null,null,null,null,null,null,null,null,null,"0",0]
[4822,null,null,null,0,0,null,null,null,null,"ISLAM","WNI",null,null,null,null,0,0,null,null,null,null,null,null,null,null,null,null,null,null,null,null,null,null,null,null,null,null,null,null,null,null,null,null,null,null,null,null,null,null,null,null,null,null,null,null,null,null,null,null,null,null,null,null,null,null,null,null,null,null,null,null,null,null,null,null,null,null,null,null,"0",0]
[4823,null,null,null,0,0,null,null,null,null,"ISLAM","WNI",null,null,null,null,0,0,null,null,null,null,null,null,null,null,null,null,null,null,null,null,null,null,null,null,null,null,null,null,null,null,null,null,null,null,null,null,null,null,null,null,null,null,null,null,null,null,null,null,null,null,null,null,null,null,null,null,null,null,null,null,null,null,null,null,null,null,null,null,"0",0]
[4824,null,null,null,0,0,null,null,null,null,"ISLAM","WNI",null,null,null,null,0,0,null,null,null,null,null,null,null,null,null,null,null,null,null,null,null,null,null,null,null,null,null,null,null,null,null,null,null,null,null,null,null,null,null,null,null,null,null,null,null,null,null,null,null,null,null,null,null,null,null,null,null,null,null,null,null,null,null,null,null,null,null,null,"0",0]
[4825,null,null,null,0,0,null,null,null,null,"ISLAM","WNI",null,null,null,null,0,0,null,null,null,null,null,null,null,null,null,null,null,null,null,null,null,null,null,null,null,null,null,null,null,null,null,null,null,null,null,null,null,null,null,null,null,null,null,null,null,null,null,null,null,null,null,null,null,null,null,null,null,null,null,null,null,null,null,null,null,null,null,null,"0",0]
[4826,null,null,null,0,0,null,null,null,null,"ISLAM","WNI",null,null,null,null,0,0,null,null,null,null,null,null,null,null,null,null,null,null,null,null,null,null,null,null,null,null,null,null,null,null,null,null,null,null,null,null,null,null,null,null,null,null,null,null,null,null,null,null,null,null,null,null,null,null,null,null,null,null,null,null,null,null,null,null,null,null,null,null,"0",0]
[4827,null,null,null,0,0,null,null,null,null,"ISLAM","WNI",null,null,null,null,0,0,null,null,null,null,null,null,null,null,null,null,null,null,null,null,null,null,null,null,null,null,null,null,null,null,null,null,null,null,null,null,null,null,null,null,null,null,null,null,null,null,null,null,null,null,null,null,null,null,null,null,null,null,null,null,null,null,null,null,null,null,null,null,"0",0]
[4828,null,null,null,0,0,null,null,null,null,"ISLAM","WNI",null,null,null,null,0,0,null,null,null,null,null,null,null,null,null,null,null,null,null,null,null,null,null,null,null,null,null,null,null,null,null,null,null,null,null,null,null,null,null,null,null,null,null,null,null,null,null,null,null,null,null,null,null,null,null,null,null,null,null,null,null,null,null,null,null,null,null,null,"0",0]
[4829,null,null,null,0,0,null,null,null,null,"ISLAM","WNI",null,null,null,null,0,0,null,null,null,null,null,null,null,null,null,null,null,null,null,null,null,null,null,null,null,null,null,null,null,null,null,null,null,null,null,null,null,null,null,null,null,null,null,null,null,null,null,null,null,null,null,null,null,null,null,null,null,null,null,null,null,null,null,null,null,null,null,null,"0",0]
[4830,null,null,null,0,0,null,null,null,null,"ISLAM","WNI",null,null,null,null,0,0,null,null,null,null,null,null,null,null,null,null,null,null,null,null,null,null,null,null,null,null,null,null,null,null,null,null,null,null,null,null,null,null,null,null,null,null,null,null,null,null,null,null,null,null,null,null,null,null,null,null,null,null,null,null,null,null,null,null,null,null,null,null,"0",0]
[4831,null,null,null,0,0,null,null,null,null,"ISLAM","WNI",null,null,null,null,0,0,null,null,null,null,null,null,null,null,null,null,null,null,null,null,null,null,null,null,null,null,null,null,null,null,null,null,null,null,null,null,null,null,null,null,null,null,null,null,null,null,null,null,null,null,null,null,null,null,null,null,null,null,null,null,null,null,null,null,null,null,null,null,"0",0]
[4832,null,null,null,0,0,null,null,null,null,"ISLAM","WNI",null,null,null,null,0,0,null,null,null,null,null,null,null,null,null,null,null,null,null,null,null,null,null,null,null,null,null,null,null,null,null,null,null,null,null,null,null,null,null,null,null,null,null,null,null,null,null,null,null,null,null,null,null,null,null,null,null,null,null,null,null,null,null,null,null,null,null,null,"0",0]
[4833,null,null,null,0,0,null,null,null,null,"ISLAM","WNI",null,null,null,null,0,0,null,null,null,null,null,null,null,null,null,null,null,null,null,null,null,null,null,null,null,null,null,null,null,null,null,null,null,null,null,null,null,null,null,null,null,null,null,null,null,null,null,null,null,null,null,null,null,null,null,null,null,null,null,null,null,null,null,null,null,null,null,null,"0",0]
[4834,null,null,null,0,0,null,null,null,null,"ISLAM","WNI",null,null,null,null,0,0,null,null,null,null,null,null,null,null,null,null,null,null,null,null,null,null,null,null,null,null,null,null,null,null,null,null,null,null,null,null,null,null,null,null,null,null,null,null,null,null,null,null,null,null,null,null,null,null,null,null,null,null,null,null,null,null,null,null,null,null,null,null,"0",0]
[4835,null,null,null,{"$f":"AQ840","v":0},{"$f":"QG840","v":0},null,null,null,null,"ISLAM","WNI",null,null,null,null,0,0,null,null,null,null,null,null,null,null,null,null,null,null,null,null,null,null,null,null,null,null,null,null,null,null,null,null,null,null,null,null,null,null,null,null,null,null,null,null,null,null,null,null,null,null,null,null,null,null,null,null,null,null,null,null,null,null,null,null,null,null,null,null,"0",0]
[4836,null,null,null,0,0,null,null,null,null,"ISLAM","WNI",null,null,null,null,0,0,null,null,null,null,null,null,null,null,null,null,null,null,null,null,null,null,null,null,null,null,null,null,null,null,null,null,null,null,null,null,null,null,null,null,null,null,null,null,null,null,null,null,null,null,null,null,null,null,null,null,null,null,null,null,null,null,null,null,null,null,null,null,"0",0]
[4837,null,null,null,0,0,null,null,null,null,"ISLAM","WNI",null,null,null,null,0,0,null,null,null,null,null,null,null,null,null,null,null,null,null,null,null,null,null,null,null,null,null,null,null,null,null,null,null,null,null,null,null,null,null,null,null,null,null,null,null,null,null,null,null,null,null,null,null,null,null,null,null,null,null,null,null,null,null,null,null,null,null,null,"0",0]
[4838,null,null,null,0,0,null,null,null,null,"ISLAM","WNI",null,null,null,null,0,0,null,null,null,null,null,null,null,null,null,null,null,null,null,null,null,null,null,null,null,null,null,null,null,null,null,null,null,null,null,null,null,null,null,null,null,null,null,null,null,null,null,null,null,null,null,null,null,null,null,null,null,null,null,null,null,null,null,null,null,null,null,null,"0",0]
[4839,null,null,null,0,0,null,null,null,null,"ISLAM","WNI",null,null,null,null,0,0,null,null,null,null,null,null,null,null,null,null,null,null,null,null,null,null,null,null,null,null,null,null,null,null,null,null,null,null,null,null,null,null,null,null,null,null,null,null,null,null,null,null,null,null,null,null,null,null,null,null,null,null,null,null,null,null,null,null,null,null,null,null,"0",0]
[4840,null,null,null,0,0,null,null,null,null,"ISLAM","WNI",null,null,null,null,0,0,null,null,null,null,null,null,null,null,null,null,null,null,null,null,null,null,null,null,null,null,null,null,null,null,null,null,null,null,null,null,null,null,null,null,null,null,null,null,null,null,null,null,null,null,null,null,null,null,null,null,null,null,null,null,null,null,null,null,null,null,null,null,"0",0]
[4841,null,null,null,0,0,null,null,null,null,"ISLAM","WNI",null,null,null,null,0,0,null,null,null,null,null,null,null,null,null,null,null,null,null,null,null,null,null,null,null,null,null,null,null,null,null,null,null,null,null,null,null,null,null,null,null,null,null,null,null,null,null,null,null,null,null,null,null,null,null,null,null,null,null,null,null,null,null,null,null,null,null,null,"0",0]
[4842,null,null,null,0,0,null,null,null,null,"ISLAM","WNI",null,null,null,null,0,0,null,null,null,null,null,null,null,null,null,null,null,null,null,null,null,null,null,null,null,null,null,null,null,null,null,null,null,null,null,null,null,null,null,null,null,null,null,null,null,null,null,null,null,null,null,null,null,null,null,null,null,null,null,null,null,null,null,null,null,null,null,null,"0",0]
[4843,null,null,null,0,0,null,null,null,null,"ISLAM","WNI",null,null,null,null,0,0,null,null,null,null,null,null,null,null,null,null,null,null,null,null,null,null,null,null,null,null,null,null,null,null,null,null,null,null,null,null,null,null,null,null,null,null,null,null,null,null,null,null,null,null,null,null,null,null,null,null,null,null,null,null,null,null,null,null,null,null,null,null,"0",0]
[4844,null,null,null,0,0,null,null,null,null,"ISLAM","WNI",null,null,null,null,0,0,null,null,null,null,null,null,null,null,null,null,null,null,null,null,null,null,null,null,null,null,null,null,null,null,null,null,null,null,null,null,null,null,null,null,null,null,null,null,null,null,null,null,null,null,null,null,null,null,null,null,null,null,null,null,null,null,null,null,null,null,null,null,"0",0]
[4845,null,null,null,0,0,null,null,null,null,"ISLAM","WNI",null,null,null,null,0,0,null,null,null,null,null,null,null,null,null,null,null,null,null,null,null,null,null,null,null,null,null,null,null,null,null,null,null,null,null,null,null,null,null,null,null,null,null,null,null,null,null,null,null,null,null,null,null,null,null,null,null,null,null,null,null,null,null,null,null,null,null,null,"0",0]
[4846,null,null,null,0,0,null,null,null,null,"ISLAM","WNI",null,null,null,null,0,0,null,null,null,null,null,null,null,null,null,null,null,null,null,null,null,null,null,null,null,null,null,null,null,null,null,null,null,null,null,null,null,null,null,null,null,null,null,null,null,null,null,null,null,null,null,null,null,null,null,null,null,null,null,null,null,null,null,null,null,null,null,null,"0",0]
[4847,null,null,null,0,0,null,null,null,null,"ISLAM","WNI",null,null,null,null,0,0,null,null,null,null,null,null,null,null,null,null,null,null,null,null,null,null,null,null,null,null,null,null,null,null,null,null,null,null,null,null,null,null,null,null,null,null,null,null,null,null,null,null,null,null,null,null,null,null,null,null,null,null,null,null,null,null,null,null,null,null,null,null,"0",0]
[4848,null,null,null,0,0,null,null,null,null,"ISLAM","WNI",null,null,null,null,0,0,null,null,null,null,null,null,null,null,null,null,null,null,null,null,null,null,null,null,null,null,null,null,null,null,null,null,null,null,null,null,null,null,null,null,null,null,null,null,null,null,null,null,null,null,null,null,null,null,null,null,null,null,null,null,null,null,null,null,null,null,null,null,"0",0]
[4849,null,null,null,0,0,null,null,null,null,"ISLAM","WNI",null,null,null,null,0,0,null,null,null,null,null,null,null,null,null,null,null,null,null,null,null,null,null,null,null,null,null,null,null,null,null,null,null,null,null,null,null,null,null,null,null,null,null,null,null,null,null,null,null,null,null,null,null,null,null,null,null,null,null,null,null,null,null,null,null,null,null,null,"0",0]
[4850,null,null,null,0,0,null,null,null,null,"ISLAM","WNI",null,null,null,null,0,0,null,null,null,null,null,null,null,null,null,null,null,null,null,null,null,null,null,null,null,null,null,null,null,null,null,null,null,null,null,null,null,null,null,null,null,null,null,null,null,null,null,null,null,null,null,null,null,null,null,null,null,null,null,null,null,null,null,null,null,null,null,null,"0",0]
[4851,null,null,null,0,0,null,null,null,null,"ISLAM","WNI",null,null,null,null,0,0,null,null,null,null,null,null,null,null,null,null,null,null,null,null,null,null,null,null,null,null,null,null,null,null,null,null,null,null,null,null,null,null,null,null,null,null,null,null,null,null,null,null,null,null,null,null,null,null,null,null,null,null,null,null,null,null,null,null,null,null,null,null,"0",0]
[4852,null,null,null,0,0,null,null,null,null,"ISLAM","WNI",null,null,null,null,0,0,null,null,null,null,null,null,null,null,null,null,null,null,null,null,null,null,null,null,null,null,null,null,null,null,null,null,null,null,null,null,null,null,null,null,null,null,null,null,null,null,null,null,null,null,null,null,null,null,null,null,null,null,null,null,null,null,null,null,null,null,null,null,"0",0]
[4853,null,null,null,0,0,null,null,null,null,"ISLAM","WNI",null,null,null,null,0,0,null,null,null,null,null,null,null,null,null,null,null,null,null,null,null,null,null,null,null,null,null,null,null,null,null,null,null,null,null,null,null,null,null,null,null,null,null,null,null,null,null,null,null,null,null,null,null,null,null,null,null,null,null,null,null,null,null,null,null,null,null,null,"0",0]
[4854,null,null,null,0,0,null,null,null,null,"ISLAM","WNI",null,null,null,null,0,0,null,null,null,null,null,null,null,null,null,null,null,null,null,null,null,null,null,null,null,null,null,null,null,null,null,null,null,null,null,null,null,null,null,null,null,null,null,null,null,null,null,null,null,null,null,null,null,null,null,null,null,null,null,null,null,null,null,null,null,null,null,null,"0",0]
[4855,null,null,null,0,0,null,null,null,null,"ISLAM","WNI",null,null,null,null,0,0,null,null,null,null,null,null,null,null,null,null,null,null,null,null,null,null,null,null,null,null,null,null,null,null,null,null,null,null,null,null,null,null,null,null,null,null,null,null,null,null,null,null,null,null,null,null,null,null,null,null,null,null,null,null,null,null,null,null,null,null,null,null,"0",0]
[4856,null,null,null,0,0,null,null,null,null,"ISLAM","WNI",null,null,null,null,0,0,null,null,null,null,null,null,null,null,null,null,null,null,null,null,null,null,null,null,null,null,null,null,null,null,null,null,null,null,null,null,null,null,null,null,null,null,null,null,null,null,null,null,null,null,null,null,null,null,null,null,null,null,null,null,null,null,null,null,null,null,null,null,"0",0]
[4857,null,null,null,0,0,null,null,null,null,"ISLAM","WNI",null,null,null,null,0,0,null,null,null,null,null,null,null,null,null,null,null,null,null,null,null,null,null,null,null,null,null,null,null,null,null,null,null,null,null,null,null,null,null,null,null,null,null,null,null,null,null,null,null,null,null,null,null,null,null,null,null,null,null,null,null,null,null,null,null,null,null,null,"0",0]
[4858,null,null,null,0,0,null,null,null,null,"ISLAM","WNI",null,null,null,null,0,0,null,null,null,null,null,null,null,null,null,null,null,null,null,null,null,null,null,null,null,null,null,null,null,null,null,null,null,null,null,null,null,null,null,null,null,null,null,null,null,null,null,null,null,null,null,null,null,null,null,null,null,null,null,null,null,null,null,null,null,null,null,null,"0",0]
[4859,null,null,null,0,0,null,null,null,null,"ISLAM","WNI",null,null,null,null,0,0,null,null,null,null,null,null,null,null,null,null,null,null,null,null,null,null,null,null,null,null,null,null,null,null,null,null,null,null,null,null,null,null,null,null,null,null,null,null,null,null,null,null,null,null,null,null,null,null,null,null,null,null,null,null,null,null,null,null,null,null,null,null,"0",0]
[4860,null,null,null,0,0,null,null,null,null,"ISLAM","WNI",null,null,null,null,0,0,null,null,null,null,null,null,null,null,null,null,null,null,null,null,null,null,null,null,null,null,null,null,null,null,null,null,null,null,null,null,null,null,null,null,null,null,null,null,null,null,null,null,null,null,null,null,null,null,null,null,null,null,null,null,null,null,null,null,null,null,null,null,"0",0]
[4861,null,null,null,0,0,null,null,null,null,"ISLAM","WNI",null,null,null,null,0,0,null,null,null,null,null,null,null,null,null,null,null,null,null,null,null,null,null,null,null,null,null,null,null,null,null,null,null,null,null,null,null,null,null,null,null,null,null,null,null,null,null,null,null,null,null,null,null,null,null,null,null,null,null,null,null,null,null,null,null,null,null,null,"0",0]
[4862,null,null,null,0,0,null,null,null,null,"ISLAM","WNI",null,null,null,null,0,0,null,null,null,null,null,null,null,null,null,null,null,null,null,null,null,null,null,null,null,null,null,null,null,null,null,null,null,null,null,null,null,null,null,null,null,null,null,null,null,null,null,null,null,null,null,null,null,null,null,null,null,null,null,null,null,null,null,null,null,null,null,null,"0",0]
[4863,null,null,null,0,0,null,null,null,null,"ISLAM","WNI",null,null,null,null,0,0,null,null,null,null,null,null,null,null,null,null,null,null,null,null,null,null,null,null,null,null,null,null,null,null,null,null,null,null,null,null,null,null,null,null,null,null,null,null,null,null,null,null,null,null,null,null,null,null,null,null,null,null,null,null,null,null,null,null,null,null,null,null,"0",0]
[4864,null,null,null,0,0,null,null,null,null,"ISLAM","WNI",null,null,null,null,0,0,null,null,null,null,null,null,null,null,null,null,null,null,null,null,null,null,null,null,null,null,null,null,null,null,null,null,null,null,null,null,null,null,null,null,null,null,null,null,null,null,null,null,null,null,null,null,null,null,null,null,null,null,null,null,null,null,null,null,null,null,null,null,"0",0]
[4865,null,null,null,0,0,null,null,null,null,"ISLAM","WNI",null,null,null,null,0,0,null,null,null,null,null,null,null,null,null,null,null,null,null,null,null,null,null,null,null,null,null,null,null,null,null,null,null,null,null,null,null,null,null,null,null,null,null,null,null,null,null,null,null,null,null,null,null,null,null,null,null,null,null,null,null,null,null,null,null,null,null,null,"0",0]
[4866,null,null,null,0,0,null,null,null,null,"ISLAM","WNI",null,null,null,null,0,0,null,null,null,null,null,null,null,null,null,null,null,null,null,null,null,null,null,null,null,null,null,null,null,null,null,null,null,null,null,null,null,null,null,null,null,null,null,null,null,null,null,null,null,null,null,null,null,null,null,null,null,null,null,null,null,null,null,null,null,null,null,null,"0",0]
[4867,null,null,null,0,0,null,null,null,null,"ISLAM","WNI",null,null,null,null,0,0,null,null,null,null,null,null,null,null,null,null,null,null,null,null,null,null,null,null,null,null,null,null,null,null,null,null,null,null,null,null,null,null,null,null,null,null,null,null,null,null,null,null,null,null,null,null,null,null,null,null,null,null,null,null,null,null,null,null,null,null,null,null,"0",0]
[4868,null,null,null,0,0,null,null,null,null,"ISLAM","WNI",null,null,null,null,0,0,null,null,null,null,null,null,null,null,null,null,null,null,null,null,null,null,null,null,null,null,null,null,null,null,null,null,null,null,null,null,null,null,null,null,null,null,null,null,null,null,null,null,null,null,null,null,null,null,null,null,null,null,null,null,null,null,null,null,null,null,null,null,"0",0]
[4869,null,null,null,0,0,null,null,null,null,"ISLAM","WNI",null,null,null,null,0,0,null,null,null,null,null,null,null,null,null,null,null,null,null,null,null,null,null,null,null,null,null,null,null,null,null,null,null,null,null,null,null,null,null,null,null,null,null,null,null,null,null,null,null,null,null,null,null,null,null,null,null,null,null,null,null,null,null,null,null,null,null,null,"0",0]
[4870,null,null,null,0,0,null,null,null,null,"ISLAM","WNI",null,null,null,null,0,0,null,null,null,null,null,null,null,null,null,null,null,null,null,null,null,null,null,null,null,null,null,null,null,null,null,null,null,null,null,null,null,null,null,null,null,null,null,null,null,null,null,null,null,null,null,null,null,null,null,null,null,null,null,null,null,null,null,null,null,null,null,null,"0",0]
[4871,null,null,null,0,0,null,null,null,null,"ISLAM","WNI",null,null,null,null,0,0,null,null,null,null,null,null,null,null,null,null,null,null,null,null,null,null,null,null,null,null,null,null,null,null,null,null,null,null,null,null,null,null,null,null,null,null,null,null,null,null,null,null,null,null,null,null,null,null,null,null,null,null,null,null,null,null,null,null,null,null,null,null,"0",0]
[4872,null,null,null,0,0,null,null,null,null,"ISLAM","WNI",null,null,null,null,0,0,null,null,null,null,null,null,null,null,null,null,null,null,null,null,null,null,null,null,null,null,null,null,null,null,null,null,null,null,null,null,null,null,null,null,null,null,null,null,null,null,null,null,null,null,null,null,null,null,null,null,null,null,null,null,null,null,null,null,null,null,null,null,"0",0]
[4873,null,null,null,0,0,null,null,null,null,"ISLAM","WNI",null,null,null,null,0,0,null,null,null,null,null,null,null,null,null,null,null,null,null,null,null,null,null,null,null,null,null,null,null,null,null,null,null,null,null,null,null,null,null,null,null,null,null,null,null,null,null,null,null,null,null,null,null,null,null,null,null,null,null,null,null,null,null,null,null,null,null,null,"0",0]
[4874,null,null,null,0,0,null,null,null,null,"ISLAM","WNI",null,null,null,null,{"$f":"AT879","v":0},{"$f":"AU879","v":0},null,null,null,null,null,null,null,null,null,null,null,null,null,null,null,null,null,null,null,null,null,null,null,null,null,null,null,null,null,null,null,null,null,null,null,null,null,null,null,null,null,null,null,null,null,null,null,null,null,null,null,null,null,null,null,null,null,null,null,null,null,null,"0",0]
[4875,null,null,null,0,0,null,null,null,null,"ISLAM","WNI",null,null,null,null,0,0,null,null,null,null,null,null,null,null,null,null,null,null,null,null,null,null,null,null,null,null,null,null,null,null,null,null,null,null,null,null,null,null,null,null,null,null,null,null,null,null,null,null,null,null,null,null,null,null,null,null,null,null,null,null,null,null,null,null,null,null,null,null,{"$f":"RIGHT(CD880,4)","v":"0"},{"$f":"PR880","v":0}]
[4876,null,null,null,0,0,null,null,null,null,"ISLAM","WNI",null,null,null,null,0,0,null,null,null,null,null,null,null,null,null,null,null,null,null,null,null,null,null,null,null,null,null,null,null,null,null,null,null,null,null,null,null,null,null,null,null,null,null,null,null,null,null,null,null,null,null,null,null,null,null,null,null,null,null,null,null,null,null,null,null,null,null,null,"0",0]
[4877,null,null,null,0,0,null,null,null,null,"ISLAM","WNI",null,null,null,null,0,0,null,null,null,null,null,null,null,null,null,null,null,null,null,null,null,null,null,null,null,null,null,null,null,null,null,null,null,null,null,null,null,null,null,null,null,null,null,null,null,null,null,null,null,null,null,null,null,null,null,null,null,null,null,null,null,null,null,null,null,null,null,null,"0",0]
[4878,null,null,null,0,0,null,null,null,null,"ISLAM","WNI",null,null,null,null,0,0,null,null,null,null,null,null,null,null,null,null,null,null,null,null,null,null,null,null,null,null,null,null,null,null,null,null,null,null,null,null,null,null,null,null,null,null,null,null,null,null,null,null,null,null,null,null,null,null,null,null,null,null,null,null,null,null,null,null,null,null,null,null,"0",0]
[4879,null,null,null,0,0,null,null,null,null,"ISLAM","WNI",null,null,null,null,0,0,null,null,null,null,null,null,null,null,null,null,null,null,null,null,null,null,null,null,null,null,null,null,null,null,null,null,null,null,null,null,null,null,null,null,null,null,null,null,null,null,null,null,null,null,null,null,null,null,null,null,null,null,null,null,null,null,null,null,null,null,null,null,"0",0]
[4880,null,null,null,0,0,null,null,null,null,"ISLAM","WNI",null,null,null,null,0,0,null,null,null,null,null,null,null,null,null,null,null,null,null,null,null,null,null,null,null,null,null,null,null,null,null,null,null,null,null,null,null,null,null,null,null,null,null,null,null,null,null,null,null,null,null,null,null,null,null,null,null,null,null,null,null,null,null,null,null,null,null,null,"0",0]
[4881,null,null,null,0,0,null,null,null,null,"ISLAM","WNI",null,null,null,null,0,0,null,null,null,null,null,null,null,null,null,null,null,null,null,null,null,null,null,null,null,null,null,null,null,null,null,null,null,null,null,null,null,null,null,null,null,null,null,null,null,null,null,null,null,null,null,null,null,null,null,null,null,null,null,null,null,null,null,null,null,null,null,null,"0",0]
[4882,null,null,null,0,0,null,null,null,null,"ISLAM","WNI",null,null,null,null,0,0,null,null,null,null,null,null,null,null,null,null,null,null,null,null,null,null,null,null,null,null,null,null,null,null,null,null,null,null,null,null,null,null,null,null,null,null,null,null,null,null,null,null,null,null,null,null,null,null,null,null,null,null,null,null,null,null,null,null,null,null,null,null,"0",0]
[4883,null,null,null,0,0,null,null,null,null,"ISLAM","WNI",null,null,null,null,0,0,null,null,null,null,null,null,null,null,null,null,null,null,null,null,null,null,null,null,null,null,null,null,null,null,null,null,null,null,null,null,null,null,null,null,null,null,null,null,null,null,null,null,null,null,null,null,null,null,null,null,null,null,null,null,null,null,null,null,null,null,null,null,"0",0]
[4884,null,null,null,0,0,null,null,null,null,"ISLAM","WNI",null,null,null,null,0,0,null,null,null,null,null,null,null,null,null,null,null,null,null,null,null,null,null,null,null,null,null,null,null,null,null,null,null,null,null,null,null,null,null,null,null,null,null,null,null,null,null,null,null,null,null,null,null,null,null,null,null,null,null,null,null,null,null,null,null,null,null,null,"0",0]
[4885,null,null,null,0,0,null,null,null,null,"ISLAM","WNI",null,null,null,null,0,0,null,null,null,null,null,null,null,null,null,null,null,null,null,null,null,null,null,null,null,null,null,null,null,null,null,null,null,null,null,null,null,null,null,null,null,null,null,null,null,null,null,null,null,null,null,null,null,null,null,null,null,null,null,null,null,null,null,null,null,null,null,null,"0",0]
[4886,null,null,null,0,0,null,null,null,null,"ISLAM","WNI",null,null,null,null,0,0,null,null,null,null,null,null,null,null,null,null,null,null,null,null,null,null,null,null,null,null,null,null,null,null,null,null,null,null,null,null,null,null,null,null,null,null,null,null,null,null,null,null,null,null,null,null,null,null,null,null,null,null,null,null,null,null,null,null,null,null,null,null,"0",0]
[4887,null,null,null,0,0,null,null,null,null,"ISLAM","WNI",null,null,null,null,0,0,null,null,null,null,null,null,null,null,null,null,null,null,null,null,null,null,null,null,null,null,null,null,null,null,null,null,null,null,null,null,null,null,null,null,null,null,null,null,null,null,null,null,null,null,null,null,null,null,null,null,null,null,null,null,null,null,null,null,null,null,null,null,"0",0]
[4888,null,null,null,0,0,null,null,null,null,"ISLAM","WNI",null,null,null,null,0,0,null,null,null,null,null,null,null,null,null,null,null,null,null,null,null,null,null,null,null,null,null,null,null,null,null,null,null,null,null,null,null,null,null,null,null,null,null,null,null,null,null,null,null,null,null,null,null,null,null,null,null,null,null,null,null,null,null,null,null,null,null,null,"0",0]
[4889,null,null,null,0,0,null,null,null,null,"ISLAM","WNI",null,null,null,null,0,0,null,null,null,null,null,null,null,null,null,null,null,null,null,null,null,null,null,null,null,null,null,null,null,null,null,null,null,null,null,null,null,null,null,null,null,null,null,null,null,null,null,null,null,null,null,null,null,null,null,null,null,null,null,null,null,null,null,null,null,null,null,null,"0",0]
[4890,null,null,null,0,0,null,null,null,null,"ISLAM","WNI",null,null,null,null,0,0,null,null,null,null,null,null,null,null,null,null,null,null,null,null,null,null,null,null,null,null,null,null,null,null,null,null,null,null,null,null,null,null,null,null,null,null,null,null,null,null,null,null,null,null,null,null,null,null,null,null,null,null,null,null,null,null,null,null,null,null,null,null,"0",0]
[4891,null,null,null,0,0,null,null,null,null,"ISLAM","WNI",null,null,null,null,0,0,null,null,null,null,null,null,null,null,null,null,null,null,null,null,null,null,null,null,null,null,null,null,null,null,null,null,null,null,null,null,null,null,null,null,null,null,null,null,null,null,null,null,null,null,null,null,null,null,null,null,null,null,null,null,null,null,null,null,null,null,null,null,"0",0]
[4892,null,null,null,0,0,null,null,null,null,"ISLAM","WNI",null,null,null,null,0,0,null,null,null,null,null,null,null,null,null,null,null,null,null,null,null,null,null,null,null,null,null,null,null,null,null,null,null,null,null,null,null,null,null,null,null,null,null,null,null,null,null,null,null,null,null,null,null,null,null,null,null,null,null,null,null,null,null,null,null,null,null,null,"0",0]
[4893,null,null,null,0,0,null,null,null,null,"ISLAM","WNI",null,null,null,null,0,0,null,null,null,null,null,null,null,null,null,null,null,null,null,null,null,null,null,null,null,null,null,null,null,null,null,null,null,null,null,null,null,null,null,null,null,null,null,null,null,null,null,null,null,null,null,null,null,null,null,null,null,null,null,null,null,null,null,null,null,null,null,null,"0",0]
[4894,null,null,null,0,0,null,null,null,null,"ISLAM","WNI",null,null,null,null,0,0,null,null,null,null,null,null,null,null,null,null,null,null,null,null,null,null,null,null,null,null,null,null,null,null,null,null,null,null,null,null,null,null,null,null,null,null,null,null,null,null,null,null,null,null,null,null,null,null,null,null,null,null,null,null,null,null,null,null,null,null,null,null,"0",0]
[4895,null,null,null,0,0,null,null,null,null,"ISLAM","WNI",null,null,null,null,0,0,null,null,null,null,null,null,null,null,null,null,null,null,null,null,null,null,null,null,null,null,null,null,null,null,null,null,null,null,null,null,null,null,null,null,null,null,null,null,null,null,null,null,null,null,null,null,null,null,null,null,null,null,null,null,null,null,null,null,null,null,null,null,"0",0]
[4896,null,null,null,0,0,null,null,null,null,"ISLAM","WNI",null,null,null,null,0,0,null,null,null,null,null,null,null,null,null,null,null,null,null,null,null,null,null,null,null,null,null,null,null,null,null,null,null,null,null,null,null,null,null,null,null,null,null,null,null,null,null,null,null,null,null,null,null,null,null,null,null,null,null,null,null,null,null,null,null,null,null,null,"0",0]
[4897,null,null,null,0,0,null,null,null,null,"ISLAM","WNI",null,null,null,null,0,0,null,null,null,null,null,null,null,null,null,null,null,null,null,null,null,null,null,null,null,null,null,null,null,null,null,null,null,null,null,null,null,null,null,null,null,null,null,null,null,null,null,null,null,null,null,null,null,null,null,null,null,null,null,null,null,null,null,null,null,null,null,null,"0",0]
[4898,null,null,null,0,0,null,null,null,null,"ISLAM","WNI",null,null,null,null,0,0,null,null,null,null,null,null,null,null,null,null,null,null,null,null,null,null,null,null,null,null,null,null,null,null,null,null,null,null,null,null,null,null,null,null,null,null,null,null,null,null,null,null,null,null,null,null,null,null,null,null,null,null,null,null,null,null,null,null,null,null,null,null,"0",0]
[4899,null,null,null,{"$f":"AQ904","v":0},{"$f":"QG904","v":0},null,null,null,null,"ISLAM","WNI",null,null,null,null,0,0,null,null,null,null,null,null,null,null,null,null,null,null,null,null,null,null,null,null,null,null,null,null,null,null,null,null,null,null,null,null,null,null,null,null,null,null,null,null,null,null,null,null,null,null,null,null,null,null,null,null,null,null,null,null,null,null,null,null,null,null,null,null,"0",0]
[4900,null,null,null,0,0,null,null,null,null,"ISLAM","WNI",null,null,null,null,0,0,null,null,null,null,null,null,null,null,null,null,null,null,null,null,null,null,null,null,null,null,null,null,null,null,null,null,null,null,null,null,null,null,null,null,null,null,null,null,null,null,null,null,null,null,null,null,null,null,null,null,null,null,null,null,null,null,null,null,null,null,null,null,"0",0]
[4901,null,null,null,0,0,null,null,null,null,"ISLAM","WNI",null,null,null,null,0,0,null,null,null,null,null,null,null,null,null,null,null,null,null,null,null,null,null,null,null,null,null,null,null,null,null,null,null,null,null,null,null,null,null,null,null,null,null,null,null,null,null,null,null,null,null,null,null,null,null,null,null,null,null,null,null,null,null,null,null,null,null,null,"0",0]
[4902,null,null,null,0,0,null,null,null,null,"ISLAM","WNI",null,null,null,null,0,0,null,null,null,null,null,null,null,null,null,null,null,null,null,null,null,null,null,null,null,null,null,null,null,null,null,null,null,null,null,null,null,null,null,null,null,null,null,null,null,null,null,null,null,null,null,null,null,null,null,null,null,null,null,null,null,null,null,null,null,null,null,null,"0",0]
[4903,null,null,null,0,0,null,null,null,null,"ISLAM","WNI",null,null,null,null,0,0,null,null,null,null,null,null,null,null,null,null,null,null,null,null,null,null,null,null,null,null,null,null,null,null,null,null,null,null,null,null,null,null,null,null,null,null,null,null,null,null,null,null,null,null,null,null,null,null,null,null,null,null,null,null,null,null,null,null,null,null,null,null,"0",0]
[4904,null,null,null,0,0,null,null,null,null,"ISLAM","WNI",null,null,null,null,0,0,null,null,null,null,null,null,null,null,null,null,null,null,null,null,null,null,null,null,null,null,null,null,null,null,null,null,null,null,null,null,null,null,null,null,null,null,null,null,null,null,null,null,null,null,null,null,null,null,null,null,null,null,null,null,null,null,null,null,null,null,null,null,"0",0]
[4905,null,null,null,0,0,null,null,null,null,"ISLAM","WNI",null,null,null,null,0,0,null,null,null,null,null,null,null,null,null,null,null,null,null,null,null,null,null,null,null,null,null,null,null,null,null,null,null,null,null,null,null,null,null,null,null,null,null,null,null,null,null,null,null,null,null,null,null,null,null,null,null,null,null,null,null,null,null,null,null,null,null,null,"0",0]
[4906,null,null,null,0,0,null,null,null,null,"ISLAM","WNI",null,null,null,null,0,0,null,null,null,null,null,null,null,null,null,null,null,null,null,null,null,null,null,null,null,null,null,null,null,null,null,null,null,null,null,null,null,null,null,null,null,null,null,null,null,null,null,null,null,null,null,null,null,null,null,null,null,null,null,null,null,null,null,null,null,null,null,null,"0",0]
[4907,null,null,null,0,0,null,null,null,null,"ISLAM","WNI",null,null,null,null,0,0,null,null,null,null,null,null,null,null,null,null,null,null,null,null,null,null,null,null,null,null,null,null,null,null,null,null,null,null,null,null,null,null,null,null,null,null,null,null,null,null,null,null,null,null,null,null,null,null,null,null,null,null,null,null,null,null,null,null,null,null,null,null,"0",0]
[4908,null,null,null,0,0,null,null,null,null,"ISLAM","WNI",null,null,null,null,0,0,null,null,null,null,null,null,null,null,null,null,null,null,null,null,null,null,null,null,null,null,null,null,null,null,null,null,null,null,null,null,null,null,null,null,null,null,null,null,null,null,null,null,null,null,null,null,null,null,null,null,null,null,null,null,null,null,null,null,null,null,null,null,"0",0]
[4909,null,null,null,0,0,null,null,null,null,"ISLAM","WNI",null,null,null,null,0,0,null,null,null,null,null,null,null,null,null,null,null,null,null,null,null,null,null,null,null,null,null,null,null,null,null,null,null,null,null,null,null,null,null,null,null,null,null,null,null,null,null,null,null,null,null,null,null,null,null,null,null,null,null,null,null,null,null,null,null,null,null,null,"0",0]
[4910,null,null,null,0,0,null,null,null,null,"ISLAM","WNI",null,null,null,null,0,0,null,null,null,null,null,null,null,null,null,null,null,null,null,null,null,null,null,null,null,null,null,null,null,null,null,null,null,null,null,null,null,null,null,null,null,null,null,null,null,null,null,null,null,null,null,null,null,null,null,null,null,null,null,null,null,null,null,null,null,null,null,null,"0",0]
[4911,null,null,null,0,0,null,null,null,null,"ISLAM","WNI",null,null,null,null,0,0,null,null,null,null,null,null,null,null,null,null,null,null,null,null,null,null,null,null,null,null,null,null,null,null,null,null,null,null,null,null,null,null,null,null,null,null,null,null,null,null,null,null,null,null,null,null,null,null,null,null,null,null,null,null,null,null,null,null,null,null,null,null,"0",0]
[4912,null,null,null,0,0,null,null,null,null,"ISLAM","WNI",null,null,null,null,0,0,null,null,null,null,null,null,null,null,null,null,null,null,null,null,null,null,null,null,null,null,null,null,null,null,null,null,null,null,null,null,null,null,null,null,null,null,null,null,null,null,null,null,null,null,null,null,null,null,null,null,null,null,null,null,null,null,null,null,null,null,null,null,"0",0]
[4913,null,null,null,0,0,null,null,null,null,"ISLAM","WNI",null,null,null,null,0,0,null,null,null,null,null,null,null,null,null,null,null,null,null,null,null,null,null,null,null,null,null,null,null,null,null,null,null,null,null,null,null,null,null,null,null,null,null,null,null,null,null,null,null,null,null,null,null,null,null,null,null,null,null,null,null,null,null,null,null,null,null,null,"0",0]
[4914,null,null,null,0,0,null,null,null,null,"ISLAM","WNI",null,null,null,null,0,0,null,null,null,null,null,null,null,null,null,null,null,null,null,null,null,null,null,null,null,null,null,null,null,null,null,null,null,null,null,null,null,null,null,null,null,null,null,null,null,null,null,null,null,null,null,null,null,null,null,null,null,null,null,null,null,null,null,null,null,null,null,null,"0",0]
[4915,null,null,null,0,0,null,null,null,null,"ISLAM","WNI",null,null,null,null,0,0,null,null,null,null,null,null,null,null,null,null,null,null,null,null,null,null,null,null,null,null,null,null,null,null,null,null,null,null,null,null,null,null,null,null,null,null,null,null,null,null,null,null,null,null,null,null,null,null,null,null,null,null,null,null,null,null,null,null,null,null,null,null,"0",0]
[4916,null,null,null,0,0,null,null,null,null,"ISLAM","WNI",null,null,null,null,0,0,null,null,null,null,null,null,null,null,null,null,null,null,null,null,null,null,null,null,null,null,null,null,null,null,null,null,null,null,null,null,null,null,null,null,null,null,null,null,null,null,null,null,null,null,null,null,null,null,null,null,null,null,null,null,null,null,null,null,null,null,null,null,"0",0]
[4917,null,null,null,0,0,null,null,null,null,"ISLAM","WNI",null,null,null,null,0,0,null,null,null,null,null,null,null,null,null,null,null,null,null,null,null,null,null,null,null,null,null,null,null,null,null,null,null,null,null,null,null,null,null,null,null,null,null,null,null,null,null,null,null,null,null,null,null,null,null,null,null,null,null,null,null,null,null,null,null,null,null,null,"0",0]
[4918,null,null,null,0,0,null,null,null,null,"ISLAM","WNI",null,null,null,null,0,0,null,null,null,null,null,null,null,null,null,null,null,null,null,null,null,null,null,null,null,null,null,null,null,null,null,null,null,null,null,null,null,null,null,null,null,null,null,null,null,null,null,null,null,null,null,null,null,null,null,null,null,null,null,null,null,null,null,null,null,null,null,null,"0",0]
[4919,null,null,null,0,0,null,null,null,null,"ISLAM","WNI",null,null,null,null,0,0,null,null,null,null,null,null,null,null,null,null,null,null,null,null,null,null,null,null,null,null,null,null,null,null,null,null,null,null,null,null,null,null,null,null,null,null,null,null,null,null,null,null,null,null,null,null,null,null,null,null,null,null,null,null,null,null,null,null,null,null,null,null,"0",0]
[4920,null,null,null,0,0,null,null,null,null,"ISLAM","WNI",null,null,null,null,0,0,null,null,null,null,null,null,null,null,null,null,null,null,null,null,null,null,null,null,null,null,null,null,null,null,null,null,null,null,null,null,null,null,null,null,null,null,null,null,null,null,null,null,null,null,null,null,null,null,null,null,null,null,null,null,null,null,null,null,null,null,null,null,"0",0]
[4921,null,null,null,0,0,null,null,null,null,"ISLAM","WNI",null,null,null,null,0,0,null,null,null,null,null,null,null,null,null,null,null,null,null,null,null,null,null,null,null,null,null,null,null,null,null,null,null,null,null,null,null,null,null,null,null,null,null,null,null,null,null,null,null,null,null,null,null,null,null,null,null,null,null,null,null,null,null,null,null,null,null,null,"0",0]
[4922,null,null,null,0,0,null,null,null,null,"ISLAM","WNI",null,null,null,null,0,0,null,null,null,null,null,null,null,null,null,null,null,null,null,null,null,null,null,null,null,null,null,null,null,null,null,null,null,null,null,null,null,null,null,null,null,null,null,null,null,null,null,null,null,null,null,null,null,null,null,null,null,null,null,null,null,null,null,null,null,null,null,null,"0",0]
[4923,null,null,null,0,0,null,null,null,null,"ISLAM","WNI",null,null,null,null,0,0,null,null,null,null,null,null,null,null,null,null,null,null,null,null,null,null,null,null,null,null,null,null,null,null,null,null,null,null,null,null,null,null,null,null,null,null,null,null,null,null,null,null,null,null,null,null,null,null,null,null,null,null,null,null,null,null,null,null,null,null,null,null,"0",0]
[4924,null,null,null,0,0,null,null,null,null,"ISLAM","WNI",null,null,null,null,0,0,null,null,null,null,null,null,null,null,null,null,null,null,null,null,null,null,null,null,null,null,null,null,null,null,null,null,null,null,null,null,null,null,null,null,null,null,null,null,null,null,null,null,null,null,null,null,null,null,null,null,null,null,null,null,null,null,null,null,null,null,null,null,"0",0]
[4925,null,null,null,0,0,null,null,null,null,"ISLAM","WNI",null,null,null,null,0,0,null,null,null,null,null,null,null,null,null,null,null,null,null,null,null,null,null,null,null,null,null,null,null,null,null,null,null,null,null,null,null,null,null,null,null,null,null,null,null,null,null,null,null,null,null,null,null,null,null,null,null,null,null,null,null,null,null,null,null,null,null,null,"0",0]
[4926,null,null,null,0,0,null,null,null,null,"ISLAM","WNI",null,null,null,null,0,0,null,null,null,null,null,null,null,null,null,null,null,null,null,null,null,null,null,null,null,null,null,null,null,null,null,null,null,null,null,null,null,null,null,null,null,null,null,null,null,null,null,null,null,null,null,null,null,null,null,null,null,null,null,null,null,null,null,null,null,null,null,null,"0",0]
[4927,null,null,null,0,0,null,null,null,null,"ISLAM","WNI",null,null,null,null,0,0,null,null,null,null,null,null,null,null,null,null,null,null,null,null,null,null,null,null,null,null,null,null,null,null,null,null,null,null,null,null,null,null,null,null,null,null,null,null,null,null,null,null,null,null,null,null,null,null,null,null,null,null,null,null,null,null,null,null,null,null,null,null,"0",0]
[4928,null,null,null,0,0,null,null,null,null,"ISLAM","WNI",null,null,null,null,0,0,null,null,null,null,null,null,null,null,null,null,null,null,null,null,null,null,null,null,null,null,null,null,null,null,null,null,null,null,null,null,null,null,null,null,null,null,null,null,null,null,null,null,null,null,null,null,null,null,null,null,null,null,null,null,null,null,null,null,null,null,null,null,"0",0]
[4929,null,null,null,0,0,null,null,null,null,"ISLAM","WNI",null,null,null,null,0,0,null,null,null,null,null,null,null,null,null,null,null,null,null,null,null,null,null,null,null,null,null,null,null,null,null,null,null,null,null,null,null,null,null,null,null,null,null,null,null,null,null,null,null,null,null,null,null,null,null,null,null,null,null,null,null,null,null,null,null,null,null,null,"0",0]
[4930,null,null,null,0,0,null,null,null,null,"ISLAM","WNI",null,null,null,null,0,0,null,null,null,null,null,null,null,null,null,null,null,null,null,null,null,null,null,null,null,null,null,null,null,null,null,null,null,null,null,null,null,null,null,null,null,null,null,null,null,null,null,null,null,null,null,null,null,null,null,null,null,null,null,null,null,null,null,null,null,null,null,null,"0",0]
[4931,null,null,null,0,0,null,null,null,null,"ISLAM","WNI",null,null,null,null,0,0,null,null,null,null,null,null,null,null,null,null,null,null,null,null,null,null,null,null,null,null,null,null,null,null,null,null,null,null,null,null,null,null,null,null,null,null,null,null,null,null,null,null,null,null,null,null,null,null,null,null,null,null,null,null,null,null,null,null,null,null,null,null,"0",0]
[4932,null,null,null,0,0,null,null,null,null,"ISLAM","WNI",null,null,null,null,0,0,null,null,null,null,null,null,null,null,null,null,null,null,null,null,null,null,null,null,null,null,null,null,null,null,null,null,null,null,null,null,null,null,null,null,null,null,null,null,null,null,null,null,null,null,null,null,null,null,null,null,null,null,null,null,null,null,null,null,null,null,null,null,"0",0]
[4933,null,null,null,0,0,null,null,null,null,"ISLAM","WNI",null,null,null,null,0,0,null,null,null,null,null,null,null,null,null,null,null,null,null,null,null,null,null,null,null,null,null,null,null,null,null,null,null,null,null,null,null,null,null,null,null,null,null,null,null,null,null,null,null,null,null,null,null,null,null,null,null,null,null,null,null,null,null,null,null,null,null,null,"0",0]
[4934,null,null,null,0,0,null,null,null,null,"ISLAM","WNI",null,null,null,null,0,0,null,null,null,null,null,null,null,null,null,null,null,null,null,null,null,null,null,null,null,null,null,null,null,null,null,null,null,null,null,null,null,null,null,null,null,null,null,null,null,null,null,null,null,null,null,null,null,null,null,null,null,null,null,null,null,null,null,null,null,null,null,null,"0",0]
[4935,null,null,null,0,0,null,null,null,null,"ISLAM","WNI",null,null,null,null,0,0,null,null,null,null,null,null,null,null,null,null,null,null,null,null,null,null,null,null,null,null,null,null,null,null,null,null,null,null,null,null,null,null,null,null,null,null,null,null,null,null,null,null,null,null,null,null,null,null,null,null,null,null,null,null,null,null,null,null,null,null,null,null,"0",0]
[4936,null,null,null,0,0,null,null,null,null,"ISLAM","WNI",null,null,null,null,0,0,null,null,null,null,null,null,null,null,null,null,null,null,null,null,null,null,null,null,null,null,null,null,null,null,null,null,null,null,null,null,null,null,null,null,null,null,null,null,null,null,null,null,null,null,null,null,null,null,null,null,null,null,null,null,null,null,null,null,null,null,null,null,"0",0]
[4937,null,null,null,0,0,null,null,null,null,"ISLAM","WNI",null,null,null,null,0,0,null,null,null,null,null,null,null,null,null,null,null,null,null,null,null,null,null,null,null,null,null,null,null,null,null,null,null,null,null,null,null,null,null,null,null,null,null,null,null,null,null,null,null,null,null,null,null,null,null,null,null,null,null,null,null,null,null,null,null,null,null,null,"0",0]
[4938,null,null,null,0,0,null,null,null,null,"ISLAM","WNI",null,null,null,null,{"$f":"AT943","v":0},{"$f":"AU943","v":0},null,null,null,null,null,null,null,null,null,null,null,null,null,null,null,null,null,null,null,null,null,null,null,null,null,null,null,null,null,null,null,null,null,null,null,null,null,null,null,null,null,null,null,null,null,null,null,null,null,null,null,null,null,null,null,null,null,null,null,null,null,null,"0",0]
[4939,null,null,null,0,0,null,null,null,null,"ISLAM","WNI",null,null,null,null,0,0,null,null,null,null,null,null,null,null,null,null,null,null,null,null,null,null,null,null,null,null,null,null,null,null,null,null,null,null,null,null,null,null,null,null,null,null,null,null,null,null,null,null,null,null,null,null,null,null,null,null,null,null,null,null,null,null,null,null,null,null,null,null,{"$f":"RIGHT(CD944,4)","v":"0"},{"$f":"PR944","v":0}]
[4940,null,null,null,0,0,null,null,null,null,"ISLAM","WNI",null,null,null,null,0,0,null,null,null,null,null,null,null,null,null,null,null,null,null,null,null,null,null,null,null,null,null,null,null,null,null,null,null,null,null,null,null,null,null,null,null,null,null,null,null,null,null,null,null,null,null,null,null,null,null,null,null,null,null,null,null,null,null,null,null,null,null,null,"0",0]
[4941,null,null,null,0,0,null,null,null,null,"ISLAM","WNI",null,null,null,null,0,0,null,null,null,null,null,null,null,null,null,null,null,null,null,null,null,null,null,null,null,null,null,null,null,null,null,null,null,null,null,null,null,null,null,null,null,null,null,null,null,null,null,null,null,null,null,null,null,null,null,null,null,null,null,null,null,null,null,null,null,null,null,null,"0",0]
[4942,null,null,null,0,0,null,null,null,null,"ISLAM","WNI",null,null,null,null,0,0,null,null,null,null,null,null,null,null,null,null,null,null,null,null,null,null,null,null,null,null,null,null,null,null,null,null,null,null,null,null,null,null,null,null,null,null,null,null,null,null,null,null,null,null,null,null,null,null,null,null,null,null,null,null,null,null,null,null,null,null,null,null,"0",0]
[4943,null,null,null,0,0,null,null,null,null,"ISLAM","WNI",null,null,null,null,0,0,null,null,null,null,null,null,null,null,null,null,null,null,null,null,null,null,null,null,null,null,null,null,null,null,null,null,null,null,null,null,null,null,null,null,null,null,null,null,null,null,null,null,null,null,null,null,null,null,null,null,null,null,null,null,null,null,null,null,null,null,null,null,"0",0]
[4944,null,null,null,0,0,null,null,null,null,"ISLAM","WNI",null,null,null,null,0,0,null,null,null,null,null,null,null,null,null,null,null,null,null,null,null,null,null,null,null,null,null,null,null,null,null,null,null,null,null,null,null,null,null,null,null,null,null,null,null,null,null,null,null,null,null,null,null,null,null,null,null,null,null,null,null,null,null,null,null,null,null,null,"0",0]
[4945,null,null,null,0,0,null,null,null,null,"ISLAM","WNI",null,null,null,null,0,0,null,null,null,null,null,null,null,null,null,null,null,null,null,null,null,null,null,null,null,null,null,null,null,null,null,null,null,null,null,null,null,null,null,null,null,null,null,null,null,null,null,null,null,null,null,null,null,null,null,null,null,null,null,null,null,null,null,null,null,null,null,null,"0",0]
[4946,null,null,null,0,0,null,null,null,null,"ISLAM","WNI",null,null,null,null,0,0,null,null,null,null,null,null,null,null,null,null,null,null,null,null,null,null,null,null,null,null,null,null,null,null,null,null,null,null,null,null,null,null,null,null,null,null,null,null,null,null,null,null,null,null,null,null,null,null,null,null,null,null,null,null,null,null,null,null,null,null,null,null,"0",0]
[4947,null,null,null,0,0,null,null,null,null,"ISLAM","WNI",null,null,null,null,0,0,null,null,null,null,null,null,null,null,null,null,null,null,null,null,null,null,null,null,null,null,null,null,null,null,null,null,null,null,null,null,null,null,null,null,null,null,null,null,null,null,null,null,null,null,null,null,null,null,null,null,null,null,null,null,null,null,null,null,null,null,null,null,"0",0]
[4948,null,null,null,0,0,null,null,null,null,"ISLAM","WNI",null,null,null,null,0,0,null,null,null,null,null,null,null,null,null,null,null,null,null,null,null,null,null,null,null,null,null,null,null,null,null,null,null,null,null,null,null,null,null,null,null,null,null,null,null,null,null,null,null,null,null,null,null,null,null,null,null,null,null,null,null,null,null,null,null,null,null,null,"0",0]
[4949,null,null,null,0,0,null,null,null,null,"ISLAM","WNI",null,null,null,null,0,0,null,null,null,null,null,null,null,null,null,null,null,null,null,null,null,null,null,null,null,null,null,null,null,null,null,null,null,null,null,null,null,null,null,null,null,null,null,null,null,null,null,null,null,null,null,null,null,null,null,null,null,null,null,null,null,null,null,null,null,null,null,null,"0",0]
[4950,null,null,null,0,0,null,null,null,null,"ISLAM","WNI",null,null,null,null,0,0,null,null,null,null,null,null,null,null,null,null,null,null,null,null,null,null,null,null,null,null,null,null,null,null,null,null,null,null,null,null,null,null,null,null,null,null,null,null,null,null,null,null,null,null,null,null,null,null,null,null,null,null,null,null,null,null,null,null,null,null,null,null,"0",0]
[4951,null,null,null,0,0,null,null,null,null,"ISLAM","WNI",null,null,null,null,0,0,null,null,null,null,null,null,null,null,null,null,null,null,null,null,null,null,null,null,null,null,null,null,null,null,null,null,null,null,null,null,null,null,null,null,null,null,null,null,null,null,null,null,null,null,null,null,null,null,null,null,null,null,null,null,null,null,null,null,null,null,null,null,"0",0]
[4952,null,null,null,0,0,null,null,null,null,"ISLAM","WNI",null,null,null,null,0,0,null,null,null,null,null,null,null,null,null,null,null,null,null,null,null,null,null,null,null,null,null,null,null,null,null,null,null,null,null,null,null,null,null,null,null,null,null,null,null,null,null,null,null,null,null,null,null,null,null,null,null,null,null,null,null,null,null,null,null,null,null,null,"0",0]
[4953,null,null,null,0,0,null,null,null,null,"ISLAM","WNI",null,null,null,null,0,0,null,null,null,null,null,null,null,null,null,null,null,null,null,null,null,null,null,null,null,null,null,null,null,null,null,null,null,null,null,null,null,null,null,null,null,null,null,null,null,null,null,null,null,null,null,null,null,null,null,null,null,null,null,null,null,null,null,null,null,null,null,null,"0",0]
[4954,null,null,null,0,0,null,null,null,null,"ISLAM","WNI",null,null,null,null,0,0,null,null,null,null,null,null,null,null,null,null,null,null,null,null,null,null,null,null,null,null,null,null,null,null,null,null,null,null,null,null,null,null,null,null,null,null,null,null,null,null,null,null,null,null,null,null,null,null,null,null,null,null,null,null,null,null,null,null,null,null,null,null,"0",0]
[4955,null,null,null,0,0,null,null,null,null,"ISLAM","WNI",null,null,null,null,0,0,null,null,null,null,null,null,null,null,null,null,null,null,null,null,null,null,null,null,null,null,null,null,null,null,null,null,null,null,null,null,null,null,null,null,null,null,null,null,null,null,null,null,null,null,null,null,null,null,null,null,null,null,null,null,null,null,null,null,null,null,null,null,"0",0]
[4956,null,null,null,0,0,null,null,null,null,"ISLAM","WNI",null,null,null,null,0,0,null,null,null,null,null,null,null,null,null,null,null,null,null,null,null,null,null,null,null,null,null,null,null,null,null,null,null,null,null,null,null,null,null,null,null,null,null,null,null,null,null,null,null,null,null,null,null,null,null,null,null,null,null,null,null,null,null,null,null,null,null,null,"0",0]
[4957,null,null,null,0,0,null,null,null,null,"ISLAM","WNI",null,null,null,null,0,0,null,null,null,null,null,null,null,null,null,null,null,null,null,null,null,null,null,null,null,null,null,null,null,null,null,null,null,null,null,null,null,null,null,null,null,null,null,null,null,null,null,null,null,null,null,null,null,null,null,null,null,null,null,null,null,null,null,null,null,null,null,null,"0",0]
[4958,null,null,null,0,0,null,null,null,null,"ISLAM","WNI",null,null,null,null,0,0,null,null,null,null,null,null,null,null,null,null,null,null,null,null,null,null,null,null,null,null,null,null,null,null,null,null,null,null,null,null,null,null,null,null,null,null,null,null,null,null,null,null,null,null,null,null,null,null,null,null,null,null,null,null,null,null,null,null,null,null,null,null,"0",0]
[4959,null,null,null,0,0,null,null,null,null,"ISLAM","WNI",null,null,null,null,0,0,null,null,null,null,null,null,null,null,null,null,null,null,null,null,null,null,null,null,null,null,null,null,null,null,null,null,null,null,null,null,null,null,null,null,null,null,null,null,null,null,null,null,null,null,null,null,null,null,null,null,null,null,null,null,null,null,null,null,null,null,null,null,"0",0]
[4960,null,null,null,0,0,null,null,null,null,"ISLAM","WNI",null,null,null,null,0,0,null,null,null,null,null,null,null,null,null,null,null,null,null,null,null,null,null,null,null,null,null,null,null,null,null,null,null,null,null,null,null,null,null,null,null,null,null,null,null,null,null,null,null,null,null,null,null,null,null,null,null,null,null,null,null,null,null,null,null,null,null,null,"0",0]
[4961,null,null,null,0,0,null,null,null,null,"ISLAM","WNI",null,null,null,null,0,0,null,null,null,null,null,null,null,null,null,null,null,null,null,null,null,null,null,null,null,null,null,null,null,null,null,null,null,null,null,null,null,null,null,null,null,null,null,null,null,null,null,null,null,null,null,null,null,null,null,null,null,null,null,null,null,null,null,null,null,null,null,null,"0",0]
[4962,null,null,null,0,0,null,null,null,null,"ISLAM","WNI",null,null,null,null,0,0,null,null,null,null,null,null,null,null,null,null,null,null,null,null,null,null,null,null,null,null,null,null,null,null,null,null,null,null,null,null,null,null,null,null,null,null,null,null,null,null,null,null,null,null,null,null,null,null,null,null,null,null,null,null,null,null,null,null,null,null,null,null,"0",0]
[4963,null,null,null,{"$f":"AQ968","v":0},{"$f":"QG968","v":0},null,null,null,null,"ISLAM","WNI",null,null,null,null,0,0,null,null,null,null,null,null,null,null,null,null,null,null,null,null,null,null,null,null,null,null,null,null,null,null,null,null,null,null,null,null,null,null,null,null,null,null,null,null,null,null,null,null,null,null,null,null,null,null,null,null,null,null,null,null,null,null,null,null,null,null,null,null,"0",0]
[4964,null,null,null,0,0,null,null,null,null,"ISLAM","WNI",null,null,null,null,0,0,null,null,null,null,null,null,null,null,null,null,null,null,null,null,null,null,null,null,null,null,null,null,null,null,null,null,null,null,null,null,null,null,null,null,null,null,null,null,null,null,null,null,null,null,null,null,null,null,null,null,null,null,null,null,null,null,null,null,null,null,null,null,"0",0]
[4965,null,null,null,0,0,null,null,null,null,"ISLAM","WNI",null,null,null,null,0,0,null,null,null,null,null,null,null,null,null,null,null,null,null,null,null,null,null,null,null,null,null,null,null,null,null,null,null,null,null,null,null,null,null,null,null,null,null,null,null,null,null,null,null,null,null,null,null,null,null,null,null,null,null,null,null,null,null,null,null,null,null,null,"0",0]
[4966,null,null,null,0,0,null,null,null,null,"ISLAM","WNI",null,null,null,null,0,0,null,null,null,null,null,null,null,null,null,null,null,null,null,null,null,null,null,null,null,null,null,null,null,null,null,null,null,null,null,null,null,null,null,null,null,null,null,null,null,null,null,null,null,null,null,null,null,null,null,null,null,null,null,null,null,null,null,null,null,null,null,null,"0",0]
[4967,null,null,null,0,0,null,null,null,null,"ISLAM","WNI",null,null,null,null,0,0,null,null,null,null,null,null,null,null,null,null,null,null,null,null,null,null,null,null,null,null,null,null,null,null,null,null,null,null,null,null,null,null,null,null,null,null,null,null,null,null,null,null,null,null,null,null,null,null,null,null,null,null,null,null,null,null,null,null,null,null,null,null,"0",0]
[4968,null,null,null,0,0,null,null,null,null,"ISLAM","WNI",null,null,null,null,0,0,null,null,null,null,null,null,null,null,null,null,null,null,null,null,null,null,null,null,null,null,null,null,null,null,null,null,null,null,null,null,null,null,null,null,null,null,null,null,null,null,null,null,null,null,null,null,null,null,null,null,null,null,null,null,null,null,null,null,null,null,null,null,"0",0]
[4969,null,null,null,0,0,null,null,null,null,"ISLAM","WNI",null,null,null,null,0,0,null,null,null,null,null,null,null,null,null,null,null,null,null,null,null,null,null,null,null,null,null,null,null,null,null,null,null,null,null,null,null,null,null,null,null,null,null,null,null,null,null,null,null,null,null,null,null,null,null,null,null,null,null,null,null,null,null,null,null,null,null,null,"0",0]
[4970,null,null,null,0,0,null,null,null,null,"ISLAM","WNI",null,null,null,null,0,0,null,null,null,null,null,null,null,null,null,null,null,null,null,null,null,null,null,null,null,null,null,null,null,null,null,null,null,null,null,null,null,null,null,null,null,null,null,null,null,null,null,null,null,null,null,null,null,null,null,null,null,null,null,null,null,null,null,null,null,null,null,null,"0",0]
[4971,null,null,null,0,0,null,null,null,null,"ISLAM","WNI",null,null,null,null,0,0,null,null,null,null,null,null,null,null,null,null,null,null,null,null,null,null,null,null,null,null,null,null,null,null,null,null,null,null,null,null,null,null,null,null,null,null,null,null,null,null,null,null,null,null,null,null,null,null,null,null,null,null,null,null,null,null,null,null,null,null,null,null,"0",0]
[4972,null,null,null,0,0,null,null,null,null,"ISLAM","WNI",null,null,null,null,0,0,null,null,null,null,null,null,null,null,null,null,null,null,null,null,null,null,null,null,null,null,null,null,null,null,null,null,null,null,null,null,null,null,null,null,null,null,null,null,null,null,null,null,null,null,null,null,null,null,null,null,null,null,null,null,null,null,null,null,null,null,null,null,"0",0]
[4973,null,null,null,0,0,null,null,null,null,"ISLAM","WNI",null,null,null,null,0,0,null,null,null,null,null,null,null,null,null,null,null,null,null,null,null,null,null,null,null,null,null,null,null,null,null,null,null,null,null,null,null,null,null,null,null,null,null,null,null,null,null,null,null,null,null,null,null,null,null,null,null,null,null,null,null,null,null,null,null,null,null,null,"0",0]
[4974,null,null,null,0,0,null,null,null,null,"ISLAM","WNI",null,null,null,null,0,0,null,null,null,null,null,null,null,null,null,null,null,null,null,null,null,null,null,null,null,null,null,null,null,null,null,null,null,null,null,null,null,null,null,null,null,null,null,null,null,null,null,null,null,null,null,null,null,null,null,null,null,null,null,null,null,null,null,null,null,null,null,null,"0",0]
[4975,null,null,null,0,0,null,null,null,null,"ISLAM","WNI",null,null,null,null,0,0,null,null,null,null,null,null,null,null,null,null,null,null,null,null,null,null,null,null,null,null,null,null,null,null,null,null,null,null,null,null,null,null,null,null,null,null,null,null,null,null,null,null,null,null,null,null,null,null,null,null,null,null,null,null,null,null,null,null,null,null,null,null,"0",0]
[4976,null,null,null,0,0,null,null,null,null,"ISLAM","WNI",null,null,null,null,0,0,null,null,null,null,null,null,null,null,null,null,null,null,null,null,null,null,null,null,null,null,null,null,null,null,null,null,null,null,null,null,null,null,null,null,null,null,null,null,null,null,null,null,null,null,null,null,null,null,null,null,null,null,null,null,null,null,null,null,null,null,null,null,"0",0]
[4977,null,null,null,0,0,null,null,null,null,"ISLAM","WNI",null,null,null,null,0,0,null,null,null,null,null,null,null,null,null,null,null,null,null,null,null,null,null,null,null,null,null,null,null,null,null,null,null,null,null,null,null,null,null,null,null,null,null,null,null,null,null,null,null,null,null,null,null,null,null,null,null,null,null,null,null,null,null,null,null,null,null,null,"0",0]
[4978,null,null,null,0,0,null,null,null,null,"ISLAM","WNI",null,null,null,null,0,0,null,null,null,null,null,null,null,null,null,null,null,null,null,null,null,null,null,null,null,null,null,null,null,null,null,null,null,null,null,null,null,null,null,null,null,null,null,null,null,null,null,null,null,null,null,null,null,null,null,null,null,null,null,null,null,null,null,null,null,null,null,null,"0",0]
[4979,null,null,null,0,0,null,null,null,null,"ISLAM","WNI",null,null,null,null,0,0,null,null,null,null,null,null,null,null,null,null,null,null,null,null,null,null,null,null,null,null,null,null,null,null,null,null,null,null,null,null,null,null,null,null,null,null,null,null,null,null,null,null,null,null,null,null,null,null,null,null,null,null,null,null,null,null,null,null,null,null,null,null,"0",0]
[4980,null,null,null,0,0,null,null,null,null,"ISLAM","WNI",null,null,null,null,0,0,null,null,null,null,null,null,null,null,null,null,null,null,null,null,null,null,null,null,null,null,null,null,null,null,null,null,null,null,null,null,null,null,null,null,null,null,null,null,null,null,null,null,null,null,null,null,null,null,null,null,null,null,null,null,null,null,null,null,null,null,null,null,"0",0]
[4981,null,null,null,0,0,null,null,null,null,"ISLAM","WNI",null,null,null,null,0,0,null,null,null,null,null,null,null,null,null,null,null,null,null,null,null,null,null,null,null,null,null,null,null,null,null,null,null,null,null,null,null,null,null,null,null,null,null,null,null,null,null,null,null,null,null,null,null,null,null,null,null,null,null,null,null,null,null,null,null,null,null,null,"0",0]
[4982,null,null,null,0,0,null,null,null,null,"ISLAM","WNI",null,null,null,null,0,0,null,null,null,null,null,null,null,null,null,null,null,null,null,null,null,null,null,null,null,null,null,null,null,null,null,null,null,null,null,null,null,null,null,null,null,null,null,null,null,null,null,null,null,null,null,null,null,null,null,null,null,null,null,null,null,null,null,null,null,null,null,null,"0",0]
[4983,null,null,null,0,0,null,null,null,null,"ISLAM","WNI",null,null,null,null,0,0,null,null,null,null,null,null,null,null,null,null,null,null,null,null,null,null,null,null,null,null,null,null,null,null,null,null,null,null,null,null,null,null,null,null,null,null,null,null,null,null,null,null,null,null,null,null,null,null,null,null,null,null,null,null,null,null,null,null,null,null,null,null,"0",{"$f":"PR988","v":0}]
[4984,null,null,null,0,0,null,null,null,null,"ISLAM","WNI",null,null,null,null,0,0,null,null,null,null,null,null,null,null,null,null,null,null,null,null,null,null,null,null,null,null,null,null,null,null,null,null,null,null,null,null,null,null,null,null,null,null,null,null,null,null,null,null,null,null,null,null,null,null,null,null,null,null,null,null,null,null,null,null,null,null,null,null,"0",0]
[4985,null,null,null,0,0,null,null,null,null,"ISLAM","WNI",null,null,null,null,0,0,null,null,null,null,null,null,null,null,null,null,null,null,null,null,null,null,null,null,null,null,null,null,null,null,null,null,null,null,null,null,null,null,null,null,null,null,null,null,null,null,null,null,null,null,null,null,null,null,null,null,null,null,null,null,null,null,null,null,null,null,null,null,"0",0]
[4986,null,null,null,0,0,null,null,null,null,"ISLAM","WNI",null,null,null,null,0,0,null,null,null,null,null,null,null,null,null,null,null,null,null,null,null,null,null,null,null,null,null,null,null,null,null,null,null,null,null,null,null,null,null,null,null,null,null,null,null,null,null,null,null,null,null,null,null,null,null,null,null,null,null,null,null,null,null,null,null,null,null,null,"0",0]
[4987,null,null,null,0,0,null,null,null,null,"ISLAM","WNI",null,null,null,null,0,0,null,null,null,null,null,null,null,null,null,null,null,null,null,null,null,null,null,null,null,null,null,null,null,null,null,null,null,null,null,null,null,null,null,null,null,null,null,null,null,null,null,null,null,null,null,null,null,null,null,null,null,null,null,null,null,null,null,null,null,null,null,null,"0",{"$f":"PR992","v":0}]
[4988,null,null,null,0,0,null,null,null,null,"ISLAM","WNI",null,null,null,null,0,0,null,null,null,null,null,null,null,null,null,null,null,null,null,null,null,null,null,null,null,null,null,null,null,null,null,null,null,null,null,null,null,null,null,null,null,null,null,null,null,null,null,null,null,null,null,null,null,null,null,null,null,null,null,null,null,null,null,null,null,null,null,null,"0",0]
[4989,null,null,null,0,0,null,null,null,null,"ISLAM","WNI",null,null,null,null,0,0,null,null,null,null,null,null,null,null,null,null,null,null,null,null,null,null,null,null,null,null,null,null,null,null,null,null,null,null,null,null,null,null,null,null,null,null,null,null,null,null,null,null,null,null,null,null,null,null,null,null,null,null,null,null,null,null,null,null,null,null,null,null,"0",0]
[4990,null,null,null,0,0,null,null,null,null,"ISLAM","WNI",null,null,null,null,0,0,null,null,null,null,null,null,null,null,null,null,null,null,null,null,null,null,null,null,null,null,null,null,null,null,null,null,null,null,null,null,null,null,null,null,null,null,null,null,null,null,null,null,null,null,null,null,null,null,null,null,null,null,null,null,null,null,null,null,null,null,null,null,"0",0]
[4991,null,null,null,0,0,null,null,null,null,"ISLAM","WNI",null,null,null,null,0,0,null,null,null,null,null,null,null,null,null,null,null,null,null,null,null,null,null,null,null,null,null,null,null,null,null,null,null,null,null,null,null,null,null,null,null,null,null,null,null,null,null,null,null,null,null,null,null,null,null,null,null,null,null,null,null,null,null,null,null,null,null,null,"0",0]
[4992,null,null,null,0,0,null,null,null,null,"ISLAM","WNI",null,null,null,null,0,0,null,null,null,null,null,null,null,null,null,null,null,null,null,null,null,null,null,null,null,null,null,null,null,null,null,null,null,null,null,null,null,null,null,null,null,null,null,null,null,null,null,null,null,null,null,null,null,null,null,null,null,null,null,null,null,null,null,null,null,null,null,null,"0",0]
[4993,null,null,null,0,0,null,null,null,null,"ISLAM","WNI",null,null,null,null,0,0,null,null,null,null,null,null,null,null,null,null,null,null,null,null,null,null,null,null,null,null,null,null,null,null,null,null,null,null,null,null,null,null,null,null,null,null,null,null,null,null,null,null,null,null,null,null,null,null,null,null,null,null,null,null,null,null,null,null,null,null,null,null,"0",0]
[4994,null,null,null,0,0,null,null,null,null,"ISLAM","WNI",null,null,null,null,0,0,null,null,null,null,null,null,null,null,null,null,null,null,null,null,null,null,null,null,null,null,null,null,null,null,null,null,null,null,null,null,null,null,null,null,null,null,null,null,null,null,null,null,null,null,null,null,null,null,null,null,null,null,null,null,null,null,null,null,null,null,null,null,"0",0]
[4995,null,null,null,0,0,null,null,null,null,"ISLAM","WNI",null,null,null,null,0,0,null,null,null,null,null,null,null,null,null,null,null,null,null,null,null,null,null,null,null,null,null,null,null,null,null,null,null,null,null,null,null,null,null,null,null,null,null,null,null,null,null,null,null,null,null,null,null,null,null,null,null,null,null,null,null,null,null,null,null,null,null,null,"0",0]
[4996,null,null,null,0,0,null,null,null,null,"ISLAM","WNI",null,null,null,null,0,0,null,null,null,null,null,null,null,null,null,null,null,null,null,null,null,null,null,null,null,null,null,null,null,null,null,null,null,null,null,null,null,null,null,null,null,null,null,null,null,null,null,null,null,null,null,null,null,null,null,null,null,null,null,null,null,null,null,null,null,null,null,null,"0",0]
[4997,null,null,null,0,0,null,null,null,null,"ISLAM","WNI",null,null,null,null,0,0,null,null,null,null,null,null,null,null,null,null,null,null,null,null,null,null,null,null,null,null,null,null,null,null,null,null,null,null,null,null,null,null,null,null,null,null,null,null,null,null,null,null,null,null,null,null,null,null,null,null,null,null,null,null,null,null,null,null,null,null,null,null,"0",0]
[4998,null,null,null,0,0,null,null,null,null,"ISLAM","WNI",null,null,null,null,0,0,null,null,null,null,null,null,null,null,null,null,null,null,null,null,null,null,null,null,null,null,null,null,null,null,null,null,null,null,null,null,null,null,null,null,null,null,null,null,null,null,null,null,null,null,null,null,null,null,null,null,null,null,null,null,null,null,null,null,null,null,null,null,"0",0]
[4999,null,null,null,0,0,null,null,null,null,"ISLAM","WNI",null,null,null,null,0,0,null,null,null,null,null,null,null,null,null,null,null,null,null,null,null,null,null,null,null,null,null,null,null,null,null,null,null,null,null,null,null,null,null,null,null,null,null,null,null,null,null,null,null,null,null,null,null,null,null,null,null,null,null,null,null,null,null,null,null,null,null,null,"0",0]
[5000,null,null,null,0,0,null,null,null,null,"ISLAM","WNI",null,null,null,null,0,0,null,null,null,null,null,null,null,null,null,null,null,null,null,null,null,null,null,null,null,null,null,null,null,null,null,null,null,null,null,null,null,null,null,null,null,null,null,null,null,null,null,null,null,null,null,null,null,null,null,null,null,null,null,null,null,null,null,null,null,null,null,null,"0",0]

{"sheet":"INDUK40015000HAL1","index":2,"n_rows":74,"n_cols":15,"rows_kept":74,"cut":false,"hidden":false,"merged":[[6,1,10,1],[29,1,33,1],[54,4,54,7],[55,1,59,1],[55,4,55,7],[56,4,56,7],[57,4,57,7],[58,4,58,7]]}
[null,null,null,null,"Nomor Induk Murid : ",null,null,null,null,null,4324]
[null,null,null,"A.","KETERANGAN MURID"]
[null,null,null,null,"1.","Nama Murid :"]
[null,null,null,null,null,null,null,null,"a. Lengkap",null,null,{"$f":"\": \"&VLOOKUP($K$1,INDUK40015000!$A$6:$CK$1005,2)","v":": VIKA KUSUMA WATI"}]
[null,null,null,null,null,null,null,null,"b. Panggilan",null,null,{"$f":"\": \"&VLOOKUP($K$1,INDUK40015000!$A$6:$CK$1005,7)","v":": VIKA"}]
[null,null,null,null,"2.","Jenis Kelamin",null,null,null,null,null,{"$f":"\": \"&IF(VLOOKUP($K$1,INDUK40015000!$A$6:$CK$1005,8)=\"L\",\"Laki-Laki\",\"Perempuan\")","v":": Perempuan"}]
[null,"PAS FOTO 3X4cm",null,null,"3.","Kelahiran :"]
[null,null,null,null,null,null,null,null,"a. Tanggal",null,null,{"$f":"\": \"&TEXT(VLOOKUP($K$1,INDUK40015000!$A$6:$CK$1005,9),\"dd mmmm yyyy\")","v":": 03 Mei 2007"}]
[null,null,null,null,null,null,null,null,"b. Tempat",null,null,{"$f":"\": \"&VLOOKUP($K$1,INDUK40015000!$A$6:$CK$1005,10)","v":": LUMAJANG"}]
[null,null,null,null,"4.","Agama",null,null,null,null,null,{"$f":"\": \"&VLOOKUP($K$1,INDUK40015000!$A$6:$CK$1005,11)","v":": ISLAM"}]
[null,null,null,null,"5.","Kewarganegaraan",null,null,null,null,null,{"$f":"\": \"&VLOOKUP($K$1,INDUK40015000!$A$6:$CK$1005,12)","v":": WNI"}]
[null,null,null,null,"6.","Jumlah Saudara"]
[null,null,null,null,null,null,null,"a.","Kandung",null,null,{"$f":"\": \"&IF(VLOOKUP($K$1,INDUK40015000!$A$6:$CK$1005,13)=\"K\",\"Kandung\",\"-\")","v":": Kandung"}]
[null,null,null,null,null,null,null,"b.","Tiri",null,null,{"$f":"\": \"&IF(VLOOKUP($K$1,INDUK40015000!$A$6:$CK$1005,14)=\"T\",\"Tiri\",\"-\")","v":": -"}]
[null,null,null,null,null,null,null,"c.","Angkat",null,null,{"$f":"\": \"&IF(VLOOKUP($K$1,INDUK40015000!$A$6:$CK$1005,15)=\"A\",\"Angkat\",\"-\")","v":": -"}]
[null,null,null,null,"7.","Bahasa Sehari-hari Keluarga",null,null,null,null,null,{"$f":"\": \"&VLOOKUP($K$1,INDUK40015000!$A$6:$CK$1005,16)","v":": JAWA"}]
[null,null,null,null,"8.","Keadaan Jasmani"]
[null,null,null,null,null,null,null,"a.","Berat Badan",null,null,{"$f":"\": \"&VLOOKUP($K$1,INDUK40015000!$A$6:$CK$1005,17)","v":": 0"}]
[null,null,null,null,null,null,null,"b.","Tinggi Badan",null,null,{"$f":"\": \"&VLOOKUP($K$1,INDUK40015000!$A$6:$CK$1005,18)","v":": 0"}]
[null,null,null,null,null,null,null,"c.","Gol. Darah",null,null,{"$f":"\": \"&VLOOKUP($K$1,INDUK40015000!$A$6:$CK$1005,19)","v":": "}]
[null,null,null,null,null,null,null,"d.","Penyakit Berat",null,null,{"$f":"\": \"&VLOOKUP($K$1,INDUK40015000!$A$6:$CK$1005,20)","v":": "}]
[null,null,null,null,"9.","Alamat dan No. Telepon",null,null,null,null,null,{"$f":"\": \"&VLOOKUP($K$1,INDUK40015000!$A$6:$CK$1005,21)","v":": "}]
[null,null,null,null,"10.","Bertempat Tinggal Pada",null,null,null,null,null,{"$f":"\": \"&VLOOKUP($K$1,INDUK40015000!$A$6:$CK$1005,22)","v":": "}]
[null,null,null,null,"11.","Jarak Tempat Tinggal ke Sekolah",null,null,null,null,null,{"$f":"\": \"&VLOOKUP($K$1,INDUK40015000!$A$6:$CK$1005,23)","v":": "}]
[null,null,null,null,12,"Tahun Masuk Sekolah ini",null,null,null,null,null,{"$f":"\": \"&VLOOKUP($K$1,INDUK40015000!$A$6:$CK$1005,24)","v":": "}]
[null,null,null,"B.","KETERANGAN ORANG TUA / WALI MURID"]
[null,null,null,null,"1.","Nama Orang Tua kandung"]
[null,null,null,null,null,"a.",null,"Nama"]
[null,null,null,null,null,null,null,"a)","Ayah",null,null,{"$f":"\": \"&VLOOKUP($K$1,INDUK40015000!$A$6:$CK$1005,26)","v":": "}]
[null,"PAS FOTO 3X4cm",null,null,null,null,null,"b) ","Ibu",null,null,{"$f":"\": \"&VLOOKUP($K$1,INDUK40015000!$A$6:$CK$1005,27)","v":": "}]
[null,null,null,null,null,"b.",null,"Pendidikan Tertinggi"]
[null,null,null,null,null,null,null,"a)","Ayah",null,null,{"$f":"\": \"&VLOOKUP($K$1,INDUK40015000!$A$6:$CK$1005,28)","v":": "}]
[null,null,null,null,null,null,null,"b) ","Ibu",null,null,{"$f":"\": \"&VLOOKUP($K$1,INDUK40015000!$A$6:$CK$1005,29)","v":": "}]
[null,null,null,null,null,"c.",null,"Pekerjaan"]
[null,null,null,null,null,null,null,"a)","Ayah",null,null,{"$f":"\": \"&VLOOKUP($K$1,INDUK40015000!$A$6:$CK$1005,30)","v":": "}]
[null,null,null,null,null,null,null,"b) ","Ibu",null,null,{"$f":"\": \"&VLOOKUP($K$1,INDUK40015000!$A$6:$CK$1005,31)","v":": "}]
[null,null,null,null,null,"d.",null,"Wali Murid (jika mempunyai)"]
[null,null,null,null,null,null,null,"a)","Nama",null,null,{"$f":"\": \"&VLOOKUP($K$1,INDUK40015000!$A$6:$CK$1005,32)","v":": "}]
[null,null,null,null,null,null,null,"b)","Hubungan Keluarga",null,null,{"$f":"\": \"&VLOOKUP($K$1,INDUK40015000!$A$6:$CK$1005,33)","v":": "}]
[null,null,null,null,null,null,null,"c)","Pendidikan",null,null,{"$f":"\": \"&VLOOKUP($K$1,INDUK40015000!$A$6:$CK$1005,34)","v":": "}]
[null,null,null,null,null,null,null,"d)","Pekerjaan",null,null,{"$f":"\": \"&VLOOKUP($K$1,INDUK40015000!$A$6:$CK$1005,35)","v":": "}]
[null,null,null,"C.","PERKEMBANGAN MURID"]
[null,null,null,null,"1.","Pendidikan Sebelumnya :"]
[null,null,null,null,null,"a.",null,"Masuk menjadi murid baru tingkat I"]
[null,null,null,null,null,null,null,"a)","Asal Murid",null,null,{"$f":"\": \"&VLOOKUP($K$1,INDUK40015000!$A$6:$CK$1005,37)","v":": "}]
[null,null,null,null,null,null,null,"b)","Nama TK",null,null,{"$f":"\": \"&VLOOKUP($K$1,INDUK40015000!$A$6:$CK$1005,38)","v":": "}]
[null,null,null,null,null,null,null,"c)","Alamat",null,null,{"$f":"\": \"&VLOOKUP($K$1,INDUK40015000!$A$6:$CK$1005,39)","v":": "}]
[null,null,null,null,null,null,null,"d)","Tanggal dan No. STTB",null,null,{"$f":"\": \"&VLOOKUP($K$1,INDUK40015000!$A$6:$CK$1005,40)","v":": "}]
[null,null,null,null,null,"b.",null,"Pindahan dari sekolah lain"]
[null,null,null,null,null,null,null,"a)","Nama Sekolah Asal",null,null,{"$f":"\": \"&VLOOKUP($K$1,INDUK40015000!$A$6:$CK$1005,41)","v":": "}]
[null,null,null,null,null,null,null,"b)","Dari Tingkat",null,null,{"$f":"\": \"&VLOOKUP($K$1,INDUK40015000!$A$6:$CK$1005,42)","v":": "}]
[null,null,null,null,null,null,null,"c)","Diterima Tanggal",null,null,{"$f":"\": \"&VLOOKUP($K$1,INDUK40015000!$A$6:$CK$1005,43)","v":": "}]
[null,null,null,null,"2.","Prestasi Belajar (hal. Berikut)"]
[null,null,null,null,"3.","Keadaan Jasmani"]
[null,null,null,"a.","Tahun",null,null,null,{"$f":"VLOOKUP($K$1,INDUK40015000!$A$6:$CA$1005,45)","v":0},{"$f":"VLOOKUP($K$1,INDUK40015000!$A$6:$CA$1005,50)","v":0},{"$f":"VLOOKUP($K$1,INDUK40015000!$A$6:$CA$1005,55)","v":0},{"$f":"VLOOKUP($K$1,INDUK40015000!$A$6:$CK$1005,60)","v":0},{"$f":"VLOOKUP($K$1,INDUK40015000!$A$6:$CA$1005,65)","v":"2017/18"},{"$f":"VLOOKUP($K$1,INDUK40015000!$A$6:$CA$1005,70)","v":0},{"$f":"VLOOKUP($K$1,INDUK40015000!$A$6:$CA$1005,75)","v":0}]
[null,"PAS FOTO 3X4cm",null,"b.","Berat Badan",null,null,null,{"$f":"VLOOKUP($K$1,INDUK40015000!$A$6:$CK$1005,46)&\" Kg\"","v":" Kg"},{"$f":"VLOOKUP($K$1,INDUK40015000!$A$6:$CK$1005,51)&\" Kg\"","v":" Kg"},{"$f":"VLOOKUP($K$1,INDUK40015000!$A$6:$CK$1005,56)&\" Kg\"","v":" Kg"},{"$f":"VLOOKUP($K$1,INDUK40015000!$A$6:$CK$1005,61)&\" Kg\"","v":" Kg"},{"$f":"VLOOKUP($K$1,INDUK40015000!$A$6:$CK$1005,66)&\" Kg\"","v":"33 Kg"},{"$f":"VLOOKUP($K$1,INDUK40015000!$A$6:$CK$1005,71)&\" Kg\"","v":" Kg"},{"$f":"VLOOKUP($K$1,INDUK40015000!$A$6:$CK$1005,76)&\" Kg\"","v":" Kg"}]
[null,null,null,"c.","Tinggi Badan",null,null,null,{"$f":"VLOOKUP($K$1,INDUK40015000!$A$6:$CK$1005,47)&\" Cm\"","v":" Cm"},{"$f":"VLOOKUP($K$1,INDUK40015000!$A$6:$CK$1005,52)&\" Cm\"","v":" Cm"},{"$f":"VLOOKUP($K$1,INDUK40015000!$A$6:$CK$1005,57)&\" Cm\"","v":" Cm"},{"$f":"VLOOKUP($K$1,INDUK40015000!$A$6:$CK$1005,62)&\" Cm\"","v":" Cm"},{"$f":"VLOOKUP($K$1,INDUK40015000!$A$6:$CK$1005,67)&\" Cm\"","v":"137 Cm"},{"$f":"VLOOKUP($K$1,INDUK40015000!$A$6:$CK$1005,72)&\" Cm\"","v":" Cm"},{"$f":"VLOOKUP($K$1,INDUK40015000!$A$6:$CK$1005,77)&\" Cm\"","v":" Cm"}]
[null,null,null,"d.","Penyakit",null,null,null,{"$f":"VLOOKUP($K$1,INDUK40015000!$A$6:$CK$1005,48)","v":0},{"$f":"VLOOKUP($K$1,INDUK40015000!$A$6:$CK$1005,53)","v":0},{"$f":"VLOOKUP($K$1,INDUK40015000!$A$6:$CK$1005,58)","v":0},{"$f":"VLOOKUP($K$1,INDUK40015000!$A$6:$CK$1005,63)","v":0},{"$f":"VLOOKUP($K$1,INDUK40015000!$A$6:$CK$1005,68)","v":0},{"$f":"VLOOKUP($K$1,INDUK40015000!$A$6:$CK$1005,73)","v":0},{"$f":"VLOOKUP($K$1,INDUK40015000!$A$6:$CK$1005,78)","v":0}]
[null,null,null,"e.","Kelainan Jasmani",null,null,null,{"$f":"VLOOKUP($K$1,INDUK40015000!$A$6:$CK$1005,49)","v":0},{"$f":"VLOOKUP($K$1,INDUK40015000!$A$6:$CK$1005,54)","v":0},{"$f":"VLOOKUP($K$1,INDUK40015000!$A$6:$CK$1005,59)","v":0},{"$f":"VLOOKUP($K$1,INDUK40015000!$A$6:$CK$1005,64)","v":0},{"$f":"VLOOKUP($K$1,INDUK40015000!$A$6:$CK$1005,69)","v":0},{"$f":"VLOOKUP($K$1,INDUK40015000!$A$6:$CK$1005,74)","v":0},{"$f":"VLOOKUP($K$1,INDUK40015000!$A$6:$CK$1005,79)","v":0}]
[]
[null,null,null,"D.","BEA SISWA ( Jenis Beasiswa )",null,null,null,null,null,null,{"$f":"\": \"&VLOOKUP($K$1,INDUK40015000!$A$6:$CK$1005,80)","v":": "}]
[null,null,null,"E.","MENINGGALKAN MADRASAH"]
[null,null,null,null,"1.","Tamat Belajar"]
[null,null,null,null,null,"a)",null,"Tahun Tamat",null,null,null,{"$f":"\": Tahun: \"&VLOOKUP($K$1,INDUK40015000!$A$6:$CK$1005,81)","v":": Tahun: 0"}]
[null,null,null,null,null,null,null,{"$f":"\"Ijazah No. \"&IF(VLOOKUP($K$1,INDUK40015000!$A$6:$RL$1005,434,)=0,\"-\",VLOOKUP($K$1,INDUK40015000!$A$6:$RL$1005,434,))","v":"Ijazah No. -"}]
[null,null,null,null,null,"b)",null,"Melanjutkan Madrasah",null,null,null,{"$f":"\": \"&VLOOKUP($K$1,INDUK40015000!$A$6:$CK$1005,83)","v":": "}]
[null,null,null,null,"2.","Pindah Madrasah"]
[null,null,null,null,null,"a)",null,"Dari Tingkat",null,null,null,{"$f":"\": \"&VLOOKUP($K$1,INDUK40015000!$A$6:$CK$1005,84)","v":": "}]
[null,null,null,null,null,"b)",null,"Ke Sekolah",null,null,null,{"$f":"\": \"&VLOOKUP($K$1,INDUK40015000!$A$6:$CK$1005,85)","v":": "}]
[null,null,null,null,null,"c)",null,"Ke Tingkat",null,null,null,{"$f":"\": \"&VLOOKUP($K$1,INDUK40015000!$A$6:$CK$1005,86)","v":": "}]
[null,null,null,null,null,"d)",null,"Tanggal",null,null,null,{"$f":"\": \"&VLOOKUP($K$1,INDUK40015000!$A$6:$CK$1005,87)","v":": "}]
[null,null,null,null,"3.","Keluar Madrasah"]
[null,null,null,null,null,"a.",null,"Tanggal",null,null,null,{"$f":"\": \"&VLOOKUP($K$1,INDUK40015000!$A$6:$CK$1005,88)","v":": "}]
[null,null,null,null,null,"b.",null,"Alasan",null,null,null,{"$f":"\": \"&VLOOKUP($K$1,INDUK40015000!$A$6:$CK$1005,89)","v":": "}]

{"sheet":"INDUK40015000HAL2","index":3,"n_rows":55,"n_cols":32,"rows_kept":55,"cut":false,"hidden":false,"merged":[[0,26,0,27],[1,0,4,0],[1,1,4,4],[1,5,1,8],[1,9,1,12],[1,13,1,16],[1,17,1,20],[1,21,1,24],[1,25,1,28],[3,7,3,8],[1,29,1,30],[2,5,2,8],[2,9,2,12],[2,13,2,16],[2,17,2,20],[2,21,2,24],[2,25,2,28],[2,29,4,29],[2,30,4,30],[3,5,3,6],[3,27,3,28],[5,0,9,0],[5,1,5,4],[5,5,5,30],[6,2,6,4],[7,2,7,4],[8,2,8,4],[3,9,3,10],[3,11,3,12],[3,13,3,14],[3,15,3,16],[3,17,3,18],[3,19,3,20],[9,2,9,4],[10,1,10,4],[11,1,11,4],[12,1,12,4],[13,1,13,4],[14,1,14,4],[3,21,3,22],[3,23,3,24],[3,25,3,26],[15,1,15,4],[16,1,16,4],[17,1,17,4],[18,0,21,0],[18,1,18,4],[18,5,18,30],[19,2,19,4],[20,2,20,4],[21,2,21,4],[22,0,22,4],[22,5,22,30],[23,1,23,4],[23,5,23,6],[23,7,23,8],[23,9,23,10],[23,11,23,12],[23,13,23,14],[23,15,23,16],[23,17,23,18],[23,19,23,20],[24,1,24,4],[24,5,24,6],[24,7,24,8],[24,9,24,10],[24,11,24,12],[24,25,24,26],[24,27,24,28],[24,19,24,20],[24,21,24,22],[24,23,24,24],[25,15,25,16],[25,17,25,18],[24,13,24,14],[24,15,24,16],[24,17,24,18],[23,21,23,22],[23,23,23,24],[23,25,23,26],[23,27,23,28],[26,13,26,14],[26,15,26,16],[26,17,26,18],[25,19,25,20],[25,21,25,22],[25,23,25,24],[25,25,25,26],[25,27,25,28],[26,0,26,4],[26,5,26,6],[26,7,26,8],[26,9,26,10],[26,11,26,12],[26,25,26,26],[26,27,26,28],[26,19,26,20],[26,21,26,22],[26,23,26,24],[25,1,25,4],[25,5,25,6],[25,7,25,8],[25,9,25,10],[25,11,25,12],[25,13,25,14],[27,19,27,20],[27,21,27,22],[27,23,27,24],[27,25,27,26],[27,27,27,28],[28,0,28,4],[28,5,28,6],[28,7,28,8],[28,9,28,10],[28,11,28,12],[28,25,28,26],[28,27,28,28],[27,0,27,4],[27,5,27,6],[27,7,27,8],[27,9,27,10],[27,11,27,12],[27,13,27,14],[27,15,27,16],[27,17,27,18],[29,0,29,4],[29,5,29,30],[30,1,30,4],[30,5,30,6],[30,7,30,8],[30,9,30,10],[30,11,30,12],[30,13,30,14],[28,13,28,14],[28,15,28,16],[28,17,28,18],[28,19,28,20],[28,21,28,22],[28,23,28,24],[30,27,30,28],[30,15,30,16],[30,17,30,18],[30,19,30,20],[30,21,30,22],[30,23,30,24],[30,25,30,26],[35,5,35,6],[31,21,31,22],[31,23,31,24],[31,25,31,26],[31,27,31,28],[32,1,32,4],[32,5,32,6],[32,7,32,8],[32,9,32,10],[32,11,32,12],[32,13,32,14],[31,1,31,4],[31,5,31,6],[31,7,31,8],[31,9,31,10],[31,11,31,12],[31,13,31,14],[31,15,31,16],[31,17,31,18],[31,19,31,20],[34,25,34,26],[34,23,34,24],[35,25,35,26],[34,27,34,28],[32,27,32,28],[33,0,33,4],[33,5,33,30],[34,1,34,3],[34,5,34,6],[34,7,34,8],[34,9,34,10],[34,11,34,12],[34,13,34,14],[34,15,34,16],[32,15,32,16],[32,17,32,18],[32,19,32,20],[32,21,32,22],[32,23,32,24],[32,25,32,26],[34,29,37,30],[34,17,34,18],[34,19,34,20],[34,21,34,22],[36,19,36,20],[36,21,36,22],[36,23,36,24],[36,25,36,26],[35,7,35,8],[35,9,35,10],[35,11,35,12],[35,13,35,14],[35,15,35,16],[35,17,35,18],[35,19,35,20],[35,21,35,22],[35,23,35,24],[35,27,35,28],[36,1,36,3],[36,5,36,6],[36,7,36,8],[36,9,36,10],[36,11,36,12],[36,13,36,14],[35,1,35,3],[41,16,41,20],[41,28,41,30],[39,4,39,11],[41,4,41,11],[39,16,39,20],[39,28,39,30],[36,27,36,28],[37,0,37,4],[37,5,37,8],[37,9,37,12],[37,13,37,16],[37,17,37,20],[37,21,37,24],[37,25,37,28],[36,15,36,16],[36,17,36,18],[45,3,45,11],[45,16,45,22],[45,27,45,30],[54,4,54,11],[54,16,54,22],[54,27,54,30],[47,3,47,11],[47,16,47,22],[47,27,47,30],[52,4,52,11],[52,16,52,22],[52,27,52,30]]}
["V.","PENILAIAN HASIL BELAJAR ",null,null,null,null,null,null,null,null,null,null,null,null,null,null,null,null,null,null,null,"NO.INDUK",null,null,null,":",{"$f":"INDUK40015000HAL1!K1","v":4324}]
["NO","Mata Pelajaran ",null,null,null,{"$f":"\"TP. \"&IF(VLOOKUP($AA$1,INDUK40015000!$A$6:$RL$1005,147,)=0,\"-\",VLOOKUP($AA$1,INDUK40015000!$A$6:$RL$1005,147,))","v":"TP. -"},null,null,null,{"$f":"\"TP. \"&IF(VLOOKUP($AA$1,INDUK40015000!$A$6:$RL$1005,204,)=0,\"-\",VLOOKUP($AA$1,INDUK40015000!$A$6:$RL$1005,204,))","v":"TP. -"},null,null,null,{"$f":"\"TP. \"&IF(VLOOKUP($AA$1,INDUK40015000!$A$6:$RL$1005,261,)=0,\"-\",VLOOKUP($AA$1,INDUK40015000!$A$6:$RL$1005,261,))","v":"TP. -"},null,null,null,{"$f":"\"TP. \"&IF(VLOOKUP($AA$1,INDUK40015000!$A$6:$RL$1005,318,)=0,\"-\",VLOOKUP($AA$1,INDUK40015000!$A$6:$RL$1005,318,))","v":"TP. -"},null,null,null,{"$f":"\"TP. \"&IF(VLOOKUP($AA$1,INDUK40015000!$A$6:$RL$1005,375,)=0,\"-\",VLOOKUP($AA$1,INDUK40015000!$A$6:$RL$1005,375,))","v":"TP. -"},null,null,null,{"$f":"\"TP. \"&IF(VLOOKUP($AA$1,INDUK40015000!$A$6:$RL$1005,432,)=0,\"-\",VLOOKUP($AA$1,INDUK40015000!$A$6:$RL$1005,432,))","v":"TP. -"},null,null,null,"NILAI",null,15]
[null,null,null,null,null,"KELAS 1",null,null,null,"KELAS 2",null,null,null,"KELAS 3",null,null,null,"KELAS 4",null,null,null,"KELAS 5",null,null,null,"KELAS 6",null,null,null,"RAPORT + UJIAN","RATA-RATA RAPORT"]
[null,null,null,null,null,"Smt I",null,"Smt II",null,"Smt I",null,"Smt II",null,"Smt I",null,"Smt II",null,"Smt I",null,"Smt II",null,"Smt I",null,"Smt II",null,"Smt I",null,"Smt II"]
[null,null,null,null,null,"KKM","Nilai","KKM","Nilai","KKM","Nilai","KKM","Nilai","KKM","Nilai","KKM","Nilai","KKM","Nilai","KKM","Nilai","KKM","Nilai","KKM","Nilai","KKM","Nilai","KKM","Nilai"]
[1,"Pendidikan Agama Islam "]
[null,"a.","Al-qur'an Hadits",null,null,null,{"$f":"IF(VLOOKUP($AA$1,INDUK40015000!$A$6:$RL$1005,92,)=0,\"-\",VLOOKUP($AA$1,INDUK40015000!$A$6:$RL$1005,92,))","v":"-"},null,{"$f":"IF(VLOOKUP($AA$1,INDUK40015000!$A$6:$RL$1005,93,)=0,\"-\",VLOOKUP($AA$1,INDUK40015000!$A$6:$RL$1005,93,))","v":"-"},null,{"$f":"IF(VLOOKUP($AA$1,INDUK40015000!$A$6:$RL$1005,149,)=0,\"-\",VLOOKUP($AA$1,INDUK40015000!$A$6:$RL$1005,149,))","v":"-"},null,{"$f":"IF(VLOOKUP($AA$1,INDUK40015000!$A$6:$RL$1005,150,)=0,\"-\",VLOOKUP($AA$1,INDUK40015000!$A$6:$RL$1005,150,))","v":"-"},null,{"$f":"IF(VLOOKUP($AA$1,INDUK40015000!$A$6:$RL$1005,206,)=0,\"-\",VLOOKUP($AA$1,INDUK40015000!$A$6:$RL$1005,206,))","v":"-"},null,{"$f":"IF(VLOOKUP($AA$1,INDUK40015000!$A$6:$RL$1005,207,)=0,\"-\",VLOOKUP($AA$1,INDUK40015000!$A$6:$RL$1005,207,))","v":"-"},65,{"$f":"IF(VLOOKUP($AA$1,INDUK40015000!$A$6:$RL$1005,263,)=0,\"-\",VLOOKUP($AA$1,INDUK40015000!$A$6:$RL$1005,263,))","v":"-"},null,{"$f":"IF(VLOOKUP($AA$1,INDUK40015000!$A$6:$RL$1005,264,)=0,\"-\",VLOOKUP($AA$1,INDUK40015000!$A$6:$RL$1005,264,))","v":"-"},null,{"$f":"IF(VLOOKUP($AA$1,INDUK40015000!$A$6:$RL$1005,320,)=0,\"-\",VLOOKUP($AA$1,INDUK40015000!$A$6:$RL$1005,320,))","v":"-"},null,{"$f":"IF(VLOOKUP($AA$1,INDUK40015000!$A$6:$RL$1005,321,)=0,\"-\",VLOOKUP($AA$1,INDUK40015000!$A$6:$RL$1005,321,))","v":"-"},null,{"$f":"IF(VLOOKUP($AA$1,INDUK40015000!$A$6:$RL$1005,377,)=0,\"-\",VLOOKUP($AA$1,INDUK40015000!$A$6:$RL$1005,377,))","v":"-"},null,{"$f":"IF(VLOOKUP($AA$1,INDUK40015000!$A$6:$RL$1005,378,)=0,\"-\",VLOOKUP($AA$1,INDUK40015000!$A$6:$RL$1005,378,))","v":"-"},{"$f":"IF(VLOOKUP($AA$1,INDUK40015000!$A$6:$RL$1005,451,)=0,\"-\",VLOOKUP($AA$1,INDUK40015000!$A$6:$RL$1005,451,))","v":"-"},{"$f":"IF(VLOOKUP($AA$1,INDUK40015000!$A$6:$RL$1005,452,)=0,\"-\",VLOOKUP($AA$1,INDUK40015000!$A$6:$RL$1005,452,))","v":"-"},1]
[null,"b.","Aqidah Akhlaq",null,null,null,{"$f":"IF(VLOOKUP($AA$1,INDUK40015000!$A$6:$RL$1005,94,)=0,\"-\",VLOOKUP($AA$1,INDUK40015000!$A$6:$RL$1005,94,))","v":"-"},null,{"$f":"IF(VLOOKUP($AA$1,INDUK40015000!$A$6:$RL$1005,95,)=0,\"-\",VLOOKUP($AA$1,INDUK40015000!$A$6:$RL$1005,95,))","v":"-"},null,{"$f":"IF(VLOOKUP($AA$1,INDUK40015000!$A$6:$RL$1005,151,)=0,\"-\",VLOOKUP($AA$1,INDUK40015000!$A$6:$RL$1005,151,))","v":"-"},null,{"$f":"IF(VLOOKUP($AA$1,INDUK40015000!$A$6:$RL$1005,152,)=0,\"-\",VLOOKUP($AA$1,INDUK40015000!$A$6:$RL$1005,152,))","v":"-"},null,{"$f":"IF(VLOOKUP($AA$1,INDUK40015000!$A$6:$RL$1005,208,)=0,\"-\",VLOOKUP($AA$1,INDUK40015000!$A$6:$RL$1005,208,))","v":"-"},null,{"$f":"IF(VLOOKUP($AA$1,INDUK40015000!$A$6:$RL$1005,209,)=0,\"-\",VLOOKUP($AA$1,INDUK40015000!$A$6:$RL$1005,209,))","v":"-"},65,{"$f":"IF(VLOOKUP($AA$1,INDUK40015000!$A$6:$RL$1005,265,)=0,\"-\",VLOOKUP($AA$1,INDUK40015000!$A$6:$RL$1005,265,))","v":"-"},null,{"$f":"IF(VLOOKUP($AA$1,INDUK40015000!$A$6:$RL$1005,266,)=0,\"-\",VLOOKUP($AA$1,INDUK40015000!$A$6:$RL$1005,266,))","v":"-"},null,{"$f":"IF(VLOOKUP($AA$1,INDUK40015000!$A$6:$RL$1005,322,)=0,\"-\",VLOOKUP($AA$1,INDUK40015000!$A$6:$RL$1005,322,))","v":"-"},null,{"$f":"IF(VLOOKUP($AA$1,INDUK40015000!$A$6:$RL$1005,323,)=0,\"-\",VLOOKUP($AA$1,INDUK40015000!$A$6:$RL$1005,323,))","v":"-"},null,{"$f":"IF(VLOOKUP($AA$1,INDUK40015000!$A$6:$RL$1005,379,)=0,\"-\",VLOOKUP($AA$1,INDUK40015000!$A$6:$RL$1005,379,))","v":"-"},null,{"$f":"IF(VLOOKUP($AA$1,INDUK40015000!$A$6:$RL$1005,380,)=0,\"-\",VLOOKUP($AA$1,INDUK40015000!$A$6:$RL$1005,380,))","v":"-"},{"$f":"IF(VLOOKUP($AA$1,INDUK40015000!$A$6:$RL$1005,453,)=0,\"-\",VLOOKUP($AA$1,INDUK40015000!$A$6:$RL$1005,453,))","v":"-"},{"$f":"IF(VLOOKUP($AA$1,INDUK40015000!$A$6:$RL$1005,454,)=0,\"-\",VLOOKUP($AA$1,INDUK40015000!$A$6:$RL$1005,454,))","v":"-"},2]
[null,"c.","Fiqih",null,null,null,{"$f":"IF(VLOOKUP($AA$1,INDUK40015000!$A$6:$RL$1005,96,)=0,\"-\",VLOOKUP($AA$1,INDUK40015000!$A$6:$RL$1005,96,))","v":"-"},null,{"$f":"IF(VLOOKUP($AA$1,INDUK40015000!$A$6:$RL$1005,97,)=0,\"-\",VLOOKUP($AA$1,INDUK40015000!$A$6:$RL$1005,97,))","v":"-"},null,{"$f":"IF(VLOOKUP($AA$1,INDUK40015000!$A$6:$RL$1005,153,)=0,\"-\",VLOOKUP($AA$1,INDUK40015000!$A$6:$RL$1005,153,))","v":"-"},null,{"$f":"IF(VLOOKUP($AA$1,INDUK40015000!$A$6:$RL$1005,154,)=0,\"-\",VLOOKUP($AA$1,INDUK40015000!$A$6:$RL$1005,154,))","v":"-"},null,{"$f":"IF(VLOOKUP($AA$1,INDUK40015000!$A$6:$RL$1005,210,)=0,\"-\",VLOOKUP($AA$1,INDUK40015000!$A$6:$RL$1005,210,))","v":"-"},null,{"$f":"IF(VLOOKUP($AA$1,INDUK40015000!$A$6:$RL$1005,211,)=0,\"-\",VLOOKUP($AA$1,INDUK40015000!$A$6:$RL$1005,211,))","v":"-"},65,{"$f":"IF(VLOOKUP($AA$1,INDUK40015000!$A$6:$RL$1005,267,)=0,\"-\",VLOOKUP($AA$1,INDUK40015000!$A$6:$RL$1005,267,))","v":"-"},null,{"$f":"IF(VLOOKUP($AA$1,INDUK40015000!$A$6:$RL$1005,268,)=0,\"-\",VLOOKUP($AA$1,INDUK40015000!$A$6:$RL$1005,268,))","v":"-"},null,{"$f":"IF(VLOOKUP($AA$1,INDUK40015000!$A$6:$RL$1005,324,)=0,\"-\",VLOOKUP($AA$1,INDUK40015000!$A$6:$RL$1005,324,))","v":"-"},null,{"$f":"IF(VLOOKUP($AA$1,INDUK40015000!$A$6:$RL$1005,325,)=0,\"-\",VLOOKUP($AA$1,INDUK40015000!$A$6:$RL$1005,325,))","v":"-"},null,{"$f":"IF(VLOOKUP($AA$1,INDUK40015000!$A$6:$RL$1005,381,)=0,\"-\",VLOOKUP($AA$1,INDUK40015000!$A$6:$RL$1005,381,))","v":"-"},null,{"$f":"IF(VLOOKUP($AA$1,INDUK40015000!$A$6:$RL$1005,382,)=0,\"-\",VLOOKUP($AA$1,INDUK40015000!$A$6:$RL$1005,382,))","v":"-"},{"$f":"IF(VLOOKUP($AA$1,INDUK40015000!$A$6:$RL$1005,455,)=0,\"-\",VLOOKUP($AA$1,INDUK40015000!$A$6:$RL$1005,455,))","v":"-"},{"$f":"IF(VLOOKUP($AA$1,INDUK40015000!$A$6:$RL$1005,456,)=0,\"-\",VLOOKUP($AA$1,INDUK40015000!$A$6:$RL$1005,456,))","v":"-"},3]
[null,"d.","Sejarah Kebudayaan Islam",null,null,null,{"$f":"IF(VLOOKUP($AA$1,INDUK40015000!$A$6:$RL$1005,98,)=0,\"-\",VLOOKUP($AA$1,INDUK40015000!$A$6:$RL$1005,98,))","v":"-"},null,{"$f":"IF(VLOOKUP($AA$1,INDUK40015000!$A$6:$RL$1005,99,)=0,\"-\",VLOOKUP($AA$1,INDUK40015000!$A$6:$RL$1005,99,))","v":"-"},null,{"$f":"IF(VLOOKUP($AA$1,INDUK40015000!$A$6:$RL$1005,155,)=0,\"-\",VLOOKUP($AA$1,INDUK40015000!$A$6:$RL$1005,155,))","v":"-"},null,{"$f":"IF(VLOOKUP($AA$1,INDUK40015000!$A$6:$RL$1005,156,)=0,\"-\",VLOOKUP($AA$1,INDUK40015000!$A$6:$RL$1005,156,))","v":"-"},null,{"$f":"IF(VLOOKUP($AA$1,INDUK40015000!$A$6:$RL$1005,212,)=0,\"-\",VLOOKUP($AA$1,INDUK40015000!$A$6:$RL$1005,212,))","v":"-"},null,{"$f":"IF(VLOOKUP($AA$1,INDUK40015000!$A$6:$RL$1005,213,)=0,\"-\",VLOOKUP($AA$1,INDUK40015000!$A$6:$RL$1005,213,))","v":"-"},65,{"$f":"IF(VLOOKUP($AA$1,INDUK40015000!$A$6:$RL$1005,269,)=0,\"-\",VLOOKUP($AA$1,INDUK40015000!$A$6:$RL$1005,269,))","v":"-"},null,{"$f":"IF(VLOOKUP($AA$1,INDUK40015000!$A$6:$RL$1005,270,)=0,\"-\",VLOOKUP($AA$1,INDUK40015000!$A$6:$RL$1005,270,))","v":"-"},null,{"$f":"IF(VLOOKUP($AA$1,INDUK40015000!$A$6:$RL$1005,326,)=0,\"-\",VLOOKUP($AA$1,INDUK40015000!$A$6:$RL$1005,326,))","v":"-"},null,{"$f":"IF(VLOOKUP($AA$1,INDUK40015000!$A$6:$RL$1005,327,)=0,\"-\",VLOOKUP($AA$1,INDUK40015000!$A$6:$RL$1005,327,))","v":"-"},null,{"$f":"IF(VLOOKUP($AA$1,INDUK40015000!$A$6:$RL$1005,383,)=0,\"-\",VLOOKUP($AA$1,INDUK40015000!$A$6:$RL$1005,383,))","v":"-"},null,{"$f":"IF(VLOOKUP($AA$1,INDUK40015000!$A$6:$RL$1005,384,)=0,\"-\",VLOOKUP($AA$1,INDUK40015000!$A$6:$RL$1005,384,))","v":"-"},{"$f":"IF(VLOOKUP($AA$1,INDUK40015000!$A$6:$RL$1005,457,)=0,\"-\",VLOOKUP($AA$1,INDUK40015000!$A$6:$RL$1005,457,))","v":"-"},{"$f":"IF(VLOOKUP($AA$1,INDUK40015000!$A$6:$RL$1005,458,)=0,\"-\",VLOOKUP($AA$1,INDUK40015000!$A$6:$RL$1005,458,))","v":"-"},4]
[2,"Pendidikan Kewarganegaraan",null,null,null,null,{"$f":"IF(VLOOKUP($AA$1,INDUK40015000!$A$6:$RL$1005,104,)=0,\"-\",VLOOKUP($AA$1,INDUK40015000!$A$6:$RL$1005,104,))","v":"-"},null,{"$f":"IF(VLOOKUP($AA$1,INDUK40015000!$A$6:$RL$1005,105,)=0,\"-\",VLOOKUP($AA$1,INDUK40015000!$A$6:$RL$1005,105,))","v":"-"},null,{"$f":"IF(VLOOKUP($AA$1,INDUK40015000!$A$6:$RL$1005,161,)=0,\"-\",VLOOKUP($AA$1,INDUK40015000!$A$6:$RL$1005,161,))","v":"-"},null,{"$f":"IF(VLOOKUP($AA$1,INDUK40015000!$A$6:$RL$1005,162,)=0,\"-\",VLOOKUP($AA$1,INDUK40015000!$A$6:$RL$1005,162,))","v":"-"},null,{"$f":"IF(VLOOKUP($AA$1,INDUK40015000!$A$6:$RL$1005,218,)=0,\"-\",VLOOKUP($AA$1,INDUK40015000!$A$6:$RL$1005,218,))","v":"-"},null,{"$f":"IF(VLOOKUP($AA$1,INDUK40015000!$A$6:$RL$1005,219,)=0,\"-\",VLOOKUP($AA$1,INDUK40015000!$A$6:$RL$1005,219,))","v":"-"},65,{"$f":"IF(VLOOKUP($AA$1,INDUK40015000!$A$6:$RL$1005,275,)=0,\"-\",VLOOKUP($AA$1,INDUK40015000!$A$6:$RL$1005,275,))","v":"-"},null,{"$f":"IF(VLOOKUP($AA$1,INDUK40015000!$A$6:$RL$1005,276,)=0,\"-\",VLOOKUP($AA$1,INDUK40015000!$A$6:$RL$1005,276,))","v":"-"},null,{"$f":"IF(VLOOKUP($AA$1,INDUK40015000!$A$6:$RL$1005,332,)=0,\"-\",VLOOKUP($AA$1,INDUK40015000!$A$6:$RL$1005,332,))","v":"-"},null,{"$f":"IF(VLOOKUP($AA$1,INDUK40015000!$A$6:$RL$1005,333,)=0,\"-\",VLOOKUP($AA$1,INDUK40015000!$A$6:$RL$1005,333,))","v":"-"},null,{"$f":"IF(VLOOKUP($AA$1,INDUK40015000!$A$6:$RL$1005,389,)=0,\"-\",VLOOKUP($AA$1,INDUK40015000!$A$6:$RL$1005,389,))","v":"-"},null,{"$f":"IF(VLOOKUP($AA$1,INDUK40015000!$A$6:$RL$1005,390,)=0,\"-\",VLOOKUP($AA$1,INDUK40015000!$A$6:$RL$1005,390,))","v":"-"},{"$f":"IF(VLOOKUP($AA$1,INDUK40015000!$A$6:$RL$1005,463,)=0,\"-\",VLOOKUP($AA$1,INDUK40015000!$A$6:$RL$1005,463,))","v":"-"},{"$f":"IF(VLOOKUP($AA$1,INDUK40015000!$A$6:$RL$1005,464,)=0,\"-\",VLOOKUP($AA$1,INDUK40015000!$A$6:$RL$1005,464,))","v":"-"},7]
[3,"Bahasa Indonesia",null,null,null,null,{"$f":"IF(VLOOKUP($AA$1,INDUK40015000!$A$6:$RL$1005,106,)=0,\"-\",VLOOKUP($AA$1,INDUK40015000!$A$6:$RL$1005,106,))","v":"-"},null,{"$f":"IF(VLOOKUP($AA$1,INDUK40015000!$A$6:$RL$1005,107,)=0,\"-\",VLOOKUP($AA$1,INDUK40015000!$A$6:$RL$1005,107,))","v":"-"},null,{"$f":"IF(VLOOKUP($AA$1,INDUK40015000!$A$6:$RL$1005,163,)=0,\"-\",VLOOKUP($AA$1,INDUK40015000!$A$6:$RL$1005,163,))","v":"-"},null,{"$f":"IF(VLOOKUP($AA$1,INDUK40015000!$A$6:$RL$1005,164,)=0,\"-\",VLOOKUP($AA$1,INDUK40015000!$A$6:$RL$1005,164,))","v":"-"},null,{"$f":"IF(VLOOKUP($AA$1,INDUK40015000!$A$6:$RL$1005,220,)=0,\"-\",VLOOKUP($AA$1,INDUK40015000!$A$6:$RL$1005,220,))","v":"-"},null,{"$f":"IF(VLOOKUP($AA$1,INDUK40015000!$A$6:$RL$1005,221,)=0,\"-\",VLOOKUP($AA$1,INDUK40015000!$A$6:$RL$1005,221,))","v":"-"},65,{"$f":"IF(VLOOKUP($AA$1,INDUK40015000!$A$6:$RL$1005,277,)=0,\"-\",VLOOKUP($AA$1,INDUK40015000!$A$6:$RL$1005,277,))","v":"-"},null,{"$f":"IF(VLOOKUP($AA$1,INDUK40015000!$A$6:$RL$1005,278,)=0,\"-\",VLOOKUP($AA$1,INDUK40015000!$A$6:$RL$1005,278,))","v":"-"},null,{"$f":"IF(VLOOKUP($AA$1,INDUK40015000!$A$6:$RL$1005,334,)=0,\"-\",VLOOKUP($AA$1,INDUK40015000!$A$6:$RL$1005,334,))","v":"-"},null,{"$f":"IF(VLOOKUP($AA$1,INDUK40015000!$A$6:$RL$1005,335,)=0,\"-\",VLOOKUP($AA$1,INDUK40015000!$A$6:$RL$1005,335,))","v":"-"},null,{"$f":"IF(VLOOKUP($AA$1,INDUK40015000!$A$6:$RL$1005,391,)=0,\"-\",VLOOKUP($AA$1,INDUK40015000!$A$6:$RL$1005,391,))","v":"-"},null,{"$f":"IF(VLOOKUP($AA$1,INDUK40015000!$A$6:$RL$1005,392,)=0,\"-\",VLOOKUP($AA$1,INDUK40015000!$A$6:$RL$1005,392,))","v":"-"},{"$f":"IF(VLOOKUP($AA$1,INDUK40015000!$A$6:$RL$1005,465,)=0,\"-\",VLOOKUP($AA$1,INDUK40015000!$A$6:$RL$1005,465,))","v":"-"},{"$f":"IF(VLOOKUP($AA$1,INDUK40015000!$A$6:$RL$1005,466,)=0,\"-\",VLOOKUP($AA$1,INDUK40015000!$A$6:$RL$1005,466,))","v":"-"},8]
[4,"Bahasa Arab",null,null,null,null,{"$f":"IF(VLOOKUP($AA$1,INDUK40015000!$A$6:$RL$1005,102,)=0,\"-\",VLOOKUP($AA$1,INDUK40015000!$A$6:$RL$1005,102,))","v":"-"},null,{"$f":"IF(VLOOKUP($AA$1,INDUK40015000!$A$6:$RL$1005,103,)=0,\"-\",VLOOKUP($AA$1,INDUK40015000!$A$6:$RL$1005,103,))","v":"-"},null,{"$f":"IF(VLOOKUP($AA$1,INDUK40015000!$A$6:$RL$1005,159,)=0,\"-\",VLOOKUP($AA$1,INDUK40015000!$A$6:$RL$1005,159,))","v":"-"},null,{"$f":"IF(VLOOKUP($AA$1,INDUK40015000!$A$6:$RL$1005,160,)=0,\"-\",VLOOKUP($AA$1,INDUK40015000!$A$6:$RL$1005,160,))","v":"-"},null,{"$f":"IF(VLOOKUP($AA$1,INDUK40015000!$A$6:$RL$1005,216,)=0,\"-\",VLOOKUP($AA$1,INDUK40015000!$A$6:$RL$1005,216,))","v":"-"},null,{"$f":"IF(VLOOKUP($AA$1,INDUK40015000!$A$6:$RL$1005,217,)=0,\"-\",VLOOKUP($AA$1,INDUK40015000!$A$6:$RL$1005,217,))","v":"-"},60,{"$f":"IF(VLOOKUP($AA$1,INDUK40015000!$A$6:$RL$1005,273,)=0,\"-\",VLOOKUP($AA$1,INDUK40015000!$A$6:$RL$1005,273,))","v":"-"},null,{"$f":"IF(VLOOKUP($AA$1,INDUK40015000!$A$6:$RL$1005,274,)=0,\"-\",VLOOKUP($AA$1,INDUK40015000!$A$6:$RL$1005,274,))","v":"-"},null,{"$f":"IF(VLOOKUP($AA$1,INDUK40015000!$A$6:$RL$1005,330,)=0,\"-\",VLOOKUP($AA$1,INDUK40015000!$A$6:$RL$1005,330,))","v":"-"},null,{"$f":"IF(VLOOKUP($AA$1,INDUK40015000!$A$6:$RL$1005,331,)=0,\"-\",VLOOKUP($AA$1,INDUK40015000!$A$6:$RL$1005,331,))","v":"-"},null,{"$f":"IF(VLOOKUP($AA$1,INDUK40015000!$A$6:$RL$1005,387,)=0,\"-\",VLOOKUP($AA$1,INDUK40015000!$A$6:$RL$1005,387,))","v":"-"},null,{"$f":"IF(VLOOKUP($AA$1,INDUK40015000!$A$6:$RL$1005,388,)=0,\"-\",VLOOKUP($AA$1,INDUK40015000!$A$6:$RL$1005,388,))","v":"-"},{"$f":"IF(VLOOKUP($AA$1,INDUK40015000!$A$6:$RL$1005,461,)=0,\"-\",VLOOKUP($AA$1,INDUK40015000!$A$6:$RL$1005,461,))","v":"-"},{"$f":"IF(VLOOKUP($AA$1,INDUK40015000!$A$6:$RL$1005,462,)=0,\"-\",VLOOKUP($AA$1,INDUK40015000!$A$6:$RL$1005,462,))","v":"-"},6]
[5,"Matematika",null,null,null,null,{"$f":"IF(VLOOKUP($AA$1,INDUK40015000!$A$6:$RL$1005,108,)=0,\"-\",VLOOKUP($AA$1,INDUK40015000!$A$6:$RL$1005,108,))","v":"-"},null,{"$f":"IF(VLOOKUP($AA$1,INDUK40015000!$A$6:$RL$1005,109,)=0,\"-\",VLOOKUP($AA$1,INDUK40015000!$A$6:$RL$1005,109,))","v":"-"},null,{"$f":"IF(VLOOKUP($AA$1,INDUK40015000!$A$6:$RL$1005,165,)=0,\"-\",VLOOKUP($AA$1,INDUK40015000!$A$6:$RL$1005,165,))","v":"-"},null,{"$f":"IF(VLOOKUP($AA$1,INDUK40015000!$A$6:$RL$1005,166,)=0,\"-\",VLOOKUP($AA$1,INDUK40015000!$A$6:$RL$1005,166,))","v":"-"},null,{"$f":"IF(VLOOKUP($AA$1,INDUK40015000!$A$6:$RL$1005,222,)=0,\"-\",VLOOKUP($AA$1,INDUK40015000!$A$6:$RL$1005,222,))","v":"-"},null,{"$f":"IF(VLOOKUP($AA$1,INDUK40015000!$A$6:$RL$1005,223,)=0,\"-\",VLOOKUP($AA$1,INDUK40015000!$A$6:$RL$1005,223,))","v":"-"},60,{"$f":"IF(VLOOKUP($AA$1,INDUK40015000!$A$6:$RL$1005,279,)=0,\"-\",VLOOKUP($AA$1,INDUK40015000!$A$6:$RL$1005,279,))","v":"-"},null,{"$f":"IF(VLOOKUP($AA$1,INDUK40015000!$A$6:$RL$1005,280,)=0,\"-\",VLOOKUP($AA$1,INDUK40015000!$A$6:$RL$1005,280,))","v":"-"},null,{"$f":"IF(VLOOKUP($AA$1,INDUK40015000!$A$6:$RL$1005,336,)=0,\"-\",VLOOKUP($AA$1,INDUK40015000!$A$6:$RL$1005,336,))","v":"-"},null,{"$f":"IF(VLOOKUP($AA$1,INDUK40015000!$A$6:$RL$1005,337,)=0,\"-\",VLOOKUP($AA$1,INDUK40015000!$A$6:$RL$1005,337,))","v":"-"},null,{"$f":"IF(VLOOKUP($AA$1,INDUK40015000!$A$6:$RL$1005,393,)=0,\"-\",VLOOKUP($AA$1,INDUK40015000!$A$6:$RL$1005,393,))","v":"-"},null,{"$f":"IF(VLOOKUP($AA$1,INDUK40015000!$A$6:$RL$1005,394,)=0,\"-\",VLOOKUP($AA$1,INDUK40015000!$A$6:$RL$1005,394,))","v":"-"},{"$f":"IF(VLOOKUP($AA$1,INDUK40015000!$A$6:$RL$1005,467,)=0,\"-\",VLOOKUP($AA$1,INDUK40015000!$A$6:$RL$1005,467,))","v":"-"},{"$f":"IF(VLOOKUP($AA$1,INDUK40015000!$A$6:$RL$1005,468,)=0,\"-\",VLOOKUP($AA$1,INDUK40015000!$A$6:$RL$1005,468,))","v":"-"},9]
[6,"Ilmu Pengetahuan Alam",null,null,null,null,{"$f":"IF(VLOOKUP($AA$1,INDUK40015000!$A$6:$RL$1005,110,)=0,\"-\",VLOOKUP($AA$1,INDUK40015000!$A$6:$RL$1005,110,))","v":"-"},null,{"$f":"IF(VLOOKUP($AA$1,INDUK40015000!$A$6:$RL$1005,111,)=0,\"-\",VLOOKUP($AA$1,INDUK40015000!$A$6:$RL$1005,111,))","v":"-"},null,{"$f":"IF(VLOOKUP($AA$1,INDUK40015000!$A$6:$RL$1005,167,)=0,\"-\",VLOOKUP($AA$1,INDUK40015000!$A$6:$RL$1005,167,))","v":"-"},null,{"$f":"IF(VLOOKUP($AA$1,INDUK40015000!$A$6:$RL$1005,168,)=0,\"-\",VLOOKUP($AA$1,INDUK40015000!$A$6:$RL$1005,168,))","v":"-"},null,{"$f":"IF(VLOOKUP($AA$1,INDUK40015000!$A$6:$RL$1005,224,)=0,\"-\",VLOOKUP($AA$1,INDUK40015000!$A$6:$RL$1005,224,))","v":"-"},null,{"$f":"IF(VLOOKUP($AA$1,INDUK40015000!$A$6:$RL$1005,225,)=0,\"-\",VLOOKUP($AA$1,INDUK40015000!$A$6:$RL$1005,225,))","v":"-"},60,{"$f":"IF(VLOOKUP($AA$1,INDUK40015000!$A$6:$RL$1005,281,)=0,\"-\",VLOOKUP($AA$1,INDUK40015000!$A$6:$RL$1005,281,))","v":"-"},null,{"$f":"IF(VLOOKUP($AA$1,INDUK40015000!$A$6:$RL$1005,282,)=0,\"-\",VLOOKUP($AA$1,INDUK40015000!$A$6:$RL$1005,282,))","v":"-"},null,{"$f":"IF(VLOOKUP($AA$1,INDUK40015000!$A$6:$RL$1005,338,)=0,\"-\",VLOOKUP($AA$1,INDUK40015000!$A$6:$RL$1005,338,))","v":"-"},null,{"$f":"IF(VLOOKUP($AA$1,INDUK40015000!$A$6:$RL$1005,339,)=0,\"-\",VLOOKUP($AA$1,INDUK40015000!$A$6:$RL$1005,339,))","v":"-"},null,{"$f":"IF(VLOOKUP($AA$1,INDUK40015000!$A$6:$RL$1005,395,)=0,\"-\",VLOOKUP($AA$1,INDUK40015000!$A$6:$RL$1005,395,))","v":"-"},null,{"$f":"IF(VLOOKUP($AA$1,INDUK40015000!$A$6:$RL$1005,396,)=0,\"-\",VLOOKUP($AA$1,INDUK40015000!$A$6:$RL$1005,396,))","v":"-"},{"$f":"IF(VLOOKUP($AA$1,INDUK40015000!$A$6:$RL$1005,469,)=0,\"-\",VLOOKUP($AA$1,INDUK40015000!$A$6:$RL$1005,469,))","v":"-"},{"$f":"IF(VLOOKUP($AA$1,INDUK40015000!$A$6:$RL$1005,470,)=0,\"-\",VLOOKUP($AA$1,INDUK40015000!$A$6:$RL$1005,470,))","v":"-"},10]
[7,"Ilmu Pengetahuan Sosial",null,null,null,null,{"$f":"IF(VLOOKUP($AA$1,INDUK40015000!$A$6:$RL$1005,112,)=0,\"-\",VLOOKUP($AA$1,INDUK40015000!$A$6:$RL$1005,112,))","v":"-"},null,{"$f":"IF(VLOOKUP($AA$1,INDUK40015000!$A$6:$RL$1005,113,)=0,\"-\",VLOOKUP($AA$1,INDUK40015000!$A$6:$RL$1005,113,))","v":"-"},null,{"$f":"IF(VLOOKUP($AA$1,INDUK40015000!$A$6:$RL$1005,169,)=0,\"-\",VLOOKUP($AA$1,INDUK40015000!$A$6:$RL$1005,169,))","v":"-"},null,{"$f":"IF(VLOOKUP($AA$1,INDUK40015000!$A$6:$RL$1005,170,)=0,\"-\",VLOOKUP($AA$1,INDUK40015000!$A$6:$RL$1005,170,))","v":"-"},null,{"$f":"IF(VLOOKUP($AA$1,INDUK40015000!$A$6:$RL$1005,226,)=0,\"-\",VLOOKUP($AA$1,INDUK40015000!$A$6:$RL$1005,226,))","v":"-"},null,{"$f":"IF(VLOOKUP($AA$1,INDUK40015000!$A$6:$RL$1005,227,)=0,\"-\",VLOOKUP($AA$1,INDUK40015000!$A$6:$RL$1005,227,))","v":"-"},60,{"$f":"IF(VLOOKUP($AA$1,INDUK40015000!$A$6:$RL$1005,283,)=0,\"-\",VLOOKUP($AA$1,INDUK40015000!$A$6:$RL$1005,283,))","v":"-"},null,{"$f":"IF(VLOOKUP($AA$1,INDUK40015000!$A$6:$RL$1005,284,)=0,\"-\",VLOOKUP($AA$1,INDUK40015000!$A$6:$RL$1005,284,))","v":"-"},null,{"$f":"IF(VLOOKUP($AA$1,INDUK40015000!$A$6:$RL$1005,340,)=0,\"-\",VLOOKUP($AA$1,INDUK40015000!$A$6:$RL$1005,340,))","v":"-"},null,{"$f":"IF(VLOOKUP($AA$1,INDUK40015000!$A$6:$RL$1005,341,)=0,\"-\",VLOOKUP($AA$1,INDUK40015000!$A$6:$RL$1005,341,))","v":"-"},null,{"$f":"IF(VLOOKUP($AA$1,INDUK40015000!$A$6:$RL$1005,397,)=0,\"-\",VLOOKUP($AA$1,INDUK40015000!$A$6:$RL$1005,397,))","v":"-"},null,{"$f":"IF(VLOOKUP($AA$1,INDUK40015000!$A$6:$RL$1005,398,)=0,\"-\",VLOOKUP($AA$1,INDUK40015000!$A$6:$RL$1005,398,))","v":"-"},{"$f":"IF(VLOOKUP($AA$1,INDUK40015000!$A$6:$RL$1005,471,)=0,\"-\",VLOOKUP($AA$1,INDUK40015000!$A$6:$RL$1005,471,))","v":"-"},{"$f":"IF(VLOOKUP($AA$1,INDUK40015000!$A$6:$RL$1005,472,)=0,\"-\",VLOOKUP($AA$1,INDUK40015000!$A$6:$RL$1005,472,))","v":"-"},11]
[8,"Seni Budaya dan Keterampilan",null,null,null,null,{"$f":"IF(VLOOKUP($AA$1,INDUK40015000!$A$6:$RL$1005,114,)=0,\"-\",VLOOKUP($AA$1,INDUK40015000!$A$6:$RL$1005,114,))","v":"-"},null,{"$f":"IF(VLOOKUP($AA$1,INDUK40015000!$A$6:$RL$1005,115,)=0,\"-\",VLOOKUP($AA$1,INDUK40015000!$A$6:$RL$1005,115,))","v":"-"},null,{"$f":"IF(VLOOKUP($AA$1,INDUK40015000!$A$6:$RL$1005,171,)=0,\"-\",VLOOKUP($AA$1,INDUK40015000!$A$6:$RL$1005,171,))","v":"-"},null,{"$f":"IF(VLOOKUP($AA$1,INDUK40015000!$A$6:$RL$1005,172,)=0,\"-\",VLOOKUP($AA$1,INDUK40015000!$A$6:$RL$1005,172,))","v":"-"},null,{"$f":"IF(VLOOKUP($AA$1,INDUK40015000!$A$6:$RL$1005,228,)=0,\"-\",VLOOKUP($AA$1,INDUK40015000!$A$6:$RL$1005,228,))","v":"-"},null,{"$f":"IF(VLOOKUP($AA$1,INDUK40015000!$A$6:$RL$1005,229,)=0,\"-\",VLOOKUP($AA$1,INDUK40015000!$A$6:$RL$1005,229,))","v":"-"},70,{"$f":"IF(VLOOKUP($AA$1,INDUK40015000!$A$6:$RL$1005,285,)=0,\"-\",VLOOKUP($AA$1,INDUK40015000!$A$6:$RL$1005,285,))","v":"-"},null,{"$f":"IF(VLOOKUP($AA$1,INDUK40015000!$A$6:$RL$1005,286,)=0,\"-\",VLOOKUP($AA$1,INDUK40015000!$A$6:$RL$1005,286,))","v":"-"},null,{"$f":"IF(VLOOKUP($AA$1,INDUK40015000!$A$6:$RL$1005,342,)=0,\"-\",VLOOKUP($AA$1,INDUK40015000!$A$6:$RL$1005,342,))","v":"-"},null,{"$f":"IF(VLOOKUP($AA$1,INDUK40015000!$A$6:$RL$1005,343,)=0,\"-\",VLOOKUP($AA$1,INDUK40015000!$A$6:$RL$1005,343,))","v":"-"},null,{"$f":"IF(VLOOKUP($AA$1,INDUK40015000!$A$6:$RL$1005,399,)=0,\"-\",VLOOKUP($AA$1,INDUK40015000!$A$6:$RL$1005,399,))","v":"-"},null,{"$f":"IF(VLOOKUP($AA$1,INDUK40015000!$A$6:$RL$1005,400,)=0,\"-\",VLOOKUP($AA$1,INDUK40015000!$A$6:$RL$1005,400,))","v":"-"},{"$f":"IF(VLOOKUP($AA$1,INDUK40015000!$A$6:$RL$1005,473,)=0,\"-\",VLOOKUP($AA$1,INDUK40015000!$A$6:$RL$1005,473,))","v":"-"},{"$f":"IF(VLOOKUP($AA$1,INDUK40015000!$A$6:$RL$1005,474,)=0,\"-\",VLOOKUP($AA$1,INDUK40015000!$A$6:$RL$1005,474,))","v":"-"},12]
[9,"Pend. Jasmani, Olah Raga dan Kesehatan",null,null,null,null,{"$f":"IF(VLOOKUP($AA$1,INDUK40015000!$A$6:$RL$1005,116,)=0,\"-\",VLOOKUP($AA$1,INDUK40015000!$A$6:$RL$1005,116,))","v":"-"},null,{"$f":"IF(VLOOKUP($AA$1,INDUK40015000!$A$6:$RL$1005,117,)=0,\"-\",VLOOKUP($AA$1,INDUK40015000!$A$6:$RL$1005,117,))","v":"-"},null,{"$f":"IF(VLOOKUP($AA$1,INDUK40015000!$A$6:$RL$1005,173,)=0,\"-\",VLOOKUP($AA$1,INDUK40015000!$A$6:$RL$1005,173,))","v":"-"},null,{"$f":"IF(VLOOKUP($AA$1,INDUK40015000!$A$6:$RL$1005,174,)=0,\"-\",VLOOKUP($AA$1,INDUK40015000!$A$6:$RL$1005,174,))","v":"-"},null,{"$f":"IF(VLOOKUP($AA$1,INDUK40015000!$A$6:$RL$1005,230,)=0,\"-\",VLOOKUP($AA$1,INDUK40015000!$A$6:$RL$1005,230,))","v":"-"},null,{"$f":"IF(VLOOKUP($AA$1,INDUK40015000!$A$6:$RL$1005,231,)=0,\"-\",VLOOKUP($AA$1,INDUK40015000!$A$6:$RL$1005,231,))","v":"-"},70,{"$f":"IF(VLOOKUP($AA$1,INDUK40015000!$A$6:$RL$1005,287,)=0,\"-\",VLOOKUP($AA$1,INDUK40015000!$A$6:$RL$1005,287,))","v":"-"},null,{"$f":"IF(VLOOKUP($AA$1,INDUK40015000!$A$6:$RL$1005,288,)=0,\"-\",VLOOKUP($AA$1,INDUK40015000!$A$6:$RL$1005,288,))","v":"-"},null,{"$f":"IF(VLOOKUP($AA$1,INDUK40015000!$A$6:$RL$1005,344,)=0,\"-\",VLOOKUP($AA$1,INDUK40015000!$A$6:$RL$1005,344,))","v":"-"},null,{"$f":"IF(VLOOKUP($AA$1,INDUK40015000!$A$6:$RL$1005,345,)=0,\"-\",VLOOKUP($AA$1,INDUK40015000!$A$6:$RL$1005,345,))","v":"-"},null,{"$f":"IF(VLOOKUP($AA$1,INDUK40015000!$A$6:$RL$1005,401,)=0,\"-\",VLOOKUP($AA$1,INDUK40015000!$A$6:$RL$1005,401,))","v":"-"},null,{"$f":"IF(VLOOKUP($AA$1,INDUK40015000!$A$6:$RL$1005,402,)=0,\"-\",VLOOKUP($AA$1,INDUK40015000!$A$6:$RL$1005,402,))","v":"-"},{"$f":"IF(VLOOKUP($AA$1,INDUK40015000!$A$6:$RL$1005,475,)=0,\"-\",VLOOKUP($AA$1,INDUK40015000!$A$6:$RL$1005,475,))","v":"-"},{"$f":"IF(VLOOKUP($AA$1,INDUK40015000!$A$6:$RL$1005,476,)=0,\"-\",VLOOKUP($AA$1,INDUK40015000!$A$6:$RL$1005,476,))","v":"-"},13]
[10,"Muatan Lokal"]
[null,"a.","Bahasa Jawa",null,null,null,{"$f":"IF(VLOOKUP($AA$1,INDUK40015000!$A$6:$RL$1005,118,)=0,\"-\",VLOOKUP($AA$1,INDUK40015000!$A$6:$RL$1005,118,))","v":"-"},null,{"$f":"IF(VLOOKUP($AA$1,INDUK40015000!$A$6:$RL$1005,119,)=0,\"-\",VLOOKUP($AA$1,INDUK40015000!$A$6:$RL$1005,119,))","v":"-"},null,{"$f":"IF(VLOOKUP($AA$1,INDUK40015000!$A$6:$RL$1005,175,)=0,\"-\",VLOOKUP($AA$1,INDUK40015000!$A$6:$RL$1005,175,))","v":"-"},null,{"$f":"IF(VLOOKUP($AA$1,INDUK40015000!$A$6:$RL$1005,176,)=0,\"-\",VLOOKUP($AA$1,INDUK40015000!$A$6:$RL$1005,176,))","v":"-"},null,{"$f":"IF(VLOOKUP($AA$1,INDUK40015000!$A$6:$RL$1005,232,)=0,\"-\",VLOOKUP($AA$1,INDUK40015000!$A$6:$RL$1005,232,))","v":"-"},null,{"$f":"IF(VLOOKUP($AA$1,INDUK40015000!$A$6:$RL$1005,233,)=0,\"-\",VLOOKUP($AA$1,INDUK40015000!$A$6:$RL$1005,233,))","v":"-"},60,{"$f":"IF(VLOOKUP($AA$1,INDUK40015000!$A$6:$RL$1005,289,)=0,\"-\",VLOOKUP($AA$1,INDUK40015000!$A$6:$RL$1005,289,))","v":"-"},null,{"$f":"IF(VLOOKUP($AA$1,INDUK40015000!$A$6:$RL$1005,290,)=0,\"-\",VLOOKUP($AA$1,INDUK40015000!$A$6:$RL$1005,290,))","v":"-"},null,{"$f":"IF(VLOOKUP($AA$1,INDUK40015000!$A$6:$RL$1005,346,)=0,\"-\",VLOOKUP($AA$1,INDUK40015000!$A$6:$RL$1005,346,))","v":"-"},null,{"$f":"IF(VLOOKUP($AA$1,INDUK40015000!$A$6:$RL$1005,347,)=0,\"-\",VLOOKUP($AA$1,INDUK40015000!$A$6:$RL$1005,347,))","v":"-"},null,{"$f":"IF(VLOOKUP($AA$1,INDUK40015000!$A$6:$RL$1005,403,)=0,\"-\",VLOOKUP($AA$1,INDUK40015000!$A$6:$RL$1005,403,))","v":"-"},null,{"$f":"IF(VLOOKUP($AA$1,INDUK40015000!$A$6:$RL$1005,404,)=0,\"-\",VLOOKUP($AA$1,INDUK40015000!$A$6:$RL$1005,404,))","v":"-"},{"$f":"IF(VLOOKUP($AA$1,INDUK40015000!$A$6:$RL$1005,477,)=0,\"-\",VLOOKUP($AA$1,INDUK40015000!$A$6:$RL$1005,477,))","v":"-"},{"$f":"IF(VLOOKUP($AA$1,INDUK40015000!$A$6:$RL$1005,478,)=0,\"-\",VLOOKUP($AA$1,INDUK40015000!$A$6:$RL$1005,478,))","v":"-"},14]
[null,"b.","Bahasa Inggris",null,null,null,{"$f":"IF(VLOOKUP($AA$1,INDUK40015000!$A$6:$RL$1005,120,)=0,\"-\",VLOOKUP($AA$1,INDUK40015000!$A$6:$RL$1005,120,))","v":"-"},null,{"$f":"IF(VLOOKUP($AA$1,INDUK40015000!$A$6:$RL$1005,121,)=0,\"-\",VLOOKUP($AA$1,INDUK40015000!$A$6:$RL$1005,121,))","v":"-"},null,{"$f":"IF(VLOOKUP($AA$1,INDUK40015000!$A$6:$RL$1005,177,)=0,\"-\",VLOOKUP($AA$1,INDUK40015000!$A$6:$RL$1005,177,))","v":"-"},null,{"$f":"IF(VLOOKUP($AA$1,INDUK40015000!$A$6:$RL$1005,178,)=0,\"-\",VLOOKUP($AA$1,INDUK40015000!$A$6:$RL$1005,178,))","v":"-"},null,{"$f":"IF(VLOOKUP($AA$1,INDUK40015000!$A$6:$RL$1005,234,)=0,\"-\",VLOOKUP($AA$1,INDUK40015000!$A$6:$RL$1005,234,))","v":"-"},null,{"$f":"IF(VLOOKUP($AA$1,INDUK40015000!$A$6:$RL$1005,235,)=0,\"-\",VLOOKUP($AA$1,INDUK40015000!$A$6:$RL$1005,235,))","v":"-"},60,{"$f":"IF(VLOOKUP($AA$1,INDUK40015000!$A$6:$RL$1005,291,)=0,\"-\",VLOOKUP($AA$1,INDUK40015000!$A$6:$RL$1005,291,))","v":"-"},null,{"$f":"IF(VLOOKUP($AA$1,INDUK40015000!$A$6:$RL$1005,292,)=0,\"-\",VLOOKUP($AA$1,INDUK40015000!$A$6:$RL$1005,292,))","v":"-"},null,{"$f":"IF(VLOOKUP($AA$1,INDUK40015000!$A$6:$RL$1005,348,)=0,\"-\",VLOOKUP($AA$1,INDUK40015000!$A$6:$RL$1005,348,))","v":"-"},null,{"$f":"IF(VLOOKUP($AA$1,INDUK40015000!$A$6:$RL$1005,349,)=0,\"-\",VLOOKUP($AA$1,INDUK40015000!$A$6:$RL$1005,349,))","v":"-"},null,{"$f":"IF(VLOOKUP($AA$1,INDUK40015000!$A$6:$RL$1005,405,)=0,\"-\",VLOOKUP($AA$1,INDUK40015000!$A$6:$RL$1005,405,))","v":"-"},null,{"$f":"IF(VLOOKUP($AA$1,INDUK40015000!$A$6:$RL$1005,406,)=0,\"-\",VLOOKUP($AA$1,INDUK40015000!$A$6:$RL$1005,406,))","v":"-"},{"$f":"IF(VLOOKUP($AA$1,INDUK40015000!$A$6:$RL$1005,479,)=0,\"-\",VLOOKUP($AA$1,INDUK40015000!$A$6:$RL$1005,479,))","v":"-"},{"$f":"IF(VLOOKUP($AA$1,INDUK40015000!$A$6:$RL$1005,480,)=0,\"-\",VLOOKUP($AA$1,INDUK40015000!$A$6:$RL$1005,480,))","v":"-"},1]
[null,"c.","Ke-NU-an / Aswaja",null,null,null,{"$f":"IF(VLOOKUP($AA$1,INDUK40015000!$A$6:$RL$1005,100,)=0,\"-\",VLOOKUP($AA$1,INDUK40015000!$A$6:$RL$1005,100,))","v":"-"},null,{"$f":"IF(VLOOKUP($AA$1,INDUK40015000!$A$6:$RL$1005,101,)=0,\"-\",VLOOKUP($AA$1,INDUK40015000!$A$6:$RL$1005,101,))","v":"-"},null,{"$f":"IF(VLOOKUP($AA$1,INDUK40015000!$A$6:$RL$1005,157,)=0,\"-\",VLOOKUP($AA$1,INDUK40015000!$A$6:$RL$1005,157,))","v":"-"},null,{"$f":"IF(VLOOKUP($AA$1,INDUK40015000!$A$6:$RL$1005,158,)=0,\"-\",VLOOKUP($AA$1,INDUK40015000!$A$6:$RL$1005,158,))","v":"-"},null,{"$f":"IF(VLOOKUP($AA$1,INDUK40015000!$A$6:$RL$1005,214,)=0,\"-\",VLOOKUP($AA$1,INDUK40015000!$A$6:$RL$1005,214,))","v":"-"},null,{"$f":"IF(VLOOKUP($AA$1,INDUK40015000!$A$6:$RL$1005,215,)=0,\"-\",VLOOKUP($AA$1,INDUK40015000!$A$6:$RL$1005,215,))","v":"-"},60,{"$f":"IF(VLOOKUP($AA$1,INDUK40015000!$A$6:$RL$1005,271,)=0,\"-\",VLOOKUP($AA$1,INDUK40015000!$A$6:$RL$1005,271,))","v":"-"},null,{"$f":"IF(VLOOKUP($AA$1,INDUK40015000!$A$6:$RL$1005,272,)=0,\"-\",VLOOKUP($AA$1,INDUK40015000!$A$6:$RL$1005,272,))","v":"-"},null,{"$f":"IF(VLOOKUP($AA$1,INDUK40015000!$A$6:$RL$1005,328,)=0,\"-\",VLOOKUP($AA$1,INDUK40015000!$A$6:$RL$1005,328,))","v":"-"},null,{"$f":"IF(VLOOKUP($AA$1,INDUK40015000!$A$6:$RL$1005,329,)=0,\"-\",VLOOKUP($AA$1,INDUK40015000!$A$6:$RL$1005,329,))","v":"-"},null,{"$f":"IF(VLOOKUP($AA$1,INDUK40015000!$A$6:$RL$1005,385,)=0,\"-\",VLOOKUP($AA$1,INDUK40015000!$A$6:$RL$1005,385,))","v":"-"},null,{"$f":"IF(VLOOKUP($AA$1,INDUK40015000!$A$6:$RL$1005,386,)=0,\"-\",VLOOKUP($AA$1,INDUK40015000!$A$6:$RL$1005,386,))","v":"-"},{"$f":"IF(VLOOKUP($AA$1,INDUK40015000!$A$6:$RL$1005,459,)=0,\"-\",VLOOKUP($AA$1,INDUK40015000!$A$6:$RL$1005,459,))","v":"-"},{"$f":"IF(VLOOKUP($AA$1,INDUK40015000!$A$6:$RL$1005,460,)=0,\"-\",VLOOKUP($AA$1,INDUK40015000!$A$6:$RL$1005,460,))","v":"-"},5]
["Pengembangan diri :"]
["1.","PRAMUKA",null,null,null,{"$f":"IF(VLOOKUP($AA$1,INDUK40015000!$A$6:$RL$1005,134,)=0,\"-\",VLOOKUP($AA$1,INDUK40015000!$A$6:$RL$1005,134,))","v":"-"},null,{"$f":"IF(VLOOKUP($AA$1,INDUK40015000!$A$6:$RL$1005,135,)=0,\"-\",VLOOKUP($AA$1,INDUK40015000!$A$6:$RL$1005,135,))","v":"-"},null,{"$f":"IF(VLOOKUP($AA$1,INDUK40015000!$A$6:$RL$1005,191,)=0,\"-\",VLOOKUP($AA$1,INDUK40015000!$A$6:$RL$1005,191,))","v":"-"},null,{"$f":"IF(VLOOKUP($AA$1,INDUK40015000!$A$6:$RL$1005,192,)=0,\"-\",VLOOKUP($AA$1,INDUK40015000!$A$6:$RL$1005,192,))","v":"-"},null,{"$f":"IF(VLOOKUP($AA$1,INDUK40015000!$A$6:$RL$1005,248,)=0,\"-\",VLOOKUP($AA$1,INDUK40015000!$A$6:$RL$1005,248,))","v":"-"},null,{"$f":"IF(VLOOKUP($AA$1,INDUK40015000!$A$6:$RL$1005,249,)=0,\"-\",VLOOKUP($AA$1,INDUK40015000!$A$6:$RL$1005,249,))","v":"-"},null,{"$f":"IF(VLOOKUP($AA$1,INDUK40015000!$A$6:$RL$1005,305,)=0,\"-\",VLOOKUP($AA$1,INDUK40015000!$A$6:$RL$1005,305,))","v":"-"},null,{"$f":"IF(VLOOKUP($AA$1,INDUK40015000!$A$6:$RL$1005,306,)=0,\"-\",VLOOKUP($AA$1,INDUK40015000!$A$6:$RL$1005,306,))","v":"-"},null,{"$f":"IF(VLOOKUP($AA$1,INDUK40015000!$A$6:$RL$1005,362,)=0,\"-\",VLOOKUP($AA$1,INDUK40015000!$A$6:$RL$1005,362,))","v":"-"},null,{"$f":"IF(VLOOKUP($AA$1,INDUK40015000!$A$6:$RL$1005,363,)=0,\"-\",VLOOKUP($AA$1,INDUK40015000!$A$6:$RL$1005,363,))","v":"-"},null,{"$f":"IF(VLOOKUP($AA$1,INDUK40015000!$A$6:$RL$1005,419,)=0,\"-\",VLOOKUP($AA$1,INDUK40015000!$A$6:$RL$1005,419,))","v":"-"},null,{"$f":"IF(VLOOKUP($AA$1,INDUK40015000!$A$6:$RL$1005,420,)=0,\"-\",VLOOKUP($AA$1,INDUK40015000!$A$6:$RL$1005,420,))","v":"-"},null,null,null,8]
["2.","EKSTRA 1",null,null,null,{"$f":"IF(VLOOKUP($AA$1,INDUK40015000!$A$6:$RL$1005,136,)=0,\"-\",VLOOKUP($AA$1,INDUK40015000!$A$6:$RL$1005,136,))","v":"-"},null,{"$f":"IF(VLOOKUP($AA$1,INDUK40015000!$A$6:$RL$1005,137,)=0,\"-\",VLOOKUP($AA$1,INDUK40015000!$A$6:$RL$1005,137,))","v":"-"},null,{"$f":"IF(VLOOKUP($AA$1,INDUK40015000!$A$6:$RL$1005,193,)=0,\"-\",VLOOKUP($AA$1,INDUK40015000!$A$6:$RL$1005,193,))","v":"-"},null,{"$f":"IF(VLOOKUP($AA$1,INDUK40015000!$A$6:$RL$1005,194,)=0,\"-\",VLOOKUP($AA$1,INDUK40015000!$A$6:$RL$1005,194,))","v":"-"},null,{"$f":"IF(VLOOKUP($AA$1,INDUK40015000!$A$6:$RL$1005,250,)=0,\"-\",VLOOKUP($AA$1,INDUK40015000!$A$6:$RL$1005,250,))","v":"-"},null,{"$f":"IF(VLOOKUP($AA$1,INDUK40015000!$A$6:$RL$1005,251,)=0,\"-\",VLOOKUP($AA$1,INDUK40015000!$A$6:$RL$1005,251,))","v":"-"},null,{"$f":"IF(VLOOKUP($AA$1,INDUK40015000!$A$6:$RL$1005,307,)=0,\"-\",VLOOKUP($AA$1,INDUK40015000!$A$6:$RL$1005,307,))","v":"-"},null,{"$f":"IF(VLOOKUP($AA$1,INDUK40015000!$A$6:$RL$1005,308,)=0,\"-\",VLOOKUP($AA$1,INDUK40015000!$A$6:$RL$1005,308,))","v":"-"},null,{"$f":"IF(VLOOKUP($AA$1,INDUK40015000!$A$6:$RL$1005,364,)=0,\"-\",VLOOKUP($AA$1,INDUK40015000!$A$6:$RL$1005,364,))","v":"-"},null,{"$f":"IF(VLOOKUP($AA$1,INDUK40015000!$A$6:$RL$1005,365,)=0,\"-\",VLOOKUP($AA$1,INDUK40015000!$A$6:$RL$1005,365,))","v":"-"},null,{"$f":"IF(VLOOKUP($AA$1,INDUK40015000!$A$6:$RL$1005,421,)=0,\"-\",VLOOKUP($AA$1,INDUK40015000!$A$6:$RL$1005,421,))","v":"-"},null,{"$f":"IF(VLOOKUP($AA$1,INDUK40015000!$A$6:$RL$1005,422,)=0,\"-\",VLOOKUP($AA$1,INDUK40015000!$A$6:$RL$1005,422,))","v":"-"},null,null,null,9]
["3.","EKSTRA 2",null,null,null,{"$f":"IF(VLOOKUP($AA$1,INDUK40015000!$A$6:$RL$1005,138,)=0,\"-\",VLOOKUP($AA$1,INDUK40015000!$A$6:$RL$1005,138,))","v":"-"},null,{"$f":"IF(VLOOKUP($AA$1,INDUK40015000!$A$6:$RL$1005,139,)=0,\"-\",VLOOKUP($AA$1,INDUK40015000!$A$6:$RL$1005,139,))","v":"-"},null,{"$f":"IF(VLOOKUP($AA$1,INDUK40015000!$A$6:$RL$1005,195,)=0,\"-\",VLOOKUP($AA$1,INDUK40015000!$A$6:$RL$1005,195,))","v":"-"},null,{"$f":"IF(VLOOKUP($AA$1,INDUK40015000!$A$6:$RL$1005,196,)=0,\"-\",VLOOKUP($AA$1,INDUK40015000!$A$6:$RL$1005,196,))","v":"-"},null,{"$f":"IF(VLOOKUP($AA$1,INDUK40015000!$A$6:$RL$1005,252,)=0,\"-\",VLOOKUP($AA$1,INDUK40015000!$A$6:$RL$1005,252,))","v":"-"},null,{"$f":"IF(VLOOKUP($AA$1,INDUK40015000!$A$6:$RL$1005,253,)=0,\"-\",VLOOKUP($AA$1,INDUK40015000!$A$6:$RL$1005,253,))","v":"-"},null,{"$f":"IF(VLOOKUP($AA$1,INDUK40015000!$A$6:$RL$1005,309,)=0,\"-\",VLOOKUP($AA$1,INDUK40015000!$A$6:$RL$1005,309,))","v":"-"},null,{"$f":"IF(VLOOKUP($AA$1,INDUK40015000!$A$6:$RL$1005,310,)=0,\"-\",VLOOKUP($AA$1,INDUK40015000!$A$6:$RL$1005,310,))","v":"-"},null,{"$f":"IF(VLOOKUP($AA$1,INDUK40015000!$A$6:$RL$1005,366,)=0,\"-\",VLOOKUP($AA$1,INDUK40015000!$A$6:$RL$1005,366,))","v":"-"},null,{"$f":"IF(VLOOKUP($AA$1,INDUK40015000!$A$6:$RL$1005,367,)=0,\"-\",VLOOKUP($AA$1,INDUK40015000!$A$6:$RL$1005,367,))","v":"-"},null,{"$f":"IF(VLOOKUP($AA$1,INDUK40015000!$A$6:$RL$1005,423,)=0,\"-\",VLOOKUP($AA$1,INDUK40015000!$A$6:$RL$1005,423,))","v":"-"},null,{"$f":"IF(VLOOKUP($AA$1,INDUK40015000!$A$6:$RL$1005,424,)=0,\"-\",VLOOKUP($AA$1,INDUK40015000!$A$6:$RL$1005,424,))","v":"-"},null,null,null,10]
["Jumlah Nilai",null,null,null,null,{"$f":"IF(VLOOKUP($AA$1,INDUK40015000!$A$6:$RL$1005,122,)=0,\"-\",VLOOKUP($AA$1,INDUK40015000!$A$6:$RL$1005,122,))","v":"-"},null,{"$f":"IF(VLOOKUP($AA$1,INDUK40015000!$A$6:$RL$1005,123,)=0,\"-\",VLOOKUP($AA$1,INDUK40015000!$A$6:$RL$1005,123,))","v":"-"},null,{"$f":"IF(VLOOKUP($AA$1,INDUK40015000!$A$6:$RL$1005,179,)=0,\"-\",VLOOKUP($AA$1,INDUK40015000!$A$6:$RL$1005,179,))","v":"-"},null,{"$f":"IF(VLOOKUP($AA$1,INDUK40015000!$A$6:$RL$1005,180,)=0,\"-\",VLOOKUP($AA$1,INDUK40015000!$A$6:$RL$1005,180,))","v":"-"},null,{"$f":"IF(VLOOKUP($AA$1,INDUK40015000!$A$6:$RL$1005,236,)=0,\"-\",VLOOKUP($AA$1,INDUK40015000!$A$6:$RL$1005,236,))","v":"-"},null,{"$f":"IF(VLOOKUP($AA$1,INDUK40015000!$A$6:$RL$1005,237,)=0,\"-\",VLOOKUP($AA$1,INDUK40015000!$A$6:$RL$1005,237,))","v":"-"},null,{"$f":"IF(VLOOKUP($AA$1,INDUK40015000!$A$6:$RL$1005,293,)=0,\"-\",VLOOKUP($AA$1,INDUK40015000!$A$6:$RL$1005,293,))","v":"-"},null,{"$f":"IF(VLOOKUP($AA$1,INDUK40015000!$A$6:$RL$1005,294,)=0,\"-\",VLOOKUP($AA$1,INDUK40015000!$A$6:$RL$1005,294,))","v":"-"},null,{"$f":"IF(VLOOKUP($AA$1,INDUK40015000!$A$6:$RL$1005,350,)=0,\"-\",VLOOKUP($AA$1,INDUK40015000!$A$6:$RL$1005,350,))","v":"-"},null,{"$f":"IF(VLOOKUP($AA$1,INDUK40015000!$A$6:$RL$1005,351,)=0,\"-\",VLOOKUP($AA$1,INDUK40015000!$A$6:$RL$1005,351,))","v":"-"},null,{"$f":"IF(VLOOKUP($AA$1,INDUK40015000!$A$6:$RL$1005,407,)=0,\"-\",VLOOKUP($AA$1,INDUK40015000!$A$6:$RL$1005,407,))","v":"-"},null,{"$f":"IF(VLOOKUP($AA$1,INDUK40015000!$A$6:$RL$1005,408,)=0,\"-\",VLOOKUP($AA$1,INDUK40015000!$A$6:$RL$1005,408,))","v":"-"},null,null,null,2]
["Rata - Rata",null,null,null,null,{"$f":"IF(VLOOKUP($AA$1,INDUK40015000!$A$6:$RL$1005,124,)=0,\"-\",VLOOKUP($AA$1,INDUK40015000!$A$6:$RL$1005,124,))","v":"-"},null,{"$f":"IF(VLOOKUP($AA$1,INDUK40015000!$A$6:$RL$1005,125,)=0,\"-\",VLOOKUP($AA$1,INDUK40015000!$A$6:$RL$1005,125,))","v":"-"},null,{"$f":"IF(VLOOKUP($AA$1,INDUK40015000!$A$6:$RL$1005,181,)=0,\"-\",VLOOKUP($AA$1,INDUK40015000!$A$6:$RL$1005,181,))","v":"-"},null,{"$f":"IF(VLOOKUP($AA$1,INDUK40015000!$A$6:$RL$1005,182,)=0,\"-\",VLOOKUP($AA$1,INDUK40015000!$A$6:$RL$1005,182,))","v":"-"},null,{"$f":"IF(VLOOKUP($AA$1,INDUK40015000!$A$6:$RL$1005,238,)=0,\"-\",VLOOKUP($AA$1,INDUK40015000!$A$6:$RL$1005,238,))","v":"-"},null,{"$f":"IF(VLOOKUP($AA$1,INDUK40015000!$A$6:$RL$1005,239,)=0,\"-\",VLOOKUP($AA$1,INDUK40015000!$A$6:$RL$1005,239,))","v":"-"},null,{"$f":"IF(VLOOKUP($AA$1,INDUK40015000!$A$6:$RL$1005,295,)=0,\"-\",VLOOKUP($AA$1,INDUK40015000!$A$6:$RL$1005,295,))","v":"-"},null,{"$f":"IF(VLOOKUP($AA$1,INDUK40015000!$A$6:$RL$1005,296,)=0,\"-\",VLOOKUP($AA$1,INDUK40015000!$A$6:$RL$1005,296,))","v":"-"},null,{"$f":"IF(VLOOKUP($AA$1,INDUK40015000!$A$6:$RL$1005,352,)=0,\"-\",VLOOKUP($AA$1,INDUK40015000!$A$6:$RL$1005,352,))","v":"-"},null,{"$f":"IF(VLOOKUP($AA$1,INDUK40015000!$A$6:$RL$1005,353,)=0,\"-\",VLOOKUP($AA$1,INDUK40015000!$A$6:$RL$1005,353,))","v":"-"},null,{"$f":"IF(VLOOKUP($AA$1,INDUK40015000!$A$6:$RL$1005,409,)=0,\"-\",VLOOKUP($AA$1,INDUK40015000!$A$6:$RL$1005,409,))","v":"-"},null,{"$f":"IF(VLOOKUP($AA$1,INDUK40015000!$A$6:$RL$1005,410,)=0,\"-\",VLOOKUP($AA$1,INDUK40015000!$A$6:$RL$1005,410,))","v":"-"},null,null,null,3]
["Peringkat Kelas Ke :",null,null,null,null,{"$f":"IF(VLOOKUP($AA$1,INDUK40015000!$A$6:$RL$1005,126,)=0,\"-\",VLOOKUP($AA$1,INDUK40015000!$A$6:$RL$1005,126,))","v":"-"},null,{"$f":"IF(VLOOKUP($AA$1,INDUK40015000!$A$6:$RL$1005,127,)=0,\"-\",VLOOKUP($AA$1,INDUK40015000!$A$6:$RL$1005,127,))","v":"-"},null,{"$f":"IF(VLOOKUP($AA$1,INDUK40015000!$A$6:$RL$1005,183,)=0,\"-\",VLOOKUP($AA$1,INDUK40015000!$A$6:$RL$1005,183,))","v":"-"},null,{"$f":"IF(VLOOKUP($AA$1,INDUK40015000!$A$6:$RL$1005,184,)=0,\"-\",VLOOKUP($AA$1,INDUK40015000!$A$6:$RL$1005,184,))","v":"-"},null,{"$f":"IF(VLOOKUP($AA$1,INDUK40015000!$A$6:$RL$1005,240,)=0,\"-\",VLOOKUP($AA$1,INDUK40015000!$A$6:$RL$1005,240,))","v":"-"},null,{"$f":"IF(VLOOKUP($AA$1,INDUK40015000!$A$6:$RL$1005,241,)=0,\"-\",VLOOKUP($AA$1,INDUK40015000!$A$6:$RL$1005,241,))","v":"-"},null,{"$f":"IF(VLOOKUP($AA$1,INDUK40015000!$A$6:$RL$1005,297,)=0,\"-\",VLOOKUP($AA$1,INDUK40015000!$A$6:$RL$1005,297,))","v":"-"},null,{"$f":"IF(VLOOKUP($AA$1,INDUK40015000!$A$6:$RL$1005,298,)=0,\"-\",VLOOKUP($AA$1,INDUK40015000!$A$6:$RL$1005,298,))","v":"-"},null,{"$f":"IF(VLOOKUP($AA$1,INDUK40015000!$A$6:$RL$1005,354,)=0,\"-\",VLOOKUP($AA$1,INDUK40015000!$A$6:$RL$1005,354,))","v":"-"},null,{"$f":"IF(VLOOKUP($AA$1,INDUK40015000!$A$6:$RL$1005,355,)=0,\"-\",VLOOKUP($AA$1,INDUK40015000!$A$6:$RL$1005,355,))","v":"-"},null,{"$f":"IF(VLOOKUP($AA$1,INDUK40015000!$A$6:$RL$1005,411,)=0,\"-\",VLOOKUP($AA$1,INDUK40015000!$A$6:$RL$1005,411,))","v":"-"},null,{"$f":"IF(VLOOKUP($AA$1,INDUK40015000!$A$6:$RL$1005,412,)=0,\"-\",VLOOKUP($AA$1,INDUK40015000!$A$6:$RL$1005,412,))","v":"-"},null,null,null,4]
["Perilaku Kepribadian"]
["1.","Kelakuan",null,null,null,{"$f":"IF(VLOOKUP($AA$1,INDUK40015000!$A$6:$RL$1005,140,)=0,\"-\",VLOOKUP($AA$1,INDUK40015000!$A$6:$RL$1005,140,))","v":"-"},null,{"$f":"IF(VLOOKUP($AA$1,INDUK40015000!$A$6:$RL$1005,141,)=0,\"-\",VLOOKUP($AA$1,INDUK40015000!$A$6:$RL$1005,141,))","v":"-"},null,{"$f":"IF(VLOOKUP($AA$1,INDUK40015000!$A$6:$RL$1005,197,)=0,\"-\",VLOOKUP($AA$1,INDUK40015000!$A$6:$RL$1005,197,))","v":"-"},null,{"$f":"IF(VLOOKUP($AA$1,INDUK40015000!$A$6:$RL$1005,198,)=0,\"-\",VLOOKUP($AA$1,INDUK40015000!$A$6:$RL$1005,198,))","v":"-"},null,{"$f":"IF(VLOOKUP($AA$1,INDUK40015000!$A$6:$RL$1005,254,)=0,\"-\",VLOOKUP($AA$1,INDUK40015000!$A$6:$RL$1005,254,))","v":"-"},null,{"$f":"IF(VLOOKUP($AA$1,INDUK40015000!$A$6:$RL$1005,255,)=0,\"-\",VLOOKUP($AA$1,INDUK40015000!$A$6:$RL$1005,255,))","v":"-"},null,{"$f":"IF(VLOOKUP($AA$1,INDUK40015000!$A$6:$RL$1005,311,)=0,\"-\",VLOOKUP($AA$1,INDUK40015000!$A$6:$RL$1005,311,))","v":"-"},null,{"$f":"IF(VLOOKUP($AA$1,INDUK40015000!$A$6:$RL$1005,312,)=0,\"-\",VLOOKUP($AA$1,INDUK40015000!$A$6:$RL$1005,312,))","v":"-"},null,{"$f":"IF(VLOOKUP($AA$1,INDUK40015000!$A$6:$RL$1005,368,)=0,\"-\",VLOOKUP($AA$1,INDUK40015000!$A$6:$RL$1005,368,))","v":"-"},null,{"$f":"IF(VLOOKUP($AA$1,INDUK40015000!$A$6:$RL$1005,369,)=0,\"-\",VLOOKUP($AA$1,INDUK40015000!$A$6:$RL$1005,369,))","v":"-"},null,{"$f":"IF(VLOOKUP($AA$1,INDUK40015000!$A$6:$RL$1005,425,)=0,\"-\",VLOOKUP($AA$1,INDUK40015000!$A$6:$RL$1005,425,))","v":"-"},null,{"$f":"IF(VLOOKUP($AA$1,INDUK40015000!$A$6:$RL$1005,426,)=0,\"-\",VLOOKUP($AA$1,INDUK40015000!$A$6:$RL$1005,426,))","v":"-"},null,null,null,11]
["2.","Kerajinan",null,null,null,{"$f":"IF(VLOOKUP($AA$1,INDUK40015000!$A$6:$RL$1005,142,)=0,\"-\",VLOOKUP($AA$1,INDUK40015000!$A$6:$RL$1005,142,))","v":"-"},null,{"$f":"IF(VLOOKUP($AA$1,INDUK40015000!$A$6:$RL$1005,143,)=0,\"-\",VLOOKUP($AA$1,INDUK40015000!$A$6:$RL$1005,143,))","v":"-"},null,{"$f":"IF(VLOOKUP($AA$1,INDUK40015000!$A$6:$RL$1005,199,)=0,\"-\",VLOOKUP($AA$1,INDUK40015000!$A$6:$RL$1005,199,))","v":"-"},null,{"$f":"IF(VLOOKUP($AA$1,INDUK40015000!$A$6:$RL$1005,200,)=0,\"-\",VLOOKUP($AA$1,INDUK40015000!$A$6:$RL$1005,200,))","v":"-"},null,{"$f":"IF(VLOOKUP($AA$1,INDUK40015000!$A$6:$RL$1005,256,)=0,\"-\",VLOOKUP($AA$1,INDUK40015000!$A$6:$RL$1005,256,))","v":"-"},null,{"$f":"IF(VLOOKUP($AA$1,INDUK40015000!$A$6:$RL$1005,257,)=0,\"-\",VLOOKUP($AA$1,INDUK40015000!$A$6:$RL$1005,257,))","v":"-"},null,{"$f":"IF(VLOOKUP($AA$1,INDUK40015000!$A$6:$RL$1005,313,)=0,\"-\",VLOOKUP($AA$1,INDUK40015000!$A$6:$RL$1005,313,))","v":"-"},null,{"$f":"IF(VLOOKUP($AA$1,INDUK40015000!$A$6:$RL$1005,314,)=0,\"-\",VLOOKUP($AA$1,INDUK40015000!$A$6:$RL$1005,314,))","v":"-"},null,{"$f":"IF(VLOOKUP($AA$1,INDUK40015000!$A$6:$RL$1005,370,)=0,\"-\",VLOOKUP($AA$1,INDUK40015000!$A$6:$RL$1005,370,))","v":"-"},null,{"$f":"IF(VLOOKUP($AA$1,INDUK40015000!$A$6:$RL$1005,371,)=0,\"-\",VLOOKUP($AA$1,INDUK40015000!$A$6:$RL$1005,371,))","v":"-"},null,{"$f":"IF(VLOOKUP($AA$1,INDUK40015000!$A$6:$RL$1005,427,)=0,\"-\",VLOOKUP($AA$1,INDUK40015000!$A$6:$RL$1005,427,))","v":"-"},null,{"$f":"IF(VLOOKUP($AA$1,INDUK40015000!$A$6:$RL$1005,428,)=0,\"-\",VLOOKUP($AA$1,INDUK40015000!$A$6:$RL$1005,428,))","v":"-"},null,null,null,12]
["3.","Kebersihan dan Kerapian",null,null,null,{"$f":"IF(VLOOKUP($AA$1,INDUK40015000!$A$6:$RL$1005,144,)=0,\"-\",VLOOKUP($AA$1,INDUK40015000!$A$6:$RL$1005,144,))","v":"-"},null,{"$f":"IF(VLOOKUP($AA$1,INDUK40015000!$A$6:$RL$1005,145,)=0,\"-\",VLOOKUP($AA$1,INDUK40015000!$A$6:$RL$1005,145,))","v":"-"},null,{"$f":"IF(VLOOKUP($AA$1,INDUK40015000!$A$6:$RL$1005,201,)=0,\"-\",VLOOKUP($AA$1,INDUK40015000!$A$6:$RL$1005,201,))","v":"-"},null,{"$f":"IF(VLOOKUP($AA$1,INDUK40015000!$A$6:$RL$1005,202,)=0,\"-\",VLOOKUP($AA$1,INDUK40015000!$A$6:$RL$1005,202,))","v":"-"},null,{"$f":"IF(VLOOKUP($AA$1,INDUK40015000!$A$6:$RL$1005,258,)=0,\"-\",VLOOKUP($AA$1,INDUK40015000!$A$6:$RL$1005,258,))","v":"-"},null,{"$f":"IF(VLOOKUP($AA$1,INDUK40015000!$A$6:$RL$1005,259,)=0,\"-\",VLOOKUP($AA$1,INDUK40015000!$A$6:$RL$1005,259,))","v":"-"},null,{"$f":"IF(VLOOKUP($AA$1,INDUK40015000!$A$6:$RL$1005,315,)=0,\"-\",VLOOKUP($AA$1,INDUK40015000!$A$6:$RL$1005,315,))","v":"-"},null,{"$f":"IF(VLOOKUP($AA$1,INDUK40015000!$A$6:$RL$1005,316,)=0,\"-\",VLOOKUP($AA$1,INDUK40015000!$A$6:$RL$1005,316,))","v":"-"},null,{"$f":"IF(VLOOKUP($AA$1,INDUK40015000!$A$6:$RL$1005,372,)=0,\"-\",VLOOKUP($AA$1,INDUK40015000!$A$6:$RL$1005,372,))","v":"-"},null,{"$f":"IF(VLOOKUP($AA$1,INDUK40015000!$A$6:$RL$1005,373,)=0,\"-\",VLOOKUP($AA$1,INDUK40015000!$A$6:$RL$1005,373,))","v":"-"},null,{"$f":"IF(VLOOKUP($AA$1,INDUK40015000!$A$6:$RL$1005,429,)=0,\"-\",VLOOKUP($AA$1,INDUK40015000!$A$6:$RL$1005,429,))","v":"-"},null,{"$f":"IF(VLOOKUP($AA$1,INDUK40015000!$A$6:$RL$1005,430,)=0,\"-\",VLOOKUP($AA$1,INDUK40015000!$A$6:$RL$1005,430,))","v":"-"},null,null,null,13]
["Ketidakhadiran"]
["1.","Sakit",null,null,"( Hari )",{"$f":"IF(VLOOKUP($AA$1,INDUK40015000!$A$6:$RL$1005,128,)=0,\"-\",VLOOKUP($AA$1,INDUK40015000!$A$6:$RL$1005,128,))","v":"-"},null,{"$f":"IF(VLOOKUP($AA$1,INDUK40015000!$A$6:$RL$1005,129,)=0,\"-\",VLOOKUP($AA$1,INDUK40015000!$A$6:$RL$1005,129,))","v":"-"},null,{"$f":"IF(VLOOKUP($AA$1,INDUK40015000!$A$6:$RL$1005,185,)=0,\"-\",VLOOKUP($AA$1,INDUK40015000!$A$6:$RL$1005,185,))","v":"-"},null,{"$f":"IF(VLOOKUP($AA$1,INDUK40015000!$A$6:$RL$1005,186,)=0,\"-\",VLOOKUP($AA$1,INDUK40015000!$A$6:$RL$1005,186,))","v":"-"},null,{"$f":"IF(VLOOKUP($AA$1,INDUK40015000!$A$6:$RL$1005,242,)=0,\"-\",VLOOKUP($AA$1,INDUK40015000!$A$6:$RL$1005,242,))","v":"-"},null,{"$f":"IF(VLOOKUP($AA$1,INDUK40015000!$A$6:$RL$1005,243,)=0,\"-\",VLOOKUP($AA$1,INDUK40015000!$A$6:$RL$1005,243,))","v":"-"},null,{"$f":"IF(VLOOKUP($AA$1,INDUK40015000!$A$6:$RL$1005,299,)=0,\"-\",VLOOKUP($AA$1,INDUK40015000!$A$6:$RL$1005,299,))","v":"-"},null,{"$f":"IF(VLOOKUP($AA$1,INDUK40015000!$A$6:$RL$1005,300,)=0,\"-\",VLOOKUP($AA$1,INDUK40015000!$A$6:$RL$1005,300,))","v":"-"},null,{"$f":"IF(VLOOKUP($AA$1,INDUK40015000!$A$6:$RL$1005,356,)=0,\"-\",VLOOKUP($AA$1,INDUK40015000!$A$6:$RL$1005,356,))","v":"-"},null,{"$f":"IF(VLOOKUP($AA$1,INDUK40015000!$A$6:$RL$1005,357,)=0,\"-\",VLOOKUP($AA$1,INDUK40015000!$A$6:$RL$1005,357,))","v":"-"},null,{"$f":"IF(VLOOKUP($AA$1,INDUK40015000!$A$6:$RL$1005,413,)=0,\"-\",VLOOKUP($AA$1,INDUK40015000!$A$6:$RL$1005,413,))","v":"-"},null,{"$f":"IF(VLOOKUP($AA$1,INDUK40015000!$A$6:$RL$1005,414,)=0,\"-\",VLOOKUP($AA$1,INDUK40015000!$A$6:$RL$1005,414,))","v":"-"},null,"Catatan :",null,5]
["2.","Izin",null,null,"( Hari )",{"$f":"IF(VLOOKUP($AA$1,INDUK40015000!$A$6:$RL$1005,130,)=0,\"-\",VLOOKUP($AA$1,INDUK40015000!$A$6:$RL$1005,130,))","v":"-"},null,{"$f":"IF(VLOOKUP($AA$1,INDUK40015000!$A$6:$RL$1005,131,)=0,\"-\",VLOOKUP($AA$1,INDUK40015000!$A$6:$RL$1005,131,))","v":"-"},null,{"$f":"IF(VLOOKUP($AA$1,INDUK40015000!$A$6:$RL$1005,187,)=0,\"-\",VLOOKUP($AA$1,INDUK40015000!$A$6:$RL$1005,187,))","v":"-"},null,{"$f":"IF(VLOOKUP($AA$1,INDUK40015000!$A$6:$RL$1005,188,)=0,\"-\",VLOOKUP($AA$1,INDUK40015000!$A$6:$RL$1005,188,))","v":"-"},null,{"$f":"IF(VLOOKUP($AA$1,INDUK40015000!$A$6:$RL$1005,244,)=0,\"-\",VLOOKUP($AA$1,INDUK40015000!$A$6:$RL$1005,244,))","v":"-"},null,{"$f":"IF(VLOOKUP($AA$1,INDUK40015000!$A$6:$RL$1005,245,)=0,\"-\",VLOOKUP($AA$1,INDUK40015000!$A$6:$RL$1005,245,))","v":"-"},null,{"$f":"IF(VLOOKUP($AA$1,INDUK40015000!$A$6:$RL$1005,301,)=0,\"-\",VLOOKUP($AA$1,INDUK40015000!$A$6:$RL$1005,301,))","v":"-"},null,{"$f":"IF(VLOOKUP($AA$1,INDUK40015000!$A$6:$RL$1005,302,)=0,\"-\",VLOOKUP($AA$1,INDUK40015000!$A$6:$RL$1005,302,))","v":"-"},null,{"$f":"IF(VLOOKUP($AA$1,INDUK40015000!$A$6:$RL$1005,358,)=0,\"-\",VLOOKUP($AA$1,INDUK40015000!$A$6:$RL$1005,358,))","v":"-"},null,{"$f":"IF(VLOOKUP($AA$1,INDUK40015000!$A$6:$RL$1005,359,)=0,\"-\",VLOOKUP($AA$1,INDUK40015000!$A$6:$RL$1005,359,))","v":"-"},null,{"$f":"IF(VLOOKUP($AA$1,INDUK40015000!$A$6:$RL$1005,415,)=0,\"-\",VLOOKUP($AA$1,INDUK40015000!$A$6:$RL$1005,415,))","v":"-"},null,{"$f":"IF(VLOOKUP($AA$1,INDUK40015000!$A$6:$RL$1005,416,)=0,\"-\",VLOOKUP($AA$1,INDUK40015000!$A$6:$RL$1005,416,))","v":"-"},null,null,null,6]
["3.","Tanpa Keterangan",null,null,"( Hari )",{"$f":"IF(VLOOKUP($AA$1,INDUK40015000!$A$6:$RL$1005,132,)=0,\"-\",VLOOKUP($AA$1,INDUK40015000!$A$6:$RL$1005,132,))","v":"-"},null,{"$f":"IF(VLOOKUP($AA$1,INDUK40015000!$A$6:$RL$1005,133,)=0,\"-\",VLOOKUP($AA$1,INDUK40015000!$A$6:$RL$1005,133,))","v":"-"},null,{"$f":"IF(VLOOKUP($AA$1,INDUK40015000!$A$6:$RL$1005,189,)=0,\"-\",VLOOKUP($AA$1,INDUK40015000!$A$6:$RL$1005,189,))","v":"-"},null,{"$f":"IF(VLOOKUP($AA$1,INDUK40015000!$A$6:$RL$1005,190,)=0,\"-\",VLOOKUP($AA$1,INDUK40015000!$A$6:$RL$1005,190,))","v":"-"},null,{"$f":"IF(VLOOKUP($AA$1,INDUK40015000!$A$6:$RL$1005,246,)=0,\"-\",VLOOKUP($AA$1,INDUK40015000!$A$6:$RL$1005,246,))","v":"-"},null,{"$f":"IF(VLOOKUP($AA$1,INDUK40015000!$A$6:$RL$1005,247,)=0,\"-\",VLOOKUP($AA$1,INDUK40015000!$A$6:$RL$1005,247,))","v":"-"},null,{"$f":"IF(VLOOKUP($AA$1,INDUK40015000!$A$6:$RL$1005,303,)=0,\"-\",VLOOKUP($AA$1,INDUK40015000!$A$6:$RL$1005,303,))","v":"-"},null,{"$f":"IF(VLOOKUP($AA$1,INDUK40015000!$A$6:$RL$1005,304,)=0,\"-\",VLOOKUP($AA$1,INDUK40015000!$A$6:$RL$1005,304,))","v":"-"},null,{"$f":"IF(VLOOKUP($AA$1,INDUK40015000!$A$6:$RL$1005,360,)=0,\"-\",VLOOKUP($AA$1,INDUK40015000!$A$6:$RL$1005,360,))","v":"-"},null,{"$f":"IF(VLOOKUP($AA$1,INDUK40015000!$A$6:$RL$1005,361,)=0,\"-\",VLOOKUP($AA$1,INDUK40015000!$A$6:$RL$1005,361,))","v":"-"},null,{"$f":"IF(VLOOKUP($AA$1,INDUK40015000!$A$6:$RL$1005,417,)=0,\"-\",VLOOKUP($AA$1,INDUK40015000!$A$6:$RL$1005,417,))","v":"-"},null,{"$f":"IF(VLOOKUP($AA$1,INDUK40015000!$A$6:$RL$1005,418,)=0,\"-\",VLOOKUP($AA$1,INDUK40015000!$A$6:$RL$1005,418,))","v":"-"},null,null,null,7]
["NAIK / TIDAK NAIK KELAS",null,null,null,null,{"$f":"IF(VLOOKUP($AA$1,INDUK40015000!$A$6:$RL$1005,146,)=0,\"-\",VLOOKUP($AA$1,INDUK40015000!$A$6:$RL$1005,146,))","v":"-"},null,null,null,{"$f":"IF(VLOOKUP($AA$1,INDUK40015000!$A$6:$RL$1005,203,)=0,\"-\",VLOOKUP($AA$1,INDUK40015000!$A$6:$RL$1005,203,))","v":"-"},null,null,null,{"$f":"IF(VLOOKUP($AA$1,INDUK40015000!$A$6:$RL$1005,260,)=0,\"-\",VLOOKUP($AA$1,INDUK40015000!$A$6:$RL$1005,260,))","v":"-"},null,null,null,{"$f":"IF(VLOOKUP($AA$1,INDUK40015000!$A$6:$RL$1005,317,)=0,\"-\",VLOOKUP($AA$1,INDUK40015000!$A$6:$RL$1005,317,))","v":"-"},null,null,null,{"$f":"IF(VLOOKUP($AA$1,INDUK40015000!$A$6:$RL$1005,374,)=0,\"-\",VLOOKUP($AA$1,INDUK40015000!$A$6:$RL$1005,374,))","v":"-"},null,null,null,{"$f":"IF(VLOOKUP($AA$1,INDUK40015000!$A$6:$RL$1005,431,)=0,\"-\",VLOOKUP($AA$1,INDUK40015000!$A$6:$RL$1005,431,))","v":"-"},null,null,null,null,null,14]
["VI.","IJAZAH / SKHU :"]
[null,"21.","Nomor Ijazah :",null,{"$f":"IF(VLOOKUP($AA$1,INDUK40015000!$A$6:$RL$1005,434,)=0,\"-\",VLOOKUP($AA$1,INDUK40015000!$A$6:$RL$1005,434,))","v":"-"},null,null,null,null,null,null,null,null,"Tempat",null,null,{"$f":"IF(VLOOKUP($AA$1,INDUK40015000!$A$6:$RL$1005,435,)=0,\"-\",VLOOKUP($AA$1,INDUK40015000!$A$6:$RL$1005,435,))","v":"-"},null,null,null,null,null,"22. Diberikan Tgl :",null,null,null,null,null,{"$f":"IF(VLOOKUP($AA$1,INDUK40015000!$A$6:$RL$1005,436,)=0,\"-\",VLOOKUP($AA$1,INDUK40015000!$A$6:$RL$1005,436,))","v":"-"}]
[]
[null,"21.","Nomor SKHU:",null,{"$f":"IF(VLOOKUP($AA$1,INDUK40015000!$A$6:$RL$1005,437,)=0,\"-\",VLOOKUP($AA$1,INDUK40015000!$A$6:$RL$1005,437,))","v":"-"},null,null,null,null,null,null,null,null,"Tempat",null,null,{"$f":"IF(VLOOKUP($AA$1,INDUK40015000!$A$6:$RL$1005,438,)=0,\"-\",VLOOKUP($AA$1,INDUK40015000!$A$6:$RL$1005,438,))","v":"-"},null,null,null,null,null,"22. Diberikan Tgl :",null,null,null,null,null,{"$f":"IF(VLOOKUP($AA$1,INDUK40015000!$A$6:$RL$1005,439,)=0,\"-\",VLOOKUP($AA$1,INDUK40015000!$A$6:$RL$1005,439,))","v":"-"}]
["VII.","PENGHARGAAN"]
[null,"23.","Piagam Penghargaan yang pernah diterima :"]
[]
[null,null,"a. Bidang",{"$f":"IF(VLOOKUP($AA$1,INDUK40015000!$A$6:$RL$1005,437,)=0,\"-\",VLOOKUP($AA$1,INDUK40015000!$A$6:$RL$1005,437,))","v":"-"},null,null,null,null,null,null,null,null,null,"Nomor",null,":",{"$f":"IF(VLOOKUP($AA$1,INDUK40015000!$A$6:$RL$1005,438,)=0,\"-\",VLOOKUP($AA$1,INDUK40015000!$A$6:$RL$1005,438,))","v":"-"},null,null,null,null,null,null,null,"Tanggal",null,":",{"$f":"IF(VLOOKUP($AA$1,INDUK40015000!$A$6:$RL$1005,439,)=0,\"-\",VLOOKUP($AA$1,INDUK40015000!$A$6:$RL$1005,439,))","v":"-"}]
[]
[null,null,"b. Bidang",{"$f":"IF(VLOOKUP($AA$1,INDUK40015000!$A$6:$RL$1005,440,)=0,\"-\",VLOOKUP($AA$1,INDUK40015000!$A$6:$RL$1005,440,))","v":"-"},null,null,null,null,null,null,null,null,null,"Nomor",null,":",{"$f":"IF(VLOOKUP($AA$1,INDUK40015000!$A$6:$RL$1005,441,)=0,\"-\",VLOOKUP($AA$1,INDUK40015000!$A$6:$RL$1005,441,))","v":"-"},null,null,null,null,null,null,null,"Tanggal",null,":",{"$f":"IF(VLOOKUP($AA$1,INDUK40015000!$A$6:$RL$1005,442,)=0,\"-\",VLOOKUP($AA$1,INDUK40015000!$A$6:$RL$1005,442,))","v":"-"}]
[]
["VIII. ","KETERANGAN"]
[null,"24.","Surat Keterangan yang pernah diberikan oleh Madrasah ini :"]
[]
[null,null,"a. Tentang",":",{"$f":"IF(VLOOKUP($AA$1,INDUK40015000!$A$6:$RL$1005,443,)=0,\"-\",VLOOKUP($AA$1,INDUK40015000!$A$6:$RL$1005,443,))","v":"-"},null,null,null,null,null,null,null,null,"Nomor",null,":",{"$f":"IF(VLOOKUP($AA$1,INDUK40015000!$A$6:$RL$1005,444,)=0,\"-\",VLOOKUP($AA$1,INDUK40015000!$A$6:$RL$1005,444,))","v":"-"},null,null,null,null,null,null,null,"Tanggal",null,":",{"$f":"IF(VLOOKUP($AA$1,INDUK40015000!$A$6:$RL$1005,445,)=0,\"-\",VLOOKUP($AA$1,INDUK40015000!$A$6:$RL$1005,445,))","v":"-"}]
[]
[null,null,"b. Tentang",":",{"$f":"IF(VLOOKUP($AA$1,INDUK40015000!$A$6:$RL$1005,446,)=0,\"-\",VLOOKUP($AA$1,INDUK40015000!$A$6:$RL$1005,446,))","v":"-"},null,null,null,null,null,null,null,null,"Nomor",null,":",{"$f":"IF(VLOOKUP($AA$1,INDUK40015000!$A$6:$RL$1005,447,)=0,\"-\",VLOOKUP($AA$1,INDUK40015000!$A$6:$RL$1005,447,))","v":"-"},null,null,null,null,null,null,null,"Tanggal",null,":",{"$f":"IF(VLOOKUP($AA$1,INDUK40015000!$A$6:$RL$1005,448,)=0,\"-\",VLOOKUP($AA$1,INDUK40015000!$A$6:$RL$1005,448,))","v":"-"}]