{"text_format":"1","workbook":"xlsx","n_sheets":6,"sheets":["PROFIL","DATA_SISWA","PHOTO","CETAK","TEMPLATE","STEMPEL"],"not_rendered":{"charts":0,"images":16,"macros":1,"external_links":0,"defined_names":26,"comments":1,"pivot_tables":0},"unopened":[],"bounds":{"document_bytes":16777216,"sheet_cells":100000,"rows_first":2000,"rows_last":500,"rows_between":2000,"halvings":0,"cell_chars":16384,"cell_head_chars":4096},"cells_cut":0,"cells_raw":0,"read":"whole","date_system":"1900"}

{"sheet":"PROFIL","index":0,"n_rows":14,"n_cols":3,"rows_kept":14,"cut":false,"hidden":false,"merged":[]}
[]
[]
[]
[]
["Tanggal Cetak",":","18 Juli 2017"]
["Nama Sekolah",":","MIS NURUL ISLAM LABRUK KIDUL "]
["Alamat Sekolah",":","Desa Labruk Kidul"]
["Jalan",":","Jl. Raya Labruk Kidul"]
["Nomor",":","1900-03-05"]
["Kecamatan",":","Sumbersuko"]
["Kabupaten",":","Lumajang"]
["Kode POS",":",67316]
["Nama Kepsek",":","SAHRONI, S.Pd"]
["NIP Kepsek",":","-"]

{"sheet":"DATA_SISWA","index":1,"n_rows":1008,"n_cols":15,"rows_kept":1008,"cut":false,"hidden":false,"merged":[[4,13,5,13],[4,7,4,12],[4,0,5,0],[4,1,5,1],[4,2,5,2],[4,3,5,3],[4,4,5,4],[4,5,4,6]]}
[]
[]
[]
[]
["No","Nama Lengkap","Jenis Kelamin","NIS LOKAL","NISN","Tempat Tanggal Lahir",null,"Alamat",null,null,null,null,null,"Kelas"]
[null,null,null,null,null,"Tempat Lahir","Tanggal Lahir","Jalan","Dusun","RT","RW","Desa","Kecamatan"]
[1,2,3,4,5,6,7,8,9,10,11,12,13,14]
["1","SAFA FITRI ANGGRAINI","P",null,null,"BOGOR","27/09/2009 ","Krajan Timur",null,null,null,"Labruk Kidul","SUMBERSUKO"]
["2","BIMA SATRIA DIRGANTARA","L",null,78400392,"BEKASI","18/10/2007","JALAN MULYOREJO",null,null,null,"Labruk Kidul","SUMBERSUKO"]
["3","ACHMAD ROZALI","L",null,59959765,"BOGOR","02/09/2005",null,null,null,null,"Labruk Kidul","SUMBERSUKO"]
["4","VIKA KUSUMA WATI","P",null,78966795,"BOGOR","03/05/2007",null,null,null,null,"Kebonsari","SUMBERSUKO"]
["5","MUHAMMAD NUR KHOLIS","L",null,54014487,"BEKASI","09/09/2005",null,null,null,null,"Kebonsari","SUMBERSUKO"]
["6","RESTI FITRIANTI DWI OCTAVIANI","P",null,71234523,"BEKASI","22/10/2007","DUSUN KRAJAN BARAT",null,null,null,"Labruk Kidul","SUMBERSUKO"]
["7","DWITA FITA WULANDARI","P",null,77670297,"BOGOR","25/02/2007",null,null,null,null,"Labruk Kidul","SUMBERSUKO"]
["8","MOCHAMAD RAFLI DIAN SAPUTRA","L",null,76361559,"BOGOR","28/07/2007","DSN KRAJAN BARAT",null,null,null,"Labruk Kidul","SUMBERSUKO"]
["9","MUHAMMAD FARIL FIRMANSYA","L",null,71459044,"BOGOR","01/08/2007","DUSUN KRAJAN BARAT",null,null,null,"Labruk Kidul","SUMBERSUKO"]
["10","SYARIF HIDAYATULLAH","L",null,null,"BOGOR","24/01/2010","Krajan Timur",null,null,null,"Labruk Kidul","SUMBERSUKO"]
["11","SITI WIFAQOTUL IMAMATUR ROHMAH","P",null,58323434,"JAKARTA","13/05/2005",null,null,null,null,"Labruk Kidul","SUMBERSUKO"]
["12","ACHMAD SEPTIAN HAMDANI","L",null,75656390,"BOGOR","10/09/2007","DUSUN GEDONGSARI",null,null,null,"Labruk Kidul","SUMBERSUKO"]
["13","CIPTA ADI KARYA RISQI","L",null,null,"BEKASI","03/11/2009","Krajan Barat",null,null,null,"Labruk Kidul","SUMBERSUKO"]
["14","YOHAN EGA GILANG PERMANA","L",null,78966795,"NGAWI","24/11/2006",null,null,null,null,"Kebonsari","SUMBERSUKO"]
["15","INDRI MAULIDIYAH","P",null,null,"BOGOR","17/03/2009","DUSUN SARIREJO 1 ",null,null,null,"Kebonsari","SUMBERSUKO"]
["16","MAYA BUNGA ANJANI","P",null,72198448,"BOGOR","04/05/2007",null,null,null,null,"Labruk Kidul","SUMBERSUKO"]
["17","AHMAD RIZKI JAELANI","L",null,55858941,"BOGOR","31/01/2005",null,null,null,null,"Labruk Kidul","SUMBERSUKO"]
["18","HANUM SYAIKHANATUL LAILI","P",null,87024587,"BOGOR","19/06/2008","DUSUN KRAJAN BARAT ",null,null,null,"Labruk Kidul","SUMBERSUKO"]
["19","MUHAMMAD SEPTYAN EKA PRATAMA","L",null,61244045,"BOGOR","14/09/2006",null,null,null,null,"Labruk Kidul","SUMBERSUKO"]
["20","MUHAMMAD AKBAR MAULANA","L",null,null,"BOGOR","22/04/2009","Krajan Timur",null,null,null,"Labruk Kidul","SUMBERSUKO"]
["21","AHMAD RAMADHANI","L",null,89502201,"BOGOR","13/09/2008",null,null,null,null,"Labruk Kidul","SUMBERSUKO"]
["22","MUHAMMAD AKBAR MAULANA ISKHAQ","L",null,48413172,"BOGOR","31/05/2004",null,null,null,null,"Labruk Kidul","SUMBERSUKO"]
["23","MUHAMMAD FARIZ UBAIDILLA","L",null,74206034,"BOGOR","05/09/2007","Dusun Gedongsari",null,null,null,"Labruk Kidul","SUMBERSUKO"]
["24","RIZKA AYU WULANDARI","P",null,64723905,"BEKASI","23/05/2006",null,null,null,null,"Labruk Kidul","SUMBERSUKO"]
["25","ACHMAD YANI","L",null,86607649,"BOGOR","12/06/2008","Sarirejo 2",null,null,null,"Kebonsari","SUMBERSUKO"]
["26","AININ NAFISA FEBRIYANTI","P",null,84691896,"BOGOR","12/02/2008","DUSUN GEDONGSARI",null,null,null,"Labruk Kidul","SUMBERSUKO"]
["27","HAMALNA DEWI NURHASANAH","P",null,53064310,"BOGOR","22/05/2005",null,null,null,null,"Sumbersuko","SUMBERSUKO"]
["28","KHUSNI CAHYONO","L",null,57006145,"BOGOR","14/07/2005",null,null,null,null,"Labruk Kidul","SUMBERSUKO"]
["29","MUHAMMAD REZA NURDIANSYAH","L",null,58706223,"BOGOR","15/07/2005",null,null,null,null,"Labruk Kidul","SUMBERSUKO"]
["30","NUR ALYA NABILA","P",null,79872151,"BOGOR","02/09/2007","GEDONGSARI",null,null,null,"Labruk Kidul","SUMBERSUKO"]
["31","MUHAMAD JEFRI MAULANA","L",null,75363258,"BEKASI","10/03/2007","DUSUN GEDONGSARI",null,null,null,"Labruk Kidul","SUMBERSUKO"]
["32","MUHAMMAD AULYA RAHMAN","L",null,88664891,"BEKASI","01/06/2008","Krajan Barat",null,null,null,"Labruk Kidul","SUMBERSUKO"]
["33","AHMAD ZAINURI","L",null,63987371,"BOGOR","01/01/2006",null,null,null,null,"Tompokersan","LUMAJANG"]
["34","ADITYA MAULA FANDY TAULANI","L",null,67566336,null,"13/06/2006",null,null,null,null,"Labruk Kidul","SUMBERSUKO"]
["35","MUHAMMAD IQBAL RAMADHAN","L",null,null,null,"27/08/2009","Krajan",null,null,null,"Grati","SUMBERSUKO"]
["36","MUKHAMAD KHOIRUL AMIN","L",null,78949167,null,"02/05/2007",null,null,null,null,"Labruk Kidul","SUMBERSUKO"]
["37","VERA MUSTIKA","P",null,null,null,"09/11/2007","DUSUN SARIREJO I",null,null,null,"Kebonsari","SUMBERSUKO"]
["38","JULI ANDRIYANTO","L",null,68258891,null,"11/07/2006",null,null,null,null,"Labruk Kidul","SUMBERSUKO"]
["39","FAKHIS GABRIL LIA","P",null,74514146,null,"04/05/2007","DUSUN KRAJAN BARAT",null,null,null,"Labruk Kidul","SUMBERSUKO"]
["40","ANANDA AMILIA","P",null,null,null,"10/02/2006",null,null,null,null,"Labruk Kidul","SUMBERSUKO"]
["41","ADELINA KHILYATUL MILLAH","P",null,44692459,null,"03/12/2004                                                                      ",null,null,null,null,"Labruk Kidul","SUMBERSUKO"]
["42","ROHMADONA DWI SAFITRI","P",null,84859051,null,"14/09/2008","DUSUN SUKO II",null,null,null,"Sumbersuko","SUMBERSUKO"]
[]
[]
[]
[]
[]
[]
[]
[]
[]
[]
[]
[]
[]
[]
[]
[]
[]
[]
[]
[]
[]
[]
[]
[]
[]
[]
[]
[]
[]
[]
[]
[]
[]
[]
[]
[]
[]
[]
[]
[]
[]
[]
[]
[]
[]
[]
[]
[]
[]
[]
[]
[]
[]
[]
[]
[]
[]
[]
[]
[]
[]
[]
[]
[]
[]
[]
[]
[]
[]
[]
[]
[]
[]
[]
[]
[]
[]
[]
[]
[]
[]
[]
[]
[]
[]
[]
[]
[]
[]
[]
[]
[]
[]
[]
[]
[]
[]
[]
[]
[]
[]
[]
[]
[]
[]
[]
[]
[]
[]
[]
[]
[]
[]
[]
[]
[]
[]
[]
[]
[]
[]
[]
[]
[]
[]
[]
[]
[]
[]
[]
[]
[]
[]
[]
[]
[]
[]
[]
[]
[]
[]
[]
[]
[]
[]
[]
[]
[]
[]
[]
[]
[]
[]
[]
[]
[]
[]
[]
[]
[]
[]
[]
[]
[]
[]
[]
[]
[]
[]
[]
[]
[]
[]
[]
[]
[]
[]
[]
[]
[]
[]
[]
[]
[]
[]
[]
[]
[]
[]
[]
[]
[]
[]
[]
[]
[]
[]
[]
[]
[]
[]
[]
[]
[]
[]
[]
[]
[]
[]
[]
[]
[]
[]
[]
[]
[]
[]
[]
[]
[]
[]
[]
[]
[]
[]
[]
[]
[]
[]
[]
[]
[]
[]
[]
[]
[]
[]
[]
[]
[]
[]
[]
[]
[]
[]
[]
[]
[]
[]
[]
[]
[]
[]
[]
[]
[]
[]
[]
[]
[]
[]
[]
[]
[]
[]
[]
[]
[]
[]
[]
[]
[]
[]
[]
[]
[]
[]
[]
[]
[]
[]
[]
[]
[]
[]
[]
[]
[]
[]
[]
[]
[]
[]
[]
[]
[]
[]
[]
[]
[]
[]
[]
[]
[]
[]
[]
[]
[]
[]
[]
[]
[]
[]
[]
[]
[]
[]
[]
[]
[]
[]
[]
[]
[]
[]
[]
[]
[]
[]
[]
[]
[]
[]
[]
[]
[]
[]
[]
[]
[]
[]
[]
[]
[]
[]
[]
[]
[]
[]
[]
[]
[]
[]
[]
[]
[]
[]
[]
[]
[]
[]
[]
[]
[]
[]
[]
[]
[]
[]
[]
[]
[]
[]
[]
[]
[]
[]
[]
[]
[]
[]
[]
[]
[]
[]
[]
[]
[]
[]
[]
[]
[]
[]
[]
[]
[]
[]
[]
[]
[]
[]
[]
[]
[]
[]
[]
[]
[]
[]
[]
[]
[]
[]
[]
[]
[]
[]
[]
[]
[]
[]
[]
[]
[]
[]
[]
[]
[]
[]
[]
[]
[]
[]
[]
[]
[]
[]
[]
[]
[]
[]
[]
[]
[]
[]
[]
[]
[]
[]
[]
[]
[]
[]
[]
[]
[]
[]
[]
[]
[]
[]
[]
[]
[]
[]
[]
[]
[]
[]
[]
[]
[]
[]
[]
[]
[]
[]
[]
[]
[]
[]
[]
[]
[]
[]
[]
[]
[]
[]
[]
[]
[]
[]
[]
[]
[]
[]
[]
[]
[]
[]
[]
[]
[]
[]
[]
[]
[]
[]
[]
[]
[]
[]
[]
[]
[]
[]
[]
[]
[]
[]
[]
[]
[]
[]
[]
[]
[]
[]
[]
[]
[]
[]
[]
[]
[]
[]
[]
[]
[]
[]
[]
[]
[]
[]
[]
[]
[]
[]
[]
[]
[]
[]
[]
[]
[]
[]
[]
[]
[]
[]
[]
[]
[]
[]
[]
[]
[]
[]
[]
[]
[]
[]
[]
[]
[]
[]
[]
[]
[]
[]
[]
[]
[]
[]
[]
[]
[]
[]
[]
[]
[]
[]
[]
[]
[]
[]
[]
[]
[]
[]
[]
[]
[]
[]
[]
[]
[]
[]
[]
[]
[]
[]
[]
[]
[]
[]
[]
[]
[]
[]
[]
[]
[]
[]
[]
[]
[]
[]
[]
[]
[]
[]
[]
[]
[]
[]
[]
[]
[]
[]
[]
[]
[]
[]
[]
[]
[]
[]
[]
[]
[]
[]
[]
[]
[]
[]
[]
[]
[]
[]
[]
[]
[]
[]
[]
[]
[]
[]
[]
[]
[]
[]
[]
[]
[]
[]
[]
[]
[]
[]
[]
[]
[]
[]
[]
[]
[]
[]
[]
[]
[]
[]
[]
[]
[]
[]
[]
[]
[]
[]
[]
[]
[]
[]
[]
[]
[]
[]
[]
[]
[]
[]
[]
[]
[]
[]
[]
[]
[]
[]
[]
[]
[]
[]
[]
[]
[]
[]
[]
[]
[]
[]
[]
[]
[]
[]
[]
[]
[]
[]
[]
[]
[]
[]
[]
[]
[]
[]
[]
[]
[]
[]
[]
[]
[]
[]
[]
[]
[]
[]
[]
[]
[]
[]
[]
[]
[]
[]
[]
[]
[]
[]
[]
[]
[]
[]
[]
[]
[]
[]
[]
[]
[]
[]
[]
[]
[]
[]
[]
[]
[]
[]
[]
[]
[]
[]
[]
[]
[]
[]
[]
[]
[]
[]
[]
[]
[]
[]
[]
[]
[]
[]
[]
[]
[]
[]
[]
[]
[]
[]
[]
[]
[]
[]
[]
[]
[]
[]
[]
[]
[]
[]
[]
[]
[]
[]
[]
[]
[]
[]
[]
[]
[]
[]
[]
[]
[]
[]
[]
[]
[]
[]
[]
[]
[]
[]
[]
[]
[]
[]
[]
[]
[]
[]
[]
[]
[]
[]
[]
[]
[]
[]
[]
[]
[]
[]
[]
[]
[]
[]
[]
[]
[]
[]
[]
[]
[]
[]
[]
[]
[]
[]
[]
[]
[]
[]
[]
[]
[]
[]
[]
[]
[]
[]
[]
[]
[]
[]
[]
[]
[]
[]
[]
[]
[]
[]
[]
[]
[]
[]
[]
[]
[]
[]
[]
[]
[]
[]
[]
[]
[]
[]
[]
[]
[]
[]
[]
[]
[]
[]
[]
[]
[]
[]
[]
[]
[]
[]
[]
[]
[]
[]
[]
[]
[]
[]
[]
["X","X","X","X","X","X","X",null,"X",null,null,"X",null,"X","X"]

{"sheet":"PHOTO","index":2,"n_rows":1006,"n_cols":4,"rows_kept":1006,"cut":false,"hidden":false,"merged":[[5,5,6,7]]}
[]
[]
[]
["NO","NAMA_SISWA","PHOTO 3 X 4"]
[1,2,3]
[{"$f":"IF(DATA_SISWA!A8=\"\",\"\",DATA_SISWA!A8)","v":"1"},{"$f":"IF(DATA_SISWA!B8=\"\",\"\",DATA_SISWA!B8)","v":"SAFA FITRI ANGGRAINI"}]
[{"$f":"IF(DATA_SISWA!A9=\"\",\"\",DATA_SISWA!A9)","v":"2"},{"$f":"IF(DATA_SISWA!B9=\"\",\"\",DATA_SISWA!B9)","v":"BIMA SATRIA DIRGANTARA"}]
[{"$f":"IF(DATA_SISWA!A10=\"\",\"\",DATA_SISWA!A10)","v":"3"},{"$f":"IF(DATA_SISWA!B10=\"\",\"\",DATA_SISWA!B10)","v":"ACHMAD ROZALI"}]
[{"$f":"IF(DATA_SISWA!A11=\"\",\"\",DATA_SISWA!A11)","v":"4"},{"$f":"IF(DATA_SISWA!B11=\"\",\"\",DATA_SISWA!B11)","v":"VIKA KUSUMA WATI"}]
[{"$f":"IF(DATA_SISWA!A12=\"\",\"\",DATA_SISWA!A12)","v":"5"},{"$f":"IF(DATA_SISWA!B12=\"\",\"\",DATA_SISWA!B12)","v":"MUHAMMAD NUR KHOLIS"}]
[{"$f":"IF(DATA_SISWA!A13=\"\",\"\",DATA_SISWA!A13)","v":"6"},{"$f":"IF(DATA_SISWA!B13=\"\",\"\",DATA_SISWA!B13)","v":"RESTI FITRIANTI DWI OCTAVIANI"}]
[{"$f":"IF(DATA_SISWA!A14=\"\",\"\",DATA_SISWA!A14)","v":"7"},{"$f":"IF(DATA_SISWA!B14=\"\",\"\",DATA_SISWA!B14)","v":"DWITA FITA WULANDARI"}]
[{"$f":"IF(DATA_SISWA!A15=\"\",\"\",DATA_SISWA!A15)","v":"8"},{"$f":"IF(DATA_SISWA!B15=\"\",\"\",DATA_SISWA!B15)","v":"MOCHAMAD RAFLI DIAN SAPUTRA"}]
[{"$f":"IF(DATA_SISWA!A16=\"\",\"\",DATA_SISWA!A16)","v":"9"},{"$f":"IF(DATA_SISWA!B16=\"\",\"\",DATA_SISWA!B16)","v":"MUHAMMAD FARIL FIRMANSYA"}]
[{"$f":"IF(DATA_SISWA!A17=\"\",\"\",DATA_SISWA!A17)","v":"10"},{"$f":"IF(DATA_SISWA!B17=\"\",\"\",DATA_SISWA!B17)","v":"SYARIF HIDAYATULLAH"}]
[{"$f":"IF(DATA_SISWA!A18=\"\",\"\",DATA_SISWA!A18)","v":"11"},{"$f":"IF(DATA_SISWA!B18=\"\",\"\",DATA_SISWA!B18)","v":"SITI WIFAQOTUL IMAMATUR ROHMAH"}]
[{"$f":"IF(DATA_SISWA!A19=\"\",\"\",DATA_SISWA!A19)","v":"12"},{"$f":"IF(DATA_SISWA!B19=\"\",\"\",DATA_SISWA!B19)","v":"ACHMAD SEPTIAN HAMDANI"}]
[{"$f":"IF(DATA_SISWA!A20=\"\",\"\",DATA_SISWA!A20)","v":"13"},{"$f":"IF(DATA_SISWA!B20=\"\",\"\",DATA_SISWA!B20)","v":"CIPTA ADI KARYA RISQI"}]
[{"$f":"IF(DATA_SISWA!A21=\"\",\"\",DATA_SISWA!A21)","v":"14"},{"$f":"IF(DATA_SISWA!B21=\"\",\"\",DATA_SISWA!B21)","v":"YOHAN EGA GILANG PERMANA"}]
[{"$f":"IF(DATA_SISWA!A22=\"\",\"\",DATA_SISWA!A22)","v":"15"},{"$f":"IF(DATA_SISWA!B22=\"\",\"\",DATA_SISWA!B22)","v":"INDRI MAULIDIYAH"}]
[{"$f":"IF(DATA_SISWA!A23=\"\",\"\",DATA_SISWA!A23)","v":"16"},{"$f":"IF(DATA_SISWA!B23=\"\",\"\",DATA_SISWA!B23)","v":"MAYA BUNGA ANJANI"}]
[{"$f":"IF(DATA_SISWA!A24=\"\",\"\",DATA_SISWA!A24)","v":"17"},{"$f":"IF(DATA_SISWA!B24=\"\",\"\",DATA_SISWA!B24)","v":"AHMAD RIZKI JAELANI"}]
[{"$f":"IF(DATA_SISWA!A25=\"\",\"\",DATA_SISWA!A25)","v":"18"},{"$f":"IF(DATA_SISWA!B25=\"\",\"\",DATA_SISWA!B25)","v":"HANUM SYAIKHANATUL LAILI"}]
[{"$f":"IF(DATA_SISWA!A26=\"\",\"\",DATA_SISWA!A26)","v":"19"},{"$f":"IF(DATA_SISWA!B26=\"\",\"\",DATA_SISWA!B26)","v":"MUHAMMAD SEPTYAN EKA PRATAMA"}]
[{"$f":"IF(DATA_SISWA!A27=\"\",\"\",DATA_SISWA!A27)","v":"20"},{"$f":"IF(DATA_SISWA!B27=\"\",\"\",DATA_SISWA!B27)","v":"MUHAMMAD AKBAR MAULANA"}]
[{"$f":"IF(DATA_SISWA!A28=\"\",\"\",DATA_SISWA!A28)","v":"21"},{"$f":"IF(DATA_SISWA!B28=\"\",\"\",DATA_SISWA!B28)","v":"AHMAD RAMADHANI"}]
[{"$f":"IF(DATA_SISWA!A29=\"\",\"\",DATA_SISWA!A29)","v":"22"},{"$f":"IF(DATA_SISWA!B29=\"\",\"\",DATA_SISWA!B29)","v":"MUHAMMAD AKBAR MAULANA ISKHAQ"}]
[{"$f":"IF(DATA_SISWA!A30=\"\",\"\",DATA_SISWA!A30)","v":"23"},{"$f":"IF(DATA_SISWA!B30=\"\",\"\",DATA_SISWA!B30)","v":"MUHAMMAD FARIZ UBAIDILLA"}]
[{"$f":"IF(DATA_SISWA!A31=\"\",\"\",DATA_SISWA!A31)","v":"24"},{"$f":"IF(DATA_SISWA!B31=\"\",\"\",DATA_SISWA!B31)","v":"RIZKA AYU WULANDARI"}]
[{"$f":"IF(DATA_SISWA!A32=\"\",\"\",DATA_SISWA!A32)","v":"25"},{"$f":"IF(DATA_SISWA!B32=\"\",\"\",DATA_SISWA!B32)","v":"ACHMAD YANI"}]
[{"$f":"IF(DATA_SISWA!A33=\"\",\"\",DATA_SISWA!A33)","v":"26"},{"$f":"IF(DATA_SISWA!B33=\"\",\"\",DATA_SISWA!B33)","v":"AININ NAFISA FEBRIYANTI"}]
[{"$f":"IF(DATA_SISWA!A34=\"\",\"\",DATA_SISWA!A34)","v":"27"},{"$f":"IF(DATA_SISWA!B34=\"\",\"\",DATA_SISWA!B34)","v":"HAMALNA DEWI NURHASANAH"}]
[{"$f":"IF(DATA_SISWA!A35=\"\",\"\",DATA_SISWA!A35)","v":"28"},{"$f":"IF(DATA_SISWA!B35=\"\",\"\",DATA_SISWA!B35)","v":"KHUSNI CAHYONO"}]
[{"$f":"IF(DATA_SISWA!A36=\"\",\"\",DATA_SISWA!A36)","v":"29"},{"$f":"IF(DATA_SISWA!B36=\"\",\"\",DATA_SISWA!B36)","v":"MUHAMMAD REZA NURDIANSYAH"}]
[{"$f":"IF(DATA_SISWA!A37=\"\",\"\",DATA_SISWA!A37)","v":"30"},{"$f":"IF(DATA_SISWA!B37=\"\",\"\",DATA_SISWA!B37)","v":"NUR ALYA NABILA"}]
[{"$f":"IF(DATA_SISWA!A38=\"\",\"\",DATA_SISWA!A38)","v":"31"},{"$f":"IF(DATA_SISWA!B38=\"\",\"\",DATA_SISWA!B38)","v":"MUHAMAD JEFRI MAULANA"}]
[{"$f":"IF(DATA_SISWA!A39=\"\",\"\",DATA_SISWA!A39)","v":"32"},{"$f":"IF(DATA_SISWA!B39=\"\",\"\",DATA_SISWA!B39)","v":"MUHAMMAD AULYA RAHMAN"}]
[{"$f":"IF(DATA_SISWA!A40=\"\",\"\",DATA_SISWA!A40)","v":"33"},{"$f":"IF(DATA_SISWA!B40=\"\",\"\",DATA_SISWA!B40)","v":"AHMAD ZAINURI"}]
[{"$f":"IF(DATA_SISWA!A41=\"\",\"\",DATA_SISWA!A41)","v":"34"},{"$f":"IF(DATA_SISWA!B41=\"\",\"\",DATA_SISWA!B41)","v":"ADITYA MAULA FANDY TAULANI"}]
[{"$f":"IF(DATA_SISWA!A42=\"\",\"\",DATA_SISWA!A42)","v":"35"},{"$f":"IF(DATA_SISWA!B42=\"\",\"\",DATA_SISWA!B42)","v":"MUHAMMAD IQBAL RAMADHAN"}]
[{"$f":"IF(DATA_SISWA!A43=\"\",\"\",DATA_SISWA!A43)","v":"36"},{"$f":"IF(DATA_SISWA!B43=\"\",\"\",DATA_SISWA!B43)","v":"MUKHAMAD KHOIRUL AMIN"}]
[{"$f":"IF(DATA_SISWA!A44=\"\",\"\",DATA_SISWA!A44)","v":"37"},{"$f":"IF(DATA_SISWA!B44=\"\",\"\",DATA_SISWA!B44)","v":"VERA MUSTIKA"}]
[{"$f":"IF(DATA_SISWA!A45=\"\",\"\",DATA_SISWA!A45)","v":"38"},{"$f":"IF(DATA_SISWA!B45=\"\",\"\",DATA_SISWA!B45)","v":"JULI ANDRIYANTO"}]
[{"$f":"IF(DATA_SISWA!A46=\"\",\"\",DATA_SISWA!A46)","v":"39"},{"$f":"IF(DATA_SISWA!B46=\"\",\"\",DATA_SISWA!B46)","v":"FAKHIS GABRIL LIA"}]
[{"$f":"IF(DATA_SISWA!A47=\"\",\"\",DATA_SISWA!A47)","v":"40"},{"$f":"IF(DATA_SISWA!B47=\"\",\"\",DATA_SISWA!B47)","v":"ANANDA AMILIA"}]
[{"$f":"IF(DATA_SISWA!A48=\"\",\"\",DATA_SISWA!A48)","v":"41"},{"$f":"IF(DATA_SISWA!B48=\"\",\"\",DATA_SISWA!B48)","v":"ADELINA KHILYATUL MILLAH"}]
[{"$f":"IF(DATA_SISWA!A49=\"\",\"\",DATA_SISWA!A49)","v":"42"},{"$f":"IF(DATA_SISWA!B49=\"\",\"\",DATA_SISWA!B49)","v":"ROHMADONA DWI SAFITRI"}]
[{"$f":"IF(DATA_SISWA!A50=\"\",\"\",DATA_SISWA!A50)","v":""},{"$f":"IF(DATA_SISWA!B50=\"\",\"\",DATA_SISWA!B50)","v":""}]
[{"$f":"IF(DATA_SISWA!A51=\"\",\"\",DATA_SISWA!A51)","v":""},{"$f":"IF(DATA_SISWA!B51=\"\",\"\",DATA_SISWA!B51)","v":""}]
[{"$f":"IF(DATA_SISWA!A52=\"\",\"\",DATA_SISWA!A52)","v":""},{"$f":"IF(DATA_SISWA!B52=\"\",\"\",DATA_SISWA!B52)","v":""}]
[{"$f":"IF(DATA_SISWA!A53=\"\",\"\",DATA_SISWA!A53)","v":""},{"$f":"IF(DATA_SISWA!B53=\"\",\"\",DATA_SISWA!B53)","v":""}]
[{"$f":"IF(DATA_SISWA!A54=\"\",\"\",DATA_SISWA!A54)","v":""},{"$f":"IF(DATA_SISWA!B54=\"\",\"\",DATA_SISWA!B54)","v":""}]
[{"$f":"IF(DATA_SISWA!A55=\"\",\"\",DATA_SISWA!A55)","v":""},{"$f":"IF(DATA_SISWA!B55=\"\",\"\",DATA_SISWA!B55)","v":""}]
[{"$f":"IF(DATA_SISWA!A56=\"\",\"\",DATA_SISWA!A56)","v":""},{"$f":"IF(DATA_SISWA!B56=\"\",\"\",DATA_SISWA!B56)","v":""}]
[{"$f":"IF(DATA_SISWA!A57=\"\",\"\",DATA_SISWA!A57)","v":""},{"$f":"IF(DATA_SISWA!B57=\"\",\"\",DATA_SISWA!B57)","v":""}]
[{"$f":"IF(DATA_SISWA!A58=\"\",\"\",DATA_SISWA!A58)","v":""},{"$f":"IF(DATA_SISWA!B58=\"\",\"\",DATA_SISWA!B58)","v":""}]
[{"$f":"IF(DATA_SISWA!A59=\"\",\"\",DATA_SISWA!A59)","v":""},{"$f":"IF(DATA_SISWA!B59=\"\",\"\",DATA_SISWA!B59)","v":""}]
[{"$f":"IF(DATA_SISWA!A60=\"\",\"\",DATA_SISWA!A60)","v":""},{"$f":"IF(DATA_SISWA!B60=\"\",\"\",DATA_SISWA!B60)","v":""}]
[{"$f":"IF(DATA_SISWA!A61=\"\",\"\",DATA_SISWA!A61)","v":""},{"$f":"IF(DATA_SISWA!B61=\"\",\"\",DATA_SISWA!B61)","v":""}]
[{"$f":"IF(DATA_SISWA!A62=\"\",\"\",DATA_SISWA!A62)","v":""},{"$f":"IF(DATA_SISWA!B62=\"\",\"\",DATA_SISWA!B62)","v":""}]
[{"$f":"IF(DATA_SISWA!A63=\"\",\"\",DATA_SISWA!A63)","v":""},{"$f":"IF(DATA_SISWA!B63=\"\",\"\",DATA_SISWA!B63)","v":""}]
[{"$f":"IF(DATA_SISWA!A64=\"\",\"\",DATA_SISWA!A64)","v":""},{"$f":"IF(DATA_SISWA!B64=\"\",\"\",DATA_SISWA!B64)","v":""}]
[{"$f":"IF(DATA_SISWA!A65=\"\",\"\",DATA_SISWA!A65)","v":""},{"$f":"IF(DATA_SISWA!B65=\"\",\"\",DATA_SISWA!B65)","v":""}]
[{"$f":"IF(DATA_SISWA!A66=\"\",\"\",DATA_SISWA!A66)","v":""},{"$f":"IF(DATA_SISWA!B66=\"\",\"\",DATA_SISWA!B66)","v":""}]
[{"$f":"IF(DATA_SISWA!A67=\"\",\"\",DATA_SISWA!A67)","v":""},{"$f":"IF(DATA_SISWA!B67=\"\",\"\",DATA_SISWA!B67)","v":""}]
[{"$f":"IF(DATA_SISWA!A68=\"\",\"\",DATA_SISWA!A68)","v":""},{"$f":"IF(DATA_SISWA!B68=\"\",\"\",DATA_SISWA!B68)","v":""}]
[{"$f":"IF(DATA_SISWA!A69=\"\",\"\",DATA_SISWA!A69)","v":""},{"$f":"IF(DATA_SISWA!B69=\"\",\"\",DATA_SISWA!B69)","v":""}]
[{"$f":"IF(DATA_SISWA!A70=\"\",\"\",DATA_SISWA!A70)","v":""},{"$f":"IF(DATA_SISWA!B70=\"\",\"\",DATA_SISWA!B70)","v":""}]
[{"$f":"IF(DATA_SISWA!A71=\"\",\"\",DATA_SISWA!A71)","v":""},{"$f":"IF(DATA_SISWA!B71=\"\",\"\",DATA_SISWA!B71)","v":""}]
[{"$f":"IF(DATA_SISWA!A72=\"\",\"\",DATA_SISWA!A72)","v":""},{"$f":"IF(DATA_SISWA!B72=\"\",\"\",DATA_SISWA!B72)","v":""}]
[{"$f":"IF(DATA_SISWA!A73=\"\",\"\",DATA_SISWA!A73)","v":""},{"$f":"IF(DATA_SISWA!B73=\"\",\"\",DATA_SISWA!B73)","v":""}]
[{"$f":"IF(DATA_SISWA!A74=\"\",\"\",DATA_SISWA!A74)","v":""},{"$f":"IF(DATA_SISWA!B74=\"\",\"\",DATA_SISWA!B74)","v":""}]
[{"$f":"IF(DATA_SISWA!A75=\"\",\"\",DATA_SISWA!A75)","v":""},{"$f":"IF(DATA_SISWA!B75=\"\",\"\",DATA_SISWA!B75)","v":""}]
[{"$f":"IF(DATA_SISWA!A76=\"\",\"\",DATA_SISWA!A76)","v":""},{"$f":"IF(DATA_SISWA!B76=\"\",\"\",DATA_SISWA!B76)","v":""}]
[{"$f":"IF(DATA_SISWA!A77=\"\",\"\",DATA_SISWA!A77)","v":""},{"$f":"IF(DATA_SISWA!B77=\"\",\"\",DATA_SISWA!B77)","v":""}]
[{"$f":"IF(DATA_SISWA!A78=\"\",\"\",DATA_SISWA!A78)","v":""},{"$f":"IF(DATA_SISWA!B78=\"\",\"\",DATA_SISWA!B78)","v":""}]
[{"$f":"IF(DATA_SISWA!A79=\"\",\"\",DATA_SISWA!A79)","v":""},{"$f":"IF(DATA_SISWA!B79=\"\",\"\",DATA_SISWA!B79)","v":""}]
[{"$f":"IF(DATA_SISWA!A80=\"\",\"\",DATA_SISWA!A80)","v":""},{"$f":"IF(DATA_SISWA!B80=\"\",\"\",DATA_SISWA!B80)","v":""}]
[{"$f":"IF(DATA_SISWA!A81=\"\",\"\",DATA_SISWA!A81)","v":""},{"$f":"IF(DATA_SISWA!B81=\"\",\"\",DATA_SISWA!B81)","v":""}]
[{"$f":"IF(DATA_SISWA!A82=\"\",\"\",DATA_SISWA!A82)","v":""},{"$f":"IF(DATA_SISWA!B82=\"\",\"\",DATA_SISWA!B82)","v":""}]
[{"$f":"IF(DATA_SISWA!A83=\"\",\"\",DATA_SISWA!A83)","v":""},{"$f":"IF(DATA_SISWA!B83=\"\",\"\",DATA_SISWA!B83)","v":""}]
[{"$f":"IF(DATA_SISWA!A84=\"\",\"\",DATA_SISWA!A84)","v":""},{"$f":"IF(DATA_SISWA!B84=\"\",\"\",DATA_SISWA!B84)","v":""}]
[{"$f":"IF(DATA_SISWA!A85=\"\",\"\",DATA_SISWA!A85)","v":""},{"$f":"IF(DATA_SISWA!B85=\"\",\"\",DATA_SISWA!B85)","v":""}]
[{"$f":"IF(DATA_SISWA!A86=\"\",\"\",DATA_SISWA!A86)","v":""},{"$f":"IF(DATA_SISWA!B86=\"\",\"\",DATA_SISWA!B86)","v":""}]
[{"$f":"IF(DATA_SISWA!A87=\"\",\"\",DATA_SISWA!A87)","v":""},{"$f":"IF(DATA_SISWA!B87=\"\",\"\",DATA_SISWA!B87)","v":""}]
[{"$f":"IF(DATA_SISWA!A88=\"\",\"\",DATA_SISWA!A88)","v":""},{"$f":"IF(DATA_SISWA!B88=\"\",\"\",DATA_SISWA!B88)","v":""}]
[{"$f":"IF(DATA_SISWA!A89=\"\",\"\",DATA_SISWA!A89)","v":""},{"$f":"IF(DATA_SISWA!B89=\"\",\"\",DATA_SISWA!B89)","v":""}]
[{"$f":"IF(DATA_SISWA!A90=\"\",\"\",DATA_SISWA!A90)","v":""},{"$f":"IF(DATA_SISWA!B90=\"\",\"\",DATA_SISWA!B90)","v":""}]
[{"$f":"IF(DATA_SISWA!A91=\"\",\"\",DATA_SISWA!A91)","v":""},{"$f":"IF(DATA_SISWA!B91=\"\",\"\",DATA_SISWA!B91)","v":""}]
[{"$f":"IF(DATA_SISWA!A92=\"\",\"\",DATA_SISWA!A92)","v":""},{"$f":"IF(DATA_SISWA!B92=\"\",\"\",DATA_SISWA!B92)","v":""}]
[{"$f":"IF(DATA_SISWA!A93=\"\",\"\",DATA_SISWA!A93)","v":""},{"$f":"IF(DATA_SISWA!B93=\"\",\"\",DATA_SISWA!B93)","v":""}]
[{"$f":"IF(DATA_SISWA!A94=\"\",\"\",DATA_SISWA!A94)","v":""},{"$f":"IF(DATA_SISWA!B94=\"\",\"\",DATA_SISWA!B94)","v":""}]
[{"$f":"IF(DATA_SISWA!A95=\"\",\"\",DATA_SISWA!A95)","v":""},{"$f":"IF(DATA_SISWA!B95=\"\",\"\",DATA_SISWA!B95)","v":""}]
[{"$f":"IF(DATA_SISWA!A96=\"\",\"\",DATA_SISWA!A96)","v":""},{"$f":"IF(DATA_SISWA!B96=\"\",\"\",DATA_SISWA!B96)","v":""}]
[{"$f":"IF(DATA_SISWA!A97=\"\",\"\",DATA_SISWA!A97)","v":""},{"$f":"IF(DATA_SISWA!B97=\"\",\"\",DATA_SISWA!B97)","v":""}]
[{"$f":"IF(DATA_SISWA!A98=\"\",\"\",DATA_SISWA!A98)","v":""},{"$f":"IF(DATA_SISWA!B98=\"\",\"\",DATA_SISWA!B98)","v":""}]
[{"$f":"IF(DATA_SISWA!A99=\"\",\"\",DATA_SISWA!A99)","v":""},{"$f":"IF(DATA_SISWA!B99=\"\",\"\",DATA_SISWA!B99)","v":""}]
[{"$f":"IF(DATA_SISWA!A100=\"\",\"\",DATA_SISWA!A100)","v":""},{"$f":"IF(DATA_SISWA!B100=\"\",\"\",DATA_SISWA!B100)","v":""}]
[{"$f":"IF(DATA_SISWA!A101=\"\",\"\",DATA_SISWA!A101)","v":""},{"$f":"IF(DATA_SISWA!B101=\"\",\"\",DATA_SISWA!B101)","v":""}]
[{"$f":"IF(DATA_SISWA!A102=\"\",\"\",DATA_SISWA!A102)","v":""},{"$f":"IF(DATA_SISWA!B102=\"\",\"\",DATA_SISWA!B102)","v":""}]
[{"$f":"IF(DATA_SISWA!A103=\"\",\"\",DATA_SISWA!A103)","v":""},{"$f":"IF(DATA_SISWA!B103=\"\",\"\",DATA_SISWA!B103)","v":""}]
[{"$f":"IF(DATA_SISWA!A104=\"\",\"\",DATA_SISWA!A104)","v":""},{"$f":"IF(DATA_SISWA!B104=\"\",\"\",DATA_SISWA!B104)","v":""}]
[{"$f":"IF(DATA_SISWA!A105=\"\",\"\",DATA_SISWA!A105)","v":""},{"$f":"IF(DATA_SISWA!B105=\"\",\"\",DATA_SISWA!B105)","v":""}]
[{"$f":"IF(DATA_SISWA!A106=\"\",\"\",DATA_SISWA!A106)","v":""},{"$f":"IF(DATA_SISWA!B106=\"\",\"\",DATA_SISWA!B106)","v":""}]
[{"$f":"IF(DATA_SISWA!A107=\"\",\"\",DATA_SISWA!A107)","v":""},{"$f":"IF(DATA_SISWA!B107=\"\",\"\",DATA_SISWA!B107)","v":""}]
[{"$f":"IF(DATA_SISWA!A108=\"\",\"\",DATA_SISWA!A108)","v":""},{"$f":"IF(DATA_SISWA!B108=\"\",\"\",DATA_SISWA!B108)","v":""}]
[{"$f":"IF(DATA_SISWA!A109=\"\",\"\",DATA_SISWA!A109)","v":""},{"$f":"IF(DATA_SISWA!B109=\"\",\"\",DATA_SISWA!B109)","v":""}]
[{"$f":"IF(DATA_SISWA!A110=\"\",\"\",DATA_SISWA!A110)","v":""},{"$f":"IF(DATA_SISWA!B110=\"\",\"\",DATA_SISWA!B110)","v":""}]
[{"$f":"IF(DATA_SISWA!A111=\"\",\"\",DATA_SISWA!A111)","v":""},{"$f":"IF(DATA_SISWA!B111=\"\",\"\",DATA_SISWA!B111)","v":""}]
[{"$f":"IF(DATA_SISWA!A112=\"\",\"\",DATA_SISWA!A112)","v":""},{"$f":"IF(DATA_SISWA!B112=\"\",\"\",DATA_SISWA!B112)","v":""}]
[{"$f":"IF(DATA_SISWA!A113=\"\",\"\",DATA_SISWA!A113)","v":""},{"$f":"IF(DATA_SISWA!B113=\"\",\"\",DATA_SISWA!B113)","v":""}]
[{"$f":"IF(DATA_SISWA!A114=\"\",\"\",DATA_SISWA!A114)","v":""},{"$f":"IF(DATA_SISWA!B114=\"\",\"\",DATA_SISWA!B114)","v":""}]
[{"$f":"IF(DATA_SISWA!A115=\"\",\"\",DATA_SISWA!A115)","v":""},{"$f":"IF(DATA_SISWA!B115=\"\",\"\",DATA_SISWA!B115)","v":""}]
[{"$f":"IF(DATA_SISWA!A116=\"\",\"\",DATA_SISWA!A116)","v":""},{"$f":"IF(DATA_SISWA!B116=\"\",\"\",DATA_SISWA!B116)","v":""}]
[{"$f":"IF(DATA_SISWA!A117=\"\",\"\",DATA_SISWA!A117)","v":""},{"$f":"IF(DATA_SISWA!B117=\"\",\"\",DATA_SISWA!B117)","v":""}]
[{"$f":"IF(DATA_SISWA!A118=\"\",\"\",DATA_SISWA!A118)","v":""},{"$f":"IF(DATA_SISWA!B118=\"\",\"\",DATA_SISWA!B118)","v":""}]
[{"$f":"IF(DATA_SISWA!A119=\"\",\"\",DATA_SISWA!A119)","v":""},{"$f":"IF(DATA_SISWA!B119=\"\",\"\",DATA_SISWA!B119)","v":""}]
[{"$f":"IF(DATA_SISWA!A120=\"\",\"\",DATA_SISWA!A120)","v":""},{"$f":"IF(DATA_SISWA!B120=\"\",\"\",DATA_SISWA!B120)","v":""}]
[{"$f":"IF(DATA_SISWA!A121=\"\",\"\",DATA_SISWA!A121)","v":""},{"$f":"IF(DATA_SISWA!B121=\"\",\"\",DATA_SISWA!B121)","v":""}]
[{"$f":"IF(DATA_SISWA!A122=\"\",\"\",DATA_SISWA!A122)","v":""},{"$f":"IF(DATA_SISWA!B122=\"\",\"\",DATA_SISWA!B122)","v":""}]
[{"$f":"IF(DATA_SISWA!A123=\"\",\"\",DATA_SISWA!A123)","v":""},{"$f":"IF(DATA_SISWA!B123=\"\",\"\",DATA_SISWA!B123)","v":""}]
[{"$f":"IF(DATA_SISWA!A124=\"\",\"\",DATA_SISWA!A124)","v":""},{"$f":"IF(DATA_SISWA!B124=\"\",\"\",DATA_SISWA!B124)","v":""}]
[{"$f":"IF(DATA_SISWA!A125=\"\",\"\",DATA_SISWA!A125)","v":""},{"$f":"IF(DATA_SISWA!B125=\"\",\"\",DATA_SISWA!B125)","v":""}]
[{"$f":"IF(DATA_SISWA!A126=\"\",\"\",DATA_SISWA!A126)","v":""},{"$f":"IF(DATA_SISWA!B126=\"\",\"\",DATA_SISWA!B126)","v":""}]
[{"$f":"IF(DATA_SISWA!A127=\"\",\"\",DATA_SISWA!A127)","v":""},{"$f":"IF(DATA_SISWA!B127=\"\",\"\",DATA_SISWA!B127)","v":""}]
[{"$f":"IF(DATA_SISWA!A128=\"\",\"\",DATA_SISWA!A128)","v":""},{"$f":"IF(DATA_SISWA!B128=\"\",\"\",DATA_SISWA!B128)","v":""}]
[{"$f":"IF(DATA_SISWA!A129=\"\",\"\",DATA_SISWA!A129)","v":""},{"$f":"IF(DATA_SISWA!B129=\"\",\"\",DATA_SISWA!B129)","v":""}]
[{"$f":"IF(DATA_SISWA!A130=\"\",\"\",DATA_SISWA!A130)","v":""},{"$f":"IF(DATA_SISWA!B130=\"\",\"\",DATA_SISWA!B130)","v":""}]
[{"$f":"IF(DATA_SISWA!A131=\"\",\"\",DATA_SISWA!A131)","v":""},{"$f":"IF(DATA_SISWA!B131=\"\",\"\",DATA_SISWA!B131)","v":""}]
[{"$f":"IF(DATA_SISWA!A132=\"\",\"\",DATA_SISWA!A132)","v":""},{"$f":"IF(DATA_SISWA!B132=\"\",\"\",DATA_SISWA!B132)","v":""}]
[{"$f":"IF(DATA_SISWA!A133=\"\",\"\",DATA_SISWA!A133)","v":""},{"$f":"IF(DATA_SISWA!B133=\"\",\"\",DATA_SISWA!B133)","v":""}]
[{"$f":"IF(DATA_SISWA!A134=\"\",\"\",DATA_SISWA!A134)","v":""},{"$f":"IF(DATA_SISWA!B134=\"\",\"\",DATA_SISWA!B134)","v":""}]
[{"$f":"IF(DATA_SISWA!A135=\"\",\"\",DATA_SISWA!A135)","v":""},{"$f":"IF(DATA_SISWA!B135=\"\",\"\",DATA_SISWA!B135)","v":""}]
[{"$f":"IF(DATA_SISWA!A136=\"\",\"\",DATA_SISWA!A136)","v":""},{"$f":"IF(DATA_SISWA!B136=\"\",\"\",DATA_SISWA!B136)","v":""}]
[{"$f":"IF(DATA_SISWA!A137=\"\",\"\",DATA_SISWA!A137)","v":""},{"$f":"IF(DATA_SISWA!B137=\"\",\"\",DATA_SISWA!B137)","v":""}]
[{"$f":"IF(DATA_SISWA!A138=\"\",\"\",DATA_SISWA!A138)","v":""},{"$f":"IF(DATA_SISWA!B138=\"\",\"\",DATA_SISWA!B138)","v":""}]
[{"$f":"IF(DATA_SISWA!A139=\"\",\"\",DATA_SISWA!A139)","v":""},{"$f":"IF(DATA_SISWA!B139=\"\",\"\",DATA_SISWA!B139)","v":""}]
[{"$f":"IF(DATA_SISWA!A140=\"\",\"\",DATA_SISWA!A140)","v":""},{"$f":"IF(DATA_SISWA!B140=\"\",\"\",DATA_SISWA!B140)","v":""}]
[{"$f":"IF(DATA_SISWA!A141=\"\",\"\",DATA_SISWA!A141)","v":""},{"$f":"IF(DATA_SISWA!B141=\"\",\"\",DATA_SISWA!B141)","v":""}]
[{"$f":"IF(DATA_SISWA!A142=\"\",\"\",DATA_SISWA!A142)","v":""},{"$f":"IF(DATA_SISWA!B142=\"\",\"\",DATA_SISWA!B142)","v":""}]
[{"$f":"IF(DATA_SISWA!A143=\"\",\"\",DATA_SISWA!A143)","v":""},{"$f":"IF(DATA_SISWA!B143=\"\",\"\",DATA_SISWA!B143)","v":""}]
[{"$f":"IF(DATA_SISWA!A144=\"\",\"\",DATA_SISWA!A144)","v":""},{"$f":"IF(DATA_SISWA!B144=\"\",\"\",DATA_SISWA!B144)","v":""}]
[{"$f":"IF(DATA_SISWA!A145=\"\",\"\",DATA_SISWA!A145)","v":""},{"$f":"IF(DATA_SISWA!B145=\"\",\"\",DATA_SISWA!B145)","v":""}]
[{"$f":"IF(DATA_SISWA!A146=\"\",\"\",DATA_SISWA!A146)","v":""},{"$f":"IF(DATA_SISWA!B146=\"\",\"\",DATA_SISWA!B146)","v":""}]
[{"$f":"IF(DATA_SISWA!A147=\"\",\"\",DATA_SISWA!A147)","v":""},{"$f":"IF(DATA_SISWA!B147=\"\",\"\",DATA_SISWA!B147)","v":""}]
[{"$f":"IF(DATA_SISWA!A148=\"\",\"\",DATA_SISWA!A148)","v":""},{"$f":"IF(DATA_SISWA!B148=\"\",\"\",DATA_SISWA!B148)","v":""}]
[{"$f":"IF(DATA_SISWA!A149=\"\",\"\",DATA_SISWA!A149)","v":""},{"$f":"IF(DATA_SISWA!B149=\"\",\"\",DATA_SISWA!B149)","v":""}]
[{"$f":"IF(DATA_SISWA!A150=\"\",\"\",DATA_SISWA!A150)","v":""},{"$f":"IF(DATA_SISWA!B150=\"\",\"\",DATA_SISWA!B150)","v":""}]
[{"$f":"IF(DATA_SISWA!A151=\"\",\"\",DATA_SISWA!A151)","v":""},{"$f":"IF(DATA_SISWA!B151=\"\",\"\",DATA_SISWA!B151)","v":""}]
[{"$f":"IF(DATA_SISWA!A152=\"\",\"\",DATA_SISWA!A152)","v":""},{"$f":"IF(DATA_SISWA!B152=\"\",\"\",DATA_SISWA!B152)","v":""}]
[{"$f":"IF(DATA_SISWA!A153=\"\",\"\",DATA_SISWA!A153)","v":""},{"$f":"IF(DATA_SISWA!B153=\"\",\"\",DATA_SISWA!B153)","v":""}]
[{"$f":"IF(DATA_SISWA!A154=\"\",\"\",DATA_SISWA!A154)","v":""},{"$f":"IF(DATA_SISWA!B154=\"\",\"\",DATA_SISWA!B154)","v":""}]
[{"$f":"IF(DATA_SISWA!A155=\"\",\"\",DATA_SISWA!A155)","v":""},{"$f":"IF(DATA_SISWA!B155=\"\",\"\",DATA_SISWA!B155)","v":""}]
[{"$f":"IF(DATA_SISWA!A156=\"\",\"\",DATA_SISWA!A156)","v":""},{"$f":"IF(DATA_SISWA!B156=\"\",\"\",DATA_SISWA!B156)","v":""}]
[{"$f":"IF(DATA_SISWA!A157=\"\",\"\",DATA_SISWA!A157)","v":""},{"$f":"IF(DATA_SISWA!B157=\"\",\"\",DATA_SISWA!B157)","v":""}]
[{"$f":"IF(DATA_SISWA!A158=\"\",\"\",DATA_SISWA!A158)","v":""},{"$f":"IF(DATA_SISWA!B158=\"\",\"\",DATA_SISWA!B158)","v":""}]
[{"$f":"IF(DATA_SISWA!A159=\"\",\"\",DATA_SISWA!A159)","v":""},{"$f":"IF(DATA_SISWA!B159=\"\",\"\",DATA_SISWA!B159)","v":""}]
[{"$f":"IF(DATA_SISWA!A160=\"\",\"\",DATA_SISWA!A160)","v":""},{"$f":"IF(DATA_SISWA!B160=\"\",\"\",DATA_SISWA!B160)","v":""}]
[{"$f":"IF(DATA_SISWA!A161=\"\",\"\",DATA_SISWA!A161)","v":""},{"$f":"IF(DATA_SISWA!B161=\"\",\"\",DATA_SISWA!B161)","v":""}]
[{"$f":"IF(DATA_SISWA!A162=\"\",\"\",DATA_SISWA!A162)","v":""},{"$f":"IF(DATA_SISWA!B162=\"\",\"\",DATA_SISWA!B162)","v":""}]
[{"$f":"IF(DATA_SISWA!A163=\"\",\"\",DATA_SISWA!A163)","v":""},{"$f":"IF(DATA_SISWA!B163=\"\",\"\",DATA_SISWA!B163)","v":""}]
[{"$f":"IF(DATA_SISWA!A164=\"\",\"\",DATA_SISWA!A164)","v":""},{"$f":"IF(DATA_SISWA!B164=\"\",\"\",DATA_SISWA!B164)","v":""}]
[{"$f":"IF(DATA_SISWA!A165=\"\",\"\",DATA_SISWA!A165)","v":""},{"$f":"IF(DATA_SISWA!B165=\"\",\"\",DATA_SISWA!B165)","v":""}]
[{"$f":"IF(DATA_SISWA!A166=\"\",\"\",DATA_SISWA!A166)","v":""},{"$f":"IF(DATA_SISWA!B166=\"\",\"\",DATA_SISWA!B166)","v":""}]
[{"$f":"IF(DATA_SISWA!A167=\"\",\"\",DATA_SISWA!A167)","v":""},{"$f":"IF(DATA_SISWA!B167=\"\",\"\",DATA_SISWA!B167)","v":""}]
[{"$f":"IF(DATA_SISWA!A168=\"\",\"\",DATA_SISWA!A168)","v":""},{"$f":"IF(DATA_SISWA!B168=\"\",\"\",DATA_SISWA!B168)","v":""}]
[{"$f":"IF(DATA_SISWA!A169=\"\",\"\",DATA_SISWA!A169)","v":""},{"$f":"IF(DATA_SISWA!B169=\"\",\"\",DATA_SISWA!B169)","v":""}]
[{"$f":"IF(DATA_SISWA!A170=\"\",\"\",DATA_SISWA!A170)","v":""},{"$f":"IF(DATA_SISWA!B170=\"\",\"\",DATA_SISWA!B170)","v":""}]
[{"$f":"IF(DATA_SISWA!A171=\"\",\"\",DATA_SISWA!A171)","v":""},{"$f":"IF(DATA_SISWA!B171=\"\",\"\",DATA_SISWA!B171)","v":""}]
[{"$f":"IF(DATA_SISWA!A172=\"\",\"\",DATA_SISWA!A172)","v":""},{"$f":"IF(DATA_SISWA!B172=\"\",\"\",DATA_SISWA!B172)","v":""}]
[{"$f":"IF(DATA_SISWA!A173=\"\",\"\",DATA_SISWA!A173)","v":""},{"$f":"IF(DATA_SISWA!B173=\"\",\"\",DATA_SISWA!B173)","v":""}]
[{"$f":"IF(DATA_SISWA!A174=\"\",\"\",DATA_SISWA!A174)","v":""},{"$f":"IF(DATA_SISWA!B174=\"\",\"\",DATA_SISWA!B174)","v":""}]
[{"$f":"IF(DATA_SISWA!A175=\"\",\"\",DATA_SISWA!A175)","v":""},{"$f":"IF(DATA_SISWA!B175=\"\",\"\",DATA_SISWA!B175)","v":""}]
[{"$f":"IF(DATA_SISWA!A176=\"\",\"\",DATA_SISWA!A176)","v":""},{"$f":"IF(DATA_SISWA!B176=\"\",\"\",DATA_SISWA!B176)","v":""}]
[{"$f":"IF(DATA_SISWA!A177=\"\",\"\",DATA_SISWA!A177)","v":""},{"$f":"IF(DATA_SISWA!B177=\"\",\"\",DATA_SISWA!B177)","v":""}]
[{"$f":"IF(DATA_SISWA!A178=\"\",\"\",DATA_SISWA!A178)","v":""},{"$f":"IF(DATA_SISWA!B178=\"\",\"\",DATA_SISWA!B178)","v":""}]
[{"$f":"IF(DATA_SISWA!A179=\"\",\"\",DATA_SISWA!A179)","v":""},{"$f":"IF(DATA_SISWA!B179=\"\",\"\",DATA_SISWA!B179)","v":""}]
[{"$f":"IF(DATA_SISWA!A180=\"\",\"\",DATA_SISWA!A180)","v":""},{"$f":"IF(DATA_SISWA!B180=\"\",\"\",DATA_SISWA!B180)","v":""}]
[{"$f":"IF(DATA_SISWA!A181=\"\",\"\",DATA_SISWA!A181)","v":""},{"$f":"IF(DATA_SISWA!B181=\"\",\"\",DATA_SISWA!B181)","v":""}]
[{"$f":"IF(DATA_SISWA!A182=\"\",\"\",DATA_SISWA!A182)","v":""},{"$f":"IF(DATA_SISWA!B182=\"\",\"\",DATA_SISWA!B182)","v":""}]
[{"$f":"IF(DATA_SISWA!A183=\"\",\"\",DATA_SISWA!A183)","v":""},{"$f":"IF(DATA_SISWA!B183=\"\",\"\",DATA_SISWA!B183)","v":""}]
[{"$f":"IF(DATA_SISWA!A184=\"\",\"\",DATA_SISWA!A184)","v":""},{"$f":"IF(DATA_SISWA!B184=\"\",\"\",DATA_SISWA!B184)","v":""}]
[{"$f":"IF(DATA_SISWA!A185=\"\",\"\",DATA_SISWA!A185)","v":""},{"$f":"IF(DATA_SISWA!B185=\"\",\"\",DATA_SISWA!B185)","v":""}]
[{"$f":"IF(DATA_SISWA!A186=\"\",\"\",DATA_SISWA!A186)","v":""},{"$f":"IF(DATA_SISWA!B186=\"\",\"\",DATA_SISWA!B186)","v":""}]
[{"$f":"IF(DATA_SISWA!A187=\"\",\"\",DATA_SISWA!A187)","v":""},{"$f":"IF(DATA_SISWA!B187=\"\",\"\",DATA_SISWA!B187)","v":""}]
[{"$f":"IF(DATA_SISWA!A188=\"\",\"\",DATA_SISWA!A188)","v":""},{"$f":"IF(DATA_SISWA!B188=\"\",\"\",DATA_SISWA!B188)","v":""}]
[{"$f":"IF(DATA_SISWA!A189=\"\",\"\",DATA_SISWA!A189)","v":""},{"$f":"IF(DATA_SISWA!B189=\"\",\"\",DATA_SISWA!B189)","v":""}]
[{"$f":"IF(DATA_SISWA!A190=\"\",\"\",DATA_SISWA!A190)","v":""},{"$f":"IF(DATA_SISWA!B190=\"\",\"\",DATA_SISWA!B190)","v":""}]
[{"$f":"IF(DATA_SISWA!A191=\"\",\"\",DATA_SISWA!A191)","v":""},{"$f":"IF(DATA_SISWA!B191=\"\",\"\",DATA_SISWA!B191)","v":""}]
[{"$f":"IF(DATA_SISWA!A192=\"\",\"\",DATA_SISWA!A192)","v":""},{"$f":"IF(DATA_SISWA!B192=\"\",\"\",DATA_SISWA!B192)","v":""}]
[{"$f":"IF(DATA_SISWA!A193=\"\",\"\",DATA_SISWA!A193)","v":""},{"$f":"IF(DATA_SISWA!B193=\"\",\"\",DATA_SISWA!B193)","v":""}]
[{"$f":"IF(DATA_SISWA!A194=\"\",\"\",DATA_SISWA!A194)","v":""},{"$f":"IF(DATA_SISWA!B194=\"\",\"\",DATA_SISWA!B194)","v":""}]
[{"$f":"IF(DATA_SISWA!A195=\"\",\"\",DATA_SISWA!A195)","v":""},{"$f":"IF(DATA_SISWA!B195=\"\",\"\",DATA_SISWA!B195)","v":""}]
[{"$f":"IF(DATA_SISWA!A196=\"\",\"\",DATA_SISWA!A196)","v":""},{"$f":"IF(DATA_SISWA!B196=\"\",\"\",DATA_SISWA!B196)","v":""}]
[{"$f":"IF(DATA_SISWA!A197=\"\",\"\",DATA_SISWA!A197)","v":""},{"$f":"IF(DATA_SISWA!B197=\"\",\"\",DATA_SISWA!B197)","v":""}]
[{"$f":"IF(DATA_SISWA!A198=\"\",\"\",DATA_SISWA!A198)","v":""},{"$f":"IF(DATA_SISWA!B198=\"\",\"\",DATA_SISWA!B198)","v":""}]
[{"$f":"IF(DATA_SISWA!A199=\"\",\"\",DATA_SISWA!A199)","v":""},{"$f":"IF(DATA_SISWA!B199=\"\",\"\",DATA_SISWA!B199)","v":""}]
[{"$f":"IF(DATA_SISWA!A200=\"\",\"\",DATA_SISWA!A200)","v":""},{"$f":"IF(DATA_SISWA!B200=\"\",\"\",DATA_SISWA!B200)","v":""}]
[{"$f":"IF(DATA_SISWA!A201=\"\",\"\",DATA_SISWA!A201)","v":""},{"$f":"IF(DATA_SISWA!B201=\"\",\"\",DATA_SISWA!B201)","v":""}]
[{"$f":"IF(DATA_SISWA!A202=\"\",\"\",DATA_SISWA!A202)","v":""},{"$f":"IF(DATA_SISWA!B202=\"\",\"\",DATA_SISWA!B202)","v":""}]
[{"$f":"IF(DATA_SISWA!A203=\"\",\"\",DATA_SISWA!A203)","v":""},{"$f":"IF(DATA_SISWA!B203=\"\",\"\",DATA_SISWA!B203)","v":""}]
[{"$f":"IF(DATA_SISWA!A204=\"\",\"\",DATA_SISWA!A204)","v":""},{"$f":"IF(DATA_SISWA!B204=\"\",\"\",DATA_SISWA!B204)","v":""}]
[{"$f":"IF(DATA_SISWA!A205=\"\",\"\",DATA_SISWA!A205)","v":""},{"$f":"IF(DATA_SISWA!B205=\"\",\"\",DATA_SISWA!B205)","v":""}]
[{"$f":"IF(DATA_SISWA!A206=\"\",\"\",DATA_SISWA!A206)","v":""},{"$f":"IF(DATA_SISWA!B206=\"\",\"\",DATA_SISWA!B206)","v":""}]
[{"$f":"IF(DATA_SISWA!A207=\"\",\"\",DATA_SISWA!A207)","v":""},{"$f":"IF(DATA_SISWA!B207=\"\",\"\",DATA_SISWA!B207)","v":""}]
[{"$f":"IF(DATA_SISWA!A208=\"\",\"\",DATA_SISWA!A208)","v":""},{"$f":"IF(DATA_SISWA!B208=\"\",\"\",DATA_SISWA!B208)","v":""}]
[{"$f":"IF(DATA_SISWA!A209=\"\",\"\",DATA_SISWA!A209)","v":""},{"$f":"IF(DATA_SISWA!B209=\"\",\"\",DATA_SISWA!B209)","v":""}]
[{"$f":"IF(DATA_SISWA!A210=\"\",\"\",DATA_SISWA!A210)","v":""},{"$f":"IF(DATA_SISWA!B210=\"\",\"\",DATA_SISWA!B210)","v":""}]
[{"$f":"IF(DATA_SISWA!A211=\"\",\"\",DATA_SISWA!A211)","v":""},{"$f":"IF(DATA_SISWA!B211=\"\",\"\",DATA_SISWA!B211)","v":""}]
[{"$f":"IF(DATA_SISWA!A212=\"\",\"\",DATA_SISWA!A212)","v":""},{"$f":"IF(DATA_SISWA!B212=\"\",\"\",DATA_SISWA!B212)","v":""}]
[{"$f":"IF(DATA_SISWA!A213=\"\",\"\",DATA_SISWA!A213)","v":""},{"$f":"IF(DATA_SISWA!B213=\"\",\"\",DATA_SISWA!B213)","v":""}]
[{"$f":"IF(DATA_SISWA!A214=\"\",\"\",DATA_SISWA!A214)","v":""},{"$f":"IF(DATA_SISWA!B214=\"\",\"\",DATA_SISWA!B214)","v":""}]
[{"$f":"IF(DATA_SISWA!A215=\"\",\"\",DATA_SISWA!A215)","v":""},{"$f":"IF(DATA_SISWA!B215=\"\",\"\",DATA_SISWA!B215)","v":""}]
[{"$f":"IF(DATA_SISWA!A216=\"\",\"\",DATA_SISWA!A216)","v":""},{"$f":"IF(DATA_SISWA!B216=\"\",\"\",DATA_SISWA!B216)","v":""}]
[{"$f":"IF(DATA_SISWA!A217=\"\",\"\",DATA_SISWA!A217)","v":""},{"$f":"IF(DATA_SISWA!B217=\"\",\"\",DATA_SISWA!B217)","v":""}]
[{"$f":"IF(DATA_SISWA!A218=\"\",\"\",DATA_SISWA!A218)","v":""},{"$f":"IF(DATA_SISWA!B218=\"\",\"\",DATA_SISWA!B218)","v":""}]
[{"$f":"IF(DATA_SISWA!A219=\"\",\"\",DATA_SISWA!A219)","v":""},{"$f":"IF(DATA_SISWA!B219=\"\",\"\",DATA_SISWA!B219)","v":""}]
[{"$f":"IF(DATA_SISWA!A220=\"\",\"\",DATA_SISWA!A220)","v":""},{"$f":"IF(DATA_SISWA!B220=\"\",\"\",DATA_SISWA!B220)","v":""}]
[{"$f":"IF(DATA_SISWA!A221=\"\",\"\",DATA_SISWA!A221)","v":""},{"$f":"IF(DATA_SISWA!B221=\"\",\"\",DATA_SISWA!B221)","v":""}]
[{"$f":"IF(DATA_SISWA!A222=\"\",\"\",DATA_SISWA!A222)","v":""},{"$f":"IF(DATA_SISWA!B222=\"\",\"\",DATA_SISWA!B222)","v":""}]
[{"$f":"IF(DATA_SISWA!A223=\"\",\"\",DATA_SISWA!A223)","v":""},{"$f":"IF(DATA_SISWA!B223=\"\",\"\",DATA_SISWA!B223)","v":""}]
[{"$f":"IF(DATA_SISWA!A224=\"\",\"\",DATA_SISWA!A224)","v":""},{"$f":"IF(DATA_SISWA!B224=\"\",\"\",DATA_SISWA!B224)","v":""}]
[{"$f":"IF(DATA_SISWA!A225=\"\",\"\",DATA_SISWA!A225)","v":""},{"$f":"IF(DATA_SISWA!B225=\"\",\"\",DATA_SISWA!B225)","v":""}]
[{"$f":"IF(DATA_SISWA!A226=\"\",\"\",DATA_SISWA!A226)","v":""},{"$f":"IF(DATA_SISWA!B226=\"\",\"\",DATA_SISWA!B226)","v":""}]
[{"$f":"IF(DATA_SISWA!A227=\"\",\"\",DATA_SISWA!A227)","v":""},{"$f":"IF(DATA_SISWA!B227=\"\",\"\",DATA_SISWA!B227)","v":""}]
[{"$f":"IF(DATA_SISWA!A228=\"\",\"\",DATA_SISWA!A228)","v":""},{"$f":"IF(DATA_SISWA!B228=\"\",\"\",DATA_SISWA!B228)","v":""}]
[{"$f":"IF(DATA_SISWA!A229=\"\",\"\",DATA_SISWA!A229)","v":""},{"$f":"IF(DATA_SISWA!B229=\"\",\"\",DATA_SISWA!B229)","v":""}]
[{"$f":"IF(DATA_SISWA!A230=\"\",\"\",DATA_SISWA!A230)","v":""},{"$f":"IF(DATA_SISWA!B230=\"\",\"\",DATA_SISWA!B230)","v":""}]
[{"$f":"IF(DATA_SISWA!A231=\"\",\"\",DATA_SISWA!A231)","v":""},{"$f":"IF(DATA_SISWA!B231=\"\",\"\",DATA_SISWA!B231)","v":""}]
[{"$f":"IF(DATA_SISWA!A232=\"\",\"\",DATA_SISWA!A232)","v":""},{"$f":"IF(DATA_SISWA!B232=\"\",\"\",DATA_SISWA!B232)","v":""}]
[{"$f":"IF(DATA_SISWA!A233=\"\",\"\",DATA_SISWA!A233)","v":""},{"$f":"IF(DATA_SISWA!B233=\"\",\"\",DATA_SISWA!B233)","v":""}]
[{"$f":"IF(DATA_SISWA!A234=\"\",\"\",DATA_SISWA!A234)","v":""},{"$f":"IF(DATA_SISWA!B234=\"\",\"\",DATA_SISWA!B234)","v":""}]
[{"$f":"IF(DATA_SISWA!A235=\"\",\"\",DATA_SISWA!A235)","v":""},{"$f":"IF(DATA_SISWA!B235=\"\",\"\",DATA_SISWA!B235)","v":""}]
[{"$f":"IF(DATA_SISWA!A236=\"\",\"\",DATA_SISWA!A236)","v":""},{"$f":"IF(DATA_SISWA!B236=\"\",\"\",DATA_SISWA!B236)","v":""}]
[{"$f":"IF(DATA_SISWA!A237=\"\",\"\",DATA_SISWA!A237)","v":""},{"$f":"IF(DATA_SISWA!B237=\"\",\"\",DATA_SISWA!B237)","v":""}]
[{"$f":"IF(DATA_SISWA!A238=\"\",\"\",DATA_SISWA!A238)","v":""},{"$f":"IF(DATA_SISWA!B238=\"\",\"\",DATA_SISWA!B238)","v":""}]
[{"$f":"IF(DATA_SISWA!A239=\"\",\"\",DATA_SISWA!A239)","v":""},{"$f":"IF(DATA_SISWA!B239=\"\",\"\",DATA_SISWA!B239)","v":""}]
[{"$f":"IF(DATA_SISWA!A240=\"\",\"\",DATA_SISWA!A240)","v":""},{"$f":"IF(DATA_SISWA!B240=\"\",\"\",DATA_SISWA!B240)","v":""}]
[{"$f":"IF(DATA_SISWA!A241=\"\",\"\",DATA_SISWA!A241)","v":""},{"$f":"IF(DATA_SISWA!B241=\"\",\"\",DATA_SISWA!B241)","v":""}]
[{"$f":"IF(DATA_SISWA!A242=\"\",\"\",DATA_SISWA!A242)","v":""},{"$f":"IF(DATA_SISWA!B242=\"\",\"\",DATA_SISWA!B242)","v":""}]
[{"$f":"IF(DATA_SISWA!A243=\"\",\"\",DATA_SISWA!A243)","v":""},{"$f":"IF(DATA_SISWA!B243=\"\",\"\",DATA_SISWA!B243)","v":""}]
[{"$f":"IF(DATA_SISWA!A244=\"\",\"\",DATA_SISWA!A244)","v":""},{"$f":"IF(DATA_SISWA!B244=\"\",\"\",DATA_SISWA!B244)","v":""}]
[{"$f":"IF(DATA_SISWA!A245=\"\",\"\",DATA_SISWA!A245)","v":""},{"$f":"IF(DATA_SISWA!B245=\"\",\"\",DATA_SISWA!B245)","v":""}]
[{"$f":"IF(DATA_SISWA!A246=\"\",\"\",DATA_SISWA!A246)","v":""},{"$f":"IF(DATA_SISWA!B246=\"\",\"\",DATA_SISWA!B246)","v":""}]
[{"$f":"IF(DATA_SISWA!A247=\"\",\"\",DATA_SISWA!A247)","v":""},{"$f":"IF(DATA_SISWA!B247=\"\",\"\",DATA_SISWA!B247)","v":""}]
[{"$f":"IF(DATA_SISWA!A248=\"\",\"\",DATA_SISWA!A248)","v":""},{"$f":"IF(DATA_SISWA!B248=\"\",\"\",DATA_SISWA!B248)","v":""}]
[{"$f":"IF(DATA_SISWA!A249=\"\",\"\",DATA_SISWA!A249)","v":""},{"$f":"IF(DATA_SISWA!B249=\"\",\"\",DATA_SISWA!B249)","v":""}]
[{"$f":"IF(DATA_SISWA!A250=\"\",\"\",DATA_SISWA!A250)","v":""},{"$f":"IF(DATA_SISWA!B250=\"\",\"\",DATA_SISWA!B250)","v":""}]
[{"$f":"IF(DATA_SISWA!A251=\"\",\"\",DATA_SISWA!A251)","v":""},{"$f":"IF(DATA_SISWA!B251=\"\",\"\",DATA_SISWA!B251)","v":""}]
[{"$f":"IF(DATA_SISWA!A252=\"\",\"\",DATA_SISWA!A252)","v":""},{"$f":"IF(DATA_SISWA!B252=\"\",\"\",DATA_SISWA!B252)","v":""}]
[{"$f":"IF(DATA_SISWA!A253=\"\",\"\",DATA_SISWA!A253)","v":""},{"$f":"IF(DATA_SISWA!B253=\"\",\"\",DATA_SISWA!B253)","v":""}]
[{"$f":"IF(DATA_SISWA!A254=\"\",\"\",DATA_SISWA!A254)","v":""},{"$f":"IF(DATA_SISWA!B254=\"\",\"\",DATA_SISWA!B254)","v":""}]
[{"$f":"IF(DATA_SISWA!A255=\"\",\"\",DATA_SISWA!A255)","v":""},{"$f":"IF(DATA_SISWA!B255=\"\",\"\",DATA_SISWA!B255)","v":""}]
[{"$f":"IF(DATA_SISWA!A256=\"\",\"\",DATA_SISWA!A256)","v":""},{"$f":"IF(DATA_SISWA!B256=\"\",\"\",DATA_SISWA!B256)","v":""}]
[{"$f":"IF(DATA_SISWA!A257=\"\",\"\",DATA_SISWA!A257)","v":""},{"$f":"IF(DATA_SISWA!B257=\"\",\"\",DATA_SISWA!B257)","v":""}]
[{"$f":"IF(DATA_SISWA!A258=\"\",\"\",DATA_SISWA!A258)","v":""},{"$f":"IF(DATA_SISWA!B258=\"\",\"\",DATA_SISWA!B258)","v":""}]
[{"$f":"IF(DATA_SISWA!A259=\"\",\"\",DATA_SISWA!A259)","v":""},{"$f":"IF(DATA_SISWA!B259=\"\",\"\",DATA_SISWA!B259)","v":""}]
[{"$f":"IF(DATA_SISWA!A260=\"\",\"\",DATA_SISWA!A260)","v":""},{"$f":"IF(DATA_SISWA!B260=\"\",\"\",DATA_SISWA!B260)","v":""}]
[{"$f":"IF(DATA_SISWA!A261=\"\",\"\",DATA_SISWA!A261)","v":""},{"$f":"IF(DATA_SISWA!B261=\"\",\"\",DATA_SISWA!B261)","v":""}]
[{"$f":"IF(DATA_SISWA!A262=\"\",\"\",DATA_SISWA!A262)","v":""},{"$f":"IF(DATA_SISWA!B262=\"\",\"\",DATA_SISWA!B262)","v":""}]
[{"$f":"IF(DATA_SISWA!A263=\"\",\"\",DATA_SISWA!A263)","v":""},{"$f":"IF(DATA_SISWA!B263=\"\",\"\",DATA_SISWA!B263)","v":""}]
[{"$f":"IF(DATA_SISWA!A264=\"\",\"\",DATA_SISWA!A264)","v":""},{"$f":"IF(DATA_SISWA!B264=\"\",\"\",DATA_SISWA!B264)","v":""}]
[{"$f":"IF(DATA_SISWA!A265=\"\",\"\",DATA_SISWA!A265)","v":""},{"$f":"IF(DATA_SISWA!B265=\"\",\"\",DATA_SISWA!B265)","v":""}]
[{"$f":"IF(DATA_SISWA!A266=\"\",\"\",DATA_SISWA!A266)","v":""},{"$f":"IF(DATA_SISWA!B266=\"\",\"\",DATA_SISWA!B266)","v":""}]
[{"$f":"IF(DATA_SISWA!A267=\"\",\"\",DATA_SISWA!A267)","v":""},{"$f":"IF(DATA_SISWA!B267=\"\",\"\",DATA_SISWA!B267)","v":""}]
[{"$f":"IF(DATA_SISWA!A268=\"\",\"\",DATA_SISWA!A268)","v":""},{"$f":"IF(DATA_SISWA!B268=\"\",\"\",DATA_SISWA!B268)","v":""}]
[{"$f":"IF(DATA_SISWA!A269=\"\",\"\",DATA_SISWA!A269)","v":""},{"$f":"IF(DATA_SISWA!B269=\"\",\"\",DATA_SISWA!B269)","v":""}]
[{"$f":"IF(DATA_SISWA!A270=\"\",\"\",DATA_SISWA!A270)","v":""},{"$f":"IF(DATA_SISWA!B270=\"\",\"\",DATA_SISWA!B270)","v":""}]
[{"$f":"IF(DATA_SISWA!A271=\"\",\"\",DATA_SISWA!A271)","v":""},{"$f":"IF(DATA_SISWA!B271=\"\",\"\",DATA_SISWA!B271)","v":""}]
[{"$f":"IF(DATA_SISWA!A272=\"\",\"\",DATA_SISWA!A272)","v":""},{"$f":"IF(DATA_SISWA!B272=\"\",\"\",DATA_SISWA!B272)","v":""}]
[{"$f":"IF(DATA_SISWA!A273=\"\",\"\",DATA_SISWA!A273)","v":""},{"$f":"IF(DATA_SISWA!B273=\"\",\"\",DATA_SISWA!B273)","v":""}]
[{"$f":"IF(DATA_SISWA!A274=\"\",\"\",DATA_SISWA!A274)","v":""},{"$f":"IF(DATA_SISWA!B274=\"\",\"\",DATA_SISWA!B274)","v":""}]
[{"$f":"IF(DATA_SISWA!A275=\"\",\"\",DATA_SISWA!A275)","v":""},{"$f":"IF(DATA_SISWA!B275=\"\",\"\",DATA_SISWA!B275)","v":""}]
[{"$f":"IF(DATA_SISWA!A276=\"\",\"\",DATA_SISWA!A276)","v":""},{"$f":"IF(DATA_SISWA!B276=\"\",\"\",DATA_SISWA!B276)","v":""}]
[{"$f":"IF(DATA_SISWA!A277=\"\",\"\",DATA_SISWA!A277)","v":""},{"$f":"IF(DATA_SISWA!B277=\"\",\"\",DATA_SISWA!B277)","v":""}]
[{"$f":"IF(DATA_SISWA!A278=\"\",\"\",DATA_SISWA!A278)","v":""},{"$f":"IF(DATA_SISWA!B278=\"\",\"\",DATA_SISWA!B278)","v":""}]
[{"$f":"IF(DATA_SISWA!A279=\"\",\"\",DATA_SISWA!A279)","v":""},{"$f":"IF(DATA_SISWA!B279=\"\",\"\",DATA_SISWA!B279)","v":""}]
[{"$f":"IF(DATA_SISWA!A280=\"\",\"\",DATA_SISWA!A280)","v":""},{"$f":"IF(DATA_SISWA!B280=\"\",\"\",DATA_SISWA!B280)","v":""}]
[{"$f":"IF(DATA_SISWA!A281=\"\",\"\",DATA_SISWA!A281)","v":""},{"$f":"IF(DATA_SISWA!B281=\"\",\"\",DATA_SISWA!B281)","v":""}]
[{"$f":"IF(DATA_SISWA!A282=\"\",\"\",DATA_SISWA!A282)","v":""},{"$f":"IF(DATA_SISWA!B282=\"\",\"\",DATA_SISWA!B282)","v":""}]
[{"$f":"IF(DATA_SISWA!A283=\"\",\"\",DATA_SISWA!A283)","v":""},{"$f":"IF(DATA_SISWA!B283=\"\",\"\",DATA_SISWA!B283)","v":""}]
[{"$f":"IF(DATA_SISWA!A284=\"\",\"\",DATA_SISWA!A284)","v":""},{"$f":"IF(DATA_SISWA!B284=\"\",\"\",DATA_SISWA!B284)","v":""}]
[{"$f":"IF(DATA_SISWA!A285=\"\",\"\",DATA_SISWA!A285)","v":""},{"$f":"IF(DATA_SISWA!B285=\"\",\"\",DATA_SISWA!B285)","v":""}]
[{"$f":"IF(DATA_SISWA!A286=\"\",\"\",DATA_SISWA!A286)","v":""},{"$f":"IF(DATA_SISWA!B286=\"\",\"\",DATA_SISWA!B286)","v":""}]
[{"$f":"IF(DATA_SISWA!A287=\"\",\"\",DATA_SISWA!A287)","v":""},{"$f":"IF(DATA_SISWA!B287=\"\",\"\",DATA_SISWA!B287)","v":""}]
[{"$f":"IF(DATA_SISWA!A288=\"\",\"\",DATA_SISWA!A288)","v":""},{"$f":"IF(DATA_SISWA!B288=\"\",\"\",DATA_SISWA!B288)","v":""}]
[{"$f":"IF(DATA_SISWA!A289=\"\",\"\",DATA_SISWA!A289)","v":""},{"$f":"IF(DATA_SISWA!B289=\"\",\"\",DATA_SISWA!B289)","v":""}]
[{"$f":"IF(DATA_SISWA!A290=\"\",\"\",DATA_SISWA!A290)","v":""},{"$f":"IF(DATA_SISWA!B290=\"\",\"\",DATA_SISWA!B290)","v":""}]
[{"$f":"IF(DATA_SISWA!A291=\"\",\"\",DATA_SISWA!A291)","v":""},{"$f":"IF(DATA_SISWA!B291=\"\",\"\",DATA_SISWA!B291)","v":""}]
[{"$f":"IF(DATA_SISWA!A292=\"\",\"\",DATA_SISWA!A292)","v":""},{"$f":"IF(DATA_SISWA!B292=\"\",\"\",DATA_SISWA!B292)","v":""}]
[{"$f":"IF(DATA_SISWA!A293=\"\",\"\",DATA_SISWA!A293)","v":""},{"$f":"IF(DATA_SISWA!B293=\"\",\"\",DATA_SISWA!B293)","v":""}]
[{"$f":"IF(DATA_SISWA!A294=\"\",\"\",DATA_SISWA!A294)","v":""},{"$f":"IF(DATA_SISWA!B294=\"\",\"\",DATA_SISWA!B294)","v":""}]
[{"$f":"IF(DATA_SISWA!A295=\"\",\"\",DATA_SISWA!A295)","v":""},{"$f":"IF(DATA_SISWA!B295=\"\",\"\",DATA_SISWA!B295)","v":""}]
[{"$f":"IF(DATA_SISWA!A296=\"\",\"\",DATA_SISWA!A296)","v":""},{"$f":"IF(DATA_SISWA!B296=\"\",\"\",DATA_SISWA!B296)","v":""}]
[{"$f":"IF(DATA_SISWA!A297=\"\",\"\",DATA_SISWA!A297)","v":""},{"$f":"IF(DATA_SISWA!B297=\"\",\"\",DATA_SISWA!B297)","v":""}]
[{"$f":"IF(DATA_SISWA!A298=\"\",\"\",DATA_SISWA!A298)","v":""},{"$f":"IF(DATA_SISWA!B298=\"\",\"\",DATA_SISWA!B298)","v":""}]
[{"$f":"IF(DATA_SISWA!A299=\"\",\"\",DATA_SISWA!A299)","v":""},{"$f":"IF(DATA_SISWA!B299=\"\",\"\",DATA_SISWA!B299)","v":""}]
[{"$f":"IF(DATA_SISWA!A300=\"\",\"\",DATA_SISWA!A300)","v":""},{"$f":"IF(DATA_SISWA!B300=\"\",\"\",DATA_SISWA!B300)","v":""}]
[{"$f":"IF(DATA_SISWA!A301=\"\",\"\",DATA_SISWA!A301)","v":""},{"$f":"IF(DATA_SISWA!B301=\"\",\"\",DATA_SISWA!B301)","v":""}]
[{"$f":"IF(DATA_SISWA!A302=\"\",\"\",DATA_SISWA!A302)","v":""},{"$f":"IF(DATA_SISWA!B302=\"\",\"\",DATA_SISWA!B302)","v":""}]
[{"$f":"IF(DATA_SISWA!A303=\"\",\"\",DATA_SISWA!A303)","v":""},{"$f":"IF(DATA_SISWA!B303=\"\",\"\",DATA_SISWA!B303)","v":""}]
[{"$f":"IF(DATA_SISWA!A304=\"\",\"\",DATA_SISWA!A304)","v":""},{"$f":"IF(DATA_SISWA!B304=\"\",\"\",DATA_SISWA!B304)","v":""}]
[{"$f":"IF(DATA_SISWA!A305=\"\",\"\",DATA_SISWA!A305)","v":""},{"$f":"IF(DATA_SISWA!B305=\"\",\"\",DATA_SISWA!B305)","v":""}]
[{"$f":"IF(DATA_SISWA!A306=\"\",\"\",DATA_SISWA!A306)","v":""},{"$f":"IF(DATA_SISWA!B306=\"\",\"\",DATA_SISWA!B306)","v":""}]
[{"$f":"IF(DATA_SISWA!A307=\"\",\"\",DATA_SISWA!A307)","v":""},{"$f":"IF(DATA_SISWA!B307=\"\",\"\",DATA_SISWA!B307)","v":""}]
[{"$f":"IF(DATA_SISWA!A308=\"\",\"\",DATA_SISWA!A308)","v":""},{"$f":"IF(DATA_SISWA!B308=\"\",\"\",DATA_SISWA!B308)","v":""}]
[{"$f":"IF(DATA_SISWA!A309=\"\",\"\",DATA_SISWA!A309)","v":""},{"$f":"IF(DATA_SISWA!B309=\"\",\"\",DATA_SISWA!B309)","v":""}]
[{"$f":"IF(DATA_SISWA!A310=\"\",\"\",DATA_SISWA!A310)","v":""},{"$f":"IF(DATA_SISWA!B310=\"\",\"\",DATA_SISWA!B310)","v":""}]
[{"$f":"IF(DATA_SISWA!A311=\"\",\"\",DATA_SISWA!A311)","v":""},{"$f":"IF(DATA_SISWA!B311=\"\",\"\",DATA_SISWA!B311)","v":""}]
[{"$f":"IF(DATA_SISWA!A312=\"\",\"\",DATA_SISWA!A312)","v":""},{"$f":"IF(DATA_SISWA!B312=\"\",\"\",DATA_SISWA!B312)","v":""}]
[{"$f":"IF(DATA_SISWA!A313=\"\",\"\",DATA_SISWA!A313)","v":""},{"$f":"IF(DATA_SISWA!B313=\"\",\"\",DATA_SISWA!B313)","v":""}]
[{"$f":"IF(DATA_SISWA!A314=\"\",\"\",DATA_SISWA!A314)","v":""},{"$f":"IF(DATA_SISWA!B314=\"\",\"\",DATA_SISWA!B314)","v":""}]
[{"$f":"IF(DATA_SISWA!A315=\"\",\"\",DATA_SISWA!A315)","v":""},{"$f":"IF(DATA_SISWA!B315=\"\",\"\",DATA_SISWA!B315)","v":""}]
[{"$f":"IF(DATA_SISWA!A316=\"\",\"\",DATA_SISWA!A316)","v":""},{"$f":"IF(DATA_SISWA!B316=\"\",\"\",DATA_SISWA!B316)","v":""}]
[{"$f":"IF(DATA_SISWA!A317=\"\",\"\",DATA_SISWA!A317)","v":""},{"$f":"IF(DATA_SISWA!B317=\"\",\"\",DATA_SISWA!B317)","v":""}]
[{"$f":"IF(DATA_SISWA!A318=\"\",\"\",DATA_SISWA!A318)","v":""},{"$f":"IF(DATA_SISWA!B318=\"\",\"\",DATA_SISWA!B318)","v":""}]
[{"$f":"IF(DATA_SISWA!A319=\"\",\"\",DATA_SISWA!A319)","v":""},{"$f":"IF(DATA_SISWA!B319=\"\",\"\",DATA_SISWA!B319)","v":""}]
[{"$f":"IF(DATA_SISWA!A320=\"\",\"\",DATA_SISWA!A320)","v":""},{"$f":"IF(DATA_SISWA!B320=\"\",\"\",DATA_SISWA!B320)","v":""}]
[{"$f":"IF(DATA_SISWA!A321=\"\",\"\",DATA_SISWA!A321)","v":""},{"$f":"IF(DATA_SISWA!B321=\"\",\"\",DATA_SISWA!B321)","v":""}]
[{"$f":"IF(DATA_SISWA!A322=\"\",\"\",DATA_SISWA!A322)","v":""},{"$f":"IF(DATA_SISWA!B322=\"\",\"\",DATA_SISWA!B322)","v":""}]
[{"$f":"IF(DATA_SISWA!A323=\"\",\"\",DATA_SISWA!A323)","v":""},{"$f":"IF(DATA_SISWA!B323=\"\",\"\",DATA_SISWA!B323)","v":""}]
[{"$f":"IF(DATA_SISWA!A324=\"\",\"\",DATA_SISWA!A324)","v":""},{"$f":"IF(DATA_SISWA!B324=\"\",\"\",DATA_SISWA!B324)","v":""}]
[{"$f":"IF(DATA_SISWA!A325=\"\",\"\",DATA_SISWA!A325)","v":""},{"$f":"IF(DATA_SISWA!B325=\"\",\"\",DATA_SISWA!B325)","v":""}]
[{"$f":"IF(DATA_SISWA!A326=\"\",\"\",DATA_SISWA!A326)","v":""},{"$f":"IF(DATA_SISWA!B326=\"\",\"\",DATA_SISWA!B326)","v":""}]
[{"$f":"IF(DATA_SISWA!A327=\"\",\"\",DATA_SISWA!A327)","v":""},{"$f":"IF(DATA_SISWA!B327=\"\",\"\",DATA_SISWA!B327)","v":""}]
[{"$f":"IF(DATA_SISWA!A328=\"\",\"\",DATA_SISWA!A328)","v":""},{"$f":"IF(DATA_SISWA!B328=\"\",\"\",DATA_SISWA!B328)","v":""}]
[{"$f":"IF(DATA_SISWA!A329=\"\",\"\",DATA_SISWA!A329)","v":""},{"$f":"IF(DATA_SISWA!B329=\"\",\"\",DATA_SISWA!B329)","v":""}]
[{"$f":"IF(DATA_SISWA!A330=\"\",\"\",DATA_SISWA!A330)","v":""},{"$f":"IF(DATA_SISWA!B330=\"\",\"\",DATA_SISWA!B330)","v":""}]
[{"$f":"IF(DATA_SISWA!A331=\"\",\"\",DATA_SISWA!A331)","v":""},{"$f":"IF(DATA_SISWA!B331=\"\",\"\",DATA_SISWA!B331)","v":""}]
[{"$f":"IF(DATA_SISWA!A332=\"\",\"\",DATA_SISWA!A332)","v":""},{"$f":"IF(DATA_SISWA!B332=\"\",\"\",DATA_SISWA!B332)","v":""}]
[{"$f":"IF(DATA_SISWA!A333=\"\",\"\",DATA_SISWA!A333)","v":""},{"$f":"IF(DATA_SISWA!B333=\"\",\"\",DATA_SISWA!B333)","v":""}]
[{"$f":"IF(DATA_SISWA!A334=\"\",\"\",DATA_SISWA!A334)","v":""},{"$f":"IF(DATA_SISWA!B334=\"\",\"\",DATA_SISWA!B334)","v":""}]
[{"$f":"IF(DATA_SISWA!A335=\"\",\"\",DATA_SISWA!A335)","v":""},{"$f":"IF(DATA_SISWA!B335=\"\",\"\",DATA_SISWA!B335)","v":""}]
[{"$f":"IF(DATA_SISWA!A336=\"\",\"\",DATA_SISWA!A336)","v":""},{"$f":"IF(DATA_SISWA!B336=\"\",\"\",DATA_SISWA!B336)","v":""}]
[{"$f":"IF(DATA_SISWA!A337=\"\",\"\",DATA_SISWA!A337)","v":""},{"$f":"IF(DATA_SISWA!B337=\"\",\"\",DATA_SISWA!B337)","v":""}]
[{"$f":"IF(DATA_SISWA!A338=\"\",\"\",DATA_SISWA!A338)","v":""},{"$f":"IF(DATA_SISWA!B338=\"\",\"\",DATA_SISWA!B338)","v":""}]
[{"$f":"IF(DATA_SISWA!A339=\"\",\"\",DATA_SISWA!A339)","v":""},{"$f":"IF(DATA_SISWA!B339=\"\",\"\",DATA_SISWA!B339)","v":""}]
[{"$f":"IF(DATA_SISWA!A340=\"\",\"\",DATA_SISWA!A340)","v":""},{"$f":"IF(DATA_SISWA!B340=\"\",\"\",DATA_SISWA!B340)","v":""}]
[{"$f":"IF(DATA_SISWA!A341=\"\",\"\",DATA_SISWA!A341)","v":""},{"$f":"IF(DATA_SISWA!B341=\"\",\"\",DATA_SISWA!B341)","v":""}]
[{"$f":"IF(DATA_SISWA!A342=\"\",\"\",DATA_SISWA!A342)","v":""},{"$f":"IF(DATA_SISWA!B342=\"\",\"\",DATA_SISWA!B342)","v":""}]
[{"$f":"IF(DATA_SISWA!A343=\"\",\"\",DATA_SISWA!A343)","v":""},{"$f":"IF(DATA_SISWA!B343=\"\",\"\",DATA_SISWA!B343)","v":""}]
[{"$f":"IF(DATA_SISWA!A344=\"\",\"\",DATA_SISWA!A344)","v":""},{"$f":"IF(DATA_SISWA!B344=\"\",\"\",DATA_SISWA!B344)","v":""}]
[{"$f":"IF(DATA_SISWA!A345=\"\",\"\",DATA_SISWA!A345)","v":""},{"$f":"IF(DATA_SISWA!B345=\"\",\"\",DATA_SISWA!B345)","v":""}]
[{"$f":"IF(DATA_SISWA!A346=\"\",\"\",DATA_SISWA!A346)","v":""},{"$f":"IF(DATA_SISWA!B346=\"\",\"\",DATA_SISWA!B346)","v":""}]
[{"$f":"IF(DATA_SISWA!A347=\"\",\"\",DATA_SISWA!A347)","v":""},{"$f":"IF(DATA_SISWA!B347=\"\",\"\",DATA_SISWA!B347)","v":""}]
[{"$f":"IF(DATA_SISWA!A348=\"\",\"\",DATA_SISWA!A348)","v":""},{"$f":"IF(DATA_SISWA!B348=\"\",\"\",DATA_SISWA!B348)","v":""}]
[{"$f":"IF(DATA_SISWA!A349=\"\",\"\",DATA_SISWA!A349)","v":""},{"$f":"IF(DATA_SISWA!B349=\"\",\"\",DATA_SISWA!B349)","v":""}]
[{"$f":"IF(DATA_SISWA!A350=\"\",\"\",DATA_SISWA!A350)","v":""},{"$f":"IF(DATA_SISWA!B350=\"\",\"\",DATA_SISWA!B350)","v":""}]
[{"$f":"IF(DATA_SISWA!A351=\"\",\"\",DATA_SISWA!A351)","v":""},{"$f":"IF(DATA_SISWA!B351=\"\",\"\",DATA_SISWA!B351)","v":""}]
[{"$f":"IF(DATA_SISWA!A352=\"\",\"\",DATA_SISWA!A352)","v":""},{"$f":"IF(DATA_SISWA!B352=\"\",\"\",DATA_SISWA!B352)","v":""}]
[{"$f":"IF(DATA_SISWA!A353=\"\",\"\",DATA_SISWA!A353)","v":""},{"$f":"IF(DATA_SISWA!B353=\"\",\"\",DATA_SISWA!B353)","v":""}]
[{"$f":"IF(DATA_SISWA!A354=\"\",\"\",DATA_SISWA!A354)","v":""},{"$f":"IF(DATA_SISWA!B354=\"\",\"\",DATA_SISWA!B354)","v":""}]
[{"$f":"IF(DATA_SISWA!A355=\"\",\"\",DATA_SISWA!A355)","v":""},{"$f":"IF(DATA_SISWA!B355=\"\",\"\",DATA_SISWA!B355)","v":""}]
[{"$f":"IF(DATA_SISWA!A356=\"\",\"\",DATA_SISWA!A356)","v":""},{"$f":"IF(DATA_SISWA!B356=\"\",\"\",DATA_SISWA!B356)","v":""}]
[{"$f":"IF(DATA_SISWA!A357=\"\",\"\",DATA_SISWA!A357)","v":""},{"$f":"IF(DATA_SISWA!B357=\"\",\"\",DATA_SISWA!B357)","v":""}]
[{"$f":"IF(DATA_SISWA!A358=\"\",\"\",DATA_SISWA!A358)","v":""},{"$f":"IF(DATA_SISWA!B358=\"\",\"\",DATA_SISWA!B358)","v":""}]
[{"$f":"IF(DATA_SISWA!A359=\"\",\"\",DATA_SISWA!A359)","v":""},{"$f":"IF(DATA_SISWA!B359=\"\",\"\",DATA_SISWA!B359)","v":""}]
[{"$f":"IF(DATA_SISWA!A360=\"\",\"\",DATA_SISWA!A360)","v":""},{"$f":"IF(DATA_SISWA!B360=\"\",\"\",DATA_SISWA!B360)","v":""}]
[{"$f":"IF(DATA_SISWA!A361=\"\",\"\",DATA_SISWA!A361)","v":""},{"$f":"IF(DATA_SISWA!B361=\"\",\"\",DATA_SISWA!B361)","v":""}]
[{"$f":"IF(DATA_SISWA!A362=\"\",\"\",DATA_SISWA!A362)","v":""},{"$f":"IF(DATA_SISWA!B362=\"\",\"\",DATA_SISWA!B362)","v":""}]
[{"$f":"IF(DATA_SISWA!A363=\"\",\"\",DATA_SISWA!A363)","v":""},{"$f":"IF(DATA_SISWA!B363=\"\",\"\",DATA_SISWA!B363)","v":""}]
[{"$f":"IF(DATA_SISWA!A364=\"\",\"\",DATA_SISWA!A364)","v":""},{"$f":"IF(DATA_SISWA!B364=\"\",\"\",DATA_SISWA!B364)","v":""}]
[{"$f":"IF(DATA_SISWA!A365=\"\",\"\",DATA_SISWA!A365)","v":""},{"$f":"IF(DATA_SISWA!B365=\"\",\"\",DATA_SISWA!B365)","v":""}]
[{"$f":"IF(DATA_SISWA!A366=\"\",\"\",DATA_SISWA!A366)","v":""},{"$f":"IF(DATA_SISWA!B366=\"\",\"\",DATA_SISWA!B366)","v":""}]
[{"$f":"IF(DATA_SISWA!A367=\"\",\"\",DATA_SISWA!A367)","v":""},{"$f":"IF(DATA_SISWA!B367=\"\",\"\",DATA_SISWA!B367)","v":""}]
[{"$f":"IF(DATA_SISWA!A368=\"\",\"\",DATA_SISWA!A368)","v":""},{"$f":"IF(DATA_SISWA!B368=\"\",\"\",DATA_SISWA!B368)","v":""}]
[{"$f":"IF(DATA_SISWA!A369=\"\",\"\",DATA_SISWA!A369)","v":""},{"$f":"IF(DATA_SISWA!B369=\"\",\"\",DATA_SISWA!B369)","v":""}]
[{"$f":"IF(DATA_SISWA!A370=\"\",\"\",DATA_SISWA!A370)","v":""},{"$f":"IF(DATA_SISWA!B370=\"\",\"\",DATA_SISWA!B370)","v":""}]
[{"$f":"IF(DATA_SISWA!A371=\"\",\"\",DATA_SISWA!A371)","v":""},{"$f":"IF(DATA_SISWA!B371=\"\",\"\",DATA_SISWA!B371)","v":""}]
[{"$f":"IF(DATA_SISWA!A372=\"\",\"\",DATA_SISWA!A372)","v":""},{"$f":"IF(DATA_SISWA!B372=\"\",\"\",DATA_SISWA!B372)","v":""}]
[{"$f":"IF(DATA_SISWA!A373=\"\",\"\",DATA_SISWA!A373)","v":""},{"$f":"IF(DATA_SISWA!B373=\"\",\"\",DATA_SISWA!B373)","v":""}]
[{"$f":"IF(DATA_SISWA!A374=\"\",\"\",DATA_SISWA!A374)","v":""},{"$f":"IF(DATA_SISWA!B374=\"\",\"\",DATA_SISWA!B374)","v":""}]
[{"$f":"IF(DATA_SISWA!A375=\"\",\"\",DATA_SISWA!A375)","v":""},{"$f":"IF(DATA_SISWA!B375=\"\",\"\",DATA_SISWA!B375)","v":""}]
[{"$f":"IF(DATA_SISWA!A376=\"\",\"\",DATA_SISWA!A376)","v":""},{"$f":"IF(DATA_SISWA!B376=\"\",\"\",DATA_SISWA!B376)","v":""}]
[{"$f":"IF(DATA_SISWA!A377=\"\",\"\",DATA_SISWA!A377)","v":""},{"$f":"IF(DATA_SISWA!B377=\"\",\"\",DATA_SISWA!B377)","v":""}]
[{"$f":"IF(DATA_SISWA!A378=\"\",\"\",DATA_SISWA!A378)","v":""},{"$f":"IF(DATA_SISWA!B378=\"\",\"\",DATA_SISWA!B378)","v":""}]
[{"$f":"IF(DATA_SISWA!A379=\"\",\"\",DATA_SISWA!A379)","v":""},{"$f":"IF(DATA_SISWA!B379=\"\",\"\",DATA_SISWA!B379)","v":""}]
[{"$f":"IF(DATA_SISWA!A380=\"\",\"\",DATA_SISWA!A380)","v":""},{"$f":"IF(DATA_SISWA!B380=\"\",\"\",DATA_SISWA!B380)","v":""}]
[{"$f":"IF(DATA_SISWA!A381=\"\",\"\",DATA_SISWA!A381)","v":""},{"$f":"IF(DATA_SISWA!B381=\"\",\"\",DATA_SISWA!B381)","v":""}]
[{"$f":"IF(DATA_SISWA!A382=\"\",\"\",DATA_SISWA!A382)","v":""},{"$f":"IF(DATA_SISWA!B382=\"\",\"\",DATA_SISWA!B382)","v":""}]
[{"$f":"IF(DATA_SISWA!A383=\"\",\"\",DATA_SISWA!A383)","v":""},{"$f":"IF(DATA_SISWA!B383=\"\",\"\",DATA_SISWA!B383)","v":""}]
[{"$f":"IF(DATA_SISWA!A384=\"\",\"\",DATA_SISWA!A384)","v":""},{"$f":"IF(DATA_SISWA!B384=\"\",\"\",DATA_SISWA!B384)","v":""}]
[{"$f":"IF(DATA_SISWA!A385=\"\",\"\",DATA_SISWA!A385)","v":""},{"$f":"IF(DATA_SISWA!B385=\"\",\"\",DATA_SISWA!B385)","v":""}]
[{"$f":"IF(DATA_SISWA!A386=\"\",\"\",DATA_SISWA!A386)","v":""},{"$f":"IF(DATA_SISWA!B386=\"\",\"\",DATA_SISWA!B386)","v":""}]
[{"$f":"IF(DATA_SISWA!A387=\"\",\"\",DATA_SISWA!A387)","v":""},{"$f":"IF(DATA_SISWA!B387=\"\",\"\",DATA_SISWA!B387)","v":""}]
[{"$f":"IF(DATA_SISWA!A388=\"\",\"\",DATA_SISWA!A388)","v":""},{"$f":"IF(DATA_SISWA!B388=\"\",\"\",DATA_SISWA!B388)","v":""}]
[{"$f":"IF(DATA_SISWA!A389=\"\",\"\",DATA_SISWA!A389)","v":""},{"$f":"IF(DATA_SISWA!B389=\"\",\"\",DATA_SISWA!B389)","v":""}]
[{"$f":"IF(DATA_SISWA!A390=\"\",\"\",DATA_SISWA!A390)","v":""},{"$f":"IF(DATA_SISWA!B390=\"\",\"\",DATA_SISWA!B390)","v":""}]
[{"$f":"IF(DATA_SISWA!A391=\"\",\"\",DATA_SISWA!A391)","v":""},{"$f":"IF(DATA_SISWA!B391=\"\",\"\",DATA_SISWA!B391)","v":""}]
[{"$f":"IF(DATA_SISWA!A392=\"\",\"\",DATA_SISWA!A392)","v":""},{"$f":"IF(DATA_SISWA!B392=\"\",\"\",DATA_SISWA!B392)","v":""}]
[{"$f":"IF(DATA_SISWA!A393=\"\",\"\",DATA_SISWA!A393)","v":""},{"$f":"IF(DATA_SISWA!B393=\"\",\"\",DATA_SISWA!B393)","v":""}]
[{"$f":"IF(DATA_SISWA!A394=\"\",\"\",DATA_SISWA!A394)","v":""},{"$f":"IF(DATA_SISWA!B394=\"\",\"\",DATA_SISWA!B394)","v":""}]
[{"$f":"IF(DATA_SISWA!A395=\"\",\"\",DATA_SISWA!A395)","v":""},{"$f":"IF(DATA_SISWA!B395=\"\",\"\",DATA_SISWA!B395)","v":""}]
[{"$f":"IF(DATA_SISWA!A396=\"\",\"\",DATA_SISWA!A396)","v":""},{"$f":"IF(DATA_SISWA!B396=\"\",\"\",DATA_SISWA!B396)","v":""}]
[{"$f":"IF(DATA_SISWA!A397=\"\",\"\",DATA_SISWA!A397)","v":""},{"$f":"IF(DATA_SISWA!B397=\"\",\"\",DATA_SISWA!B397)","v":""}]
[{"$f":"IF(DATA_SISWA!A398=\"\",\"\",DATA_SISWA!A398)","v":""},{"$f":"IF(DATA_SISWA!B398=\"\",\"\",DATA_SISWA!B398)","v":""}]
[{"$f":"IF(DATA_SISWA!A399=\"\",\"\",DATA_SISWA!A399)","v":""},{"$f":"IF(DATA_SISWA!B399=\"\",\"\",DATA_SISWA!B399)","v":""}]
[{"$f":"IF(DATA_SISWA!A400=\"\",\"\",DATA_SISWA!A400)","v":""},{"$f":"IF(DATA_SISWA!B400=\"\",\"\",DATA_SISWA!B400)","v":""}]
[{"$f":"IF(DATA_SISWA!A401=\"\",\"\",DATA_SISWA!A401)","v":""},{"$f":"IF(DATA_SISWA!B401=\"\",\"\",DATA_SISWA!B401)","v":""}]
[{"$f":"IF(DATA_SISWA!A402=\"\",\"\",DATA_SISWA!A402)","v":""},{"$f":"IF(DATA_SISWA!B402=\"\",\"\",DATA_SISWA!B402)","v":""}]
[{"$f":"IF(DATA_SISWA!A403=\"\",\"\",DATA_SISWA!A403)","v":""},{"$f":"IF(DATA_SISWA!B403=\"\",\"\",DATA_SISWA!B403)","v":""}]
[{"$f":"IF(DATA_SISWA!A404=\"\",\"\",DATA_SISWA!A404)","v":""},{"$f":"IF(DATA_SISWA!B404=\"\",\"\",DATA_SISWA!B404)","v":""}]
[{"$f":"IF(DATA_SISWA!A405=\"\",\"\",DATA_SISWA!A405)","v":""},{"$f":"IF(DATA_SISWA!B405=\"\",\"\",DATA_SISWA!B405)","v":""}]
[{"$f":"IF(DATA_SISWA!A406=\"\",\"\",DATA_SISWA!A406)","v":""},{"$f":"IF(DATA_SISWA!B406=\"\",\"\",DATA_SISWA!B406)","v":""}]
[{"$f":"IF(DATA_SISWA!A407=\"\",\"\",DATA_SISWA!A407)","v":""},{"$f":"IF(DATA_SISWA!B407=\"\",\"\",DATA_SISWA!B407)","v":""}]
[{"$f":"IF(DATA_SISWA!A408=\"\",\"\",DATA_SISWA!A408)","v":""},{"$f":"IF(DATA_SISWA!B408=\"\",\"\",DATA_SISWA!B408)","v":""}]
[{"$f":"IF(DATA_SISWA!A409=\"\",\"\",DATA_SISWA!A409)","v":""},{"$f":"IF(DATA_SISWA!B409=\"\",\"\",DATA_SISWA!B409)","v":""}]
[{"$f":"IF(DATA_SISWA!A410=\"\",\"\",DATA_SISWA!A410)","v":""},{"$f":"IF(DATA_SISWA!B410=\"\",\"\",DATA_SISWA!B410)","v":""}]
[{"$f":"IF(DATA_SISWA!A411=\"\",\"\",DATA_SISWA!A411)","v":""},{"$f":"IF(DATA_SISWA!B411=\"\",\"\",DATA_SISWA!B411)","v":""}]
[{"$f":"IF(DATA_SISWA!A412=\"\",\"\",DATA_SISWA!A412)","v":""},{"$f":"IF(DATA_SISWA!B412=\"\",\"\",DATA_SISWA!B412)","v":""}]
[{"$f":"IF(DATA_SISWA!A413=\"\",\"\",DATA_SISWA!A413)","v":""},{"$f":"IF(DATA_SISWA!B413=\"\",\"\",DATA_SISWA!B413)","v":""}]
[{"$f":"IF(DATA_SISWA!A414=\"\",\"\",DATA_SISWA!A414)","v":""},{"$f":"IF(DATA_SISWA!B414=\"\",\"\",DATA_SISWA!B414)","v":""}]
[{"$f":"IF(DATA_SISWA!A415=\"\",\"\",DATA_SISWA!A415)","v":""},{"$f":"IF(DATA_SISWA!B415=\"\",\"\",DATA_SISWA!B415)","v":""}]
[{"$f":"IF(DATA_SISWA!A416=\"\",\"\",DATA_SISWA!A416)","v":""},{"$f":"IF(DATA_SISWA!B416=\"\",\"\",DATA_SISWA!B416)","v":""}]
[{"$f":"IF(DATA_SISWA!A417=\"\",\"\",DATA_SISWA!A417)","v":""},{"$f":"IF(DATA_SISWA!B417=\"\",\"\",DATA_SISWA!B417)","v":""}]
[{"$f":"IF(DATA_SISWA!A418=\"\",\"\",DATA_SISWA!A418)","v":""},{"$f":"IF(DATA_SISWA!B418=\"\",\"\",DATA_SISWA!B418)","v":""}]
[{"$f":"IF(DATA_SISWA!A419=\"\",\"\",DATA_SISWA!A419)","v":""},{"$f":"IF(DATA_SISWA!B419=\"\",\"\",DATA_SISWA!B419)","v":""}]
[{"$f":"IF(DATA_SISWA!A420=\"\",\"\",DATA_SISWA!A420)","v":""},{"$f":"IF(DATA_SISWA!B420=\"\",\"\",DATA_SISWA!B420)","v":""}]
[{"$f":"IF(DATA_SISWA!A421=\"\",\"\",DATA_SISWA!A421)","v":""},{"$f":"IF(DATA_SISWA!B421=\"\",\"\",DATA_SISWA!B421)","v":""}]
[{"$f":"IF(DATA_SISWA!A422=\"\",\"\",DATA_SISWA!A422)","v":""},{"$f":"IF(DATA_SISWA!B422=\"\",\"\",DATA_SISWA!B422)","v":""}]
[{"$f":"IF(DATA_SISWA!A423=\"\",\"\",DATA_SISWA!A423)","v":""},{"$f":"IF(DATA_SISWA!B423=\"\",\"\",DATA_SISWA!B423)","v":""}]
[{"$f":"IF(DATA_SISWA!A424=\"\",\"\",DATA_SISWA!A424)","v":""},{"$f":"IF(DATA_SISWA!B424=\"\",\"\",DATA_SISWA!B424)","v":""}]
[{"$f":"IF(DATA_SISWA!A425=\"\",\"\",DATA_SISWA!A425)","v":""},{"$f":"IF(DATA_SISWA!B425=\"\",\"\",DATA_SISWA!B425)","v":""}]
[{"$f":"IF(DATA_SISWA!A426=\"\",\"\",DATA_SISWA!A426)","v":""},{"$f":"IF(DATA_SISWA!B426=\"\",\"\",DATA_SISWA!B426)","v":""}]
[{"$f":"IF(DATA_SISWA!A427=\"\",\"\",DATA_SISWA!A427)","v":""},{"$f":"IF(DATA_SISWA!B427=\"\",\"\",DATA_SISWA!B427)","v":""}]
[{"$f":"IF(DATA_SISWA!A428=\"\",\"\",DATA_SISWA!A428)","v":""},{"$f":"IF(DATA_SISWA!B428=\"\",\"\",DATA_SISWA!B428)","v":""}]
[{"$f":"IF(DATA_SISWA!A429=\"\",\"\",DATA_SISWA!A429)","v":""},{"$f":"IF(DATA_SISWA!B429=\"\",\"\",DATA_SISWA!B429)","v":""}]
[{"$f":"IF(DATA_SISWA!A430=\"\",\"\",DATA_SISWA!A430)","v":""},{"$f":"IF(DATA_SISWA!B430=\"\",\"\",DATA_SISWA!B430)","v":""}]
[{"$f":"IF(DATA_SISWA!A431=\"\",\"\",DATA_SISWA!A431)","v":""},{"$f":"IF(DATA_SISWA!B431=\"\",\"\",DATA_SISWA!B431)","v":""}]
[{"$f":"IF(DATA_SISWA!A432=\"\",\"\",DATA_SISWA!A432)","v":""},{"$f":"IF(DATA_SISWA!B432=\"\",\"\",DATA_SISWA!B432)","v":""}]
[{"$f":"IF(DATA_SISWA!A433=\"\",\"\",DATA_SISWA!A433)","v":""},{"$f":"IF(DATA_SISWA!B433=\"\",\"\",DATA_SISWA!B433)","v":""}]
[{"$f":"IF(DATA_SISWA!A434=\"\",\"\",DATA_SISWA!A434)","v":""},{"$f":"IF(DATA_SISWA!B434=\"\",\"\",DATA_SISWA!B434)","v":""}]
[{"$f":"IF(DATA_SISWA!A435=\"\",\"\",DATA_SISWA!A435)","v":""},{"$f":"IF(DATA_SISWA!B435=\"\",\"\",DATA_SISWA!B435)","v":""}]
[{"$f":"IF(DATA_SISWA!A436=\"\",\"\",DATA_SISWA!A436)","v":""},{"$f":"IF(DATA_SISWA!B436=\"\",\"\",DATA_SISWA!B436)","v":""}]
[{"$f":"IF(DATA_SISWA!A437=\"\",\"\",DATA_SISWA!A437)","v":""},{"$f":"IF(DATA_SISWA!B437=\"\",\"\",DATA_SISWA!B437)","v":""}]
[{"$f":"IF(DATA_SISWA!A438=\"\",\"\",DATA_SISWA!A438)","v":""},{"$f":"IF(DATA_SISWA!B438=\"\",\"\",DATA_SISWA!B438)","v":""}]
[{"$f":"IF(DATA_SISWA!A439=\"\",\"\",DATA_SISWA!A439)","v":""},{"$f":"IF(DATA_SISWA!B439=\"\",\"\",DATA_SISWA!B439)","v":""}]
[{"$f":"IF(DATA_SISWA!A440=\"\",\"\",DATA_SISWA!A440)","v":""},{"$f":"IF(DATA_SISWA!B440=\"\",\"\",DATA_SISWA!B440)","v":""}]
[{"$f":"IF(DATA_SISWA!A441=\"\",\"\",DATA_SISWA!A441)","v":""},{"$f":"IF(DATA_SISWA!B441=\"\",\"\",DATA_SISWA!B441)","v":""}]
[{"$f":"IF(DATA_SISWA!A442=\"\",\"\",DATA_SISWA!A442)","v":""},{"$f":"IF(DATA_SISWA!B442=\"\",\"\",DATA_SISWA!B442)","v":""}]
[{"$f":"IF(DATA_SISWA!A443=\"\",\"\",DATA_SISWA!A443)","v":""},{"$f":"IF(DATA_SISWA!B443=\"\",\"\",DATA_SISWA!B443)","v":""}]
[{"$f":"IF(DATA_SISWA!A444=\"\",\"\",DATA_SISWA!A444)","v":""},{"$f":"IF(DATA_SISWA!B444=\"\",\"\",DATA_SISWA!B444)","v":""}]
[{"$f":"IF(DATA_SISWA!A445=\"\",\"\",DATA_SISWA!A445)","v":""},{"$f":"IF(DATA_SISWA!B445=\"\",\"\",DATA_SISWA!B445)","v":""}]
[{"$f":"IF(DATA_SISWA!A446=\"\",\"\",DATA_SISWA!A446)","v":""},{"$f":"IF(DATA_SISWA!B446=\"\",\"\",DATA_SISWA!B446)","v":""}]
[{"$f":"IF(DATA_SISWA!A447=\"\",\"\",DATA_SISWA!A447)","v":""},{"$f":"IF(DATA_SISWA!B447=\"\",\"\",DATA_SISWA!B447)","v":""}]
[{"$f":"IF(DATA_SISWA!A448=\"\",\"\",DATA_SISWA!A448)","v":""},{"$f":"IF(DATA_SISWA!B448=\"\",\"\",DATA_SISWA!B448)","v":""}]
[{"$f":"IF(DATA_SISWA!A449=\"\",\"\",DATA_SISWA!A449)","v":""},{"$f":"IF(DATA_SISWA!B449=\"\",\"\",DATA_SISWA!B449)","v":""}]
[{"$f":"IF(DATA_SISWA!A450=\"\",\"\",DATA_SISWA!A450)","v":""},{"$f":"IF(DATA_SISWA!B450=\"\",\"\",DATA_SISWA!B450)","v":""}]
[{"$f":"IF(DATA_SISWA!A451=\"\",\"\",DATA_SISWA!A451)","v":""},{"$f":"IF(DATA_SISWA!B451=\"\",\"\",DATA_SISWA!B451)","v":""}]
[{"$f":"IF(DATA_SISWA!A452=\"\",\"\",DATA_SISWA!A452)","v":""},{"$f":"IF(DATA_SISWA!B452=\"\",\"\",DATA_SISWA!B452)","v":""}]
[{"$f":"IF(DATA_SISWA!A453=\"\",\"\",DATA_SISWA!A453)","v":""},{"$f":"IF(DATA_SISWA!B453=\"\",\"\",DATA_SISWA!B453)","v":""}]
[{"$f":"IF(DATA_SISWA!A454=\"\",\"\",DATA_SISWA!A454)","v":""},{"$f":"IF(DATA_SISWA!B454=\"\",\"\",DATA_SISWA!B454)","v":""}]
[{"$f":"IF(DATA_SISWA!A455=\"\",\"\",DATA_SISWA!A455)","v":""},{"$f":"IF(DATA_SISWA!B455=\"\",\"\",DATA_SISWA!B455)","v":""}]
[{"$f":"IF(DATA_SISWA!A456=\"\",\"\",DATA_SISWA!A456)","v":""},{"$f":"IF(DATA_SISWA!B456=\"\",\"\",DATA_SISWA!B456)","v":""}]
[{"$f":"IF(DATA_SISWA!A457=\"\",\"\",DATA_SISWA!A457)","v":""},{"$f":"IF(DATA_SISWA!B457=\"\",\"\",DATA_SISWA!B457)","v":""}]
[{"$f":"IF(DATA_SISWA!A458=\"\",\"\",DATA_SISWA!A458)","v":""},{"$f":"IF(DATA_SISWA!B458=\"\",\"\",DATA_SISWA!B458)","v":""}]
[{"$f":"IF(DATA_SISWA!A459=\"\",\"\",DATA_SISWA!A459)","v":""},{"$f":"IF(DATA_SISWA!B459=\"\",\"\",DATA_SISWA!B459)","v":""}]
[{"$f":"IF(DATA_SISWA!A460=\"\",\"\",DATA_SISWA!A460)","v":""},{"$f":"IF(DATA_SISWA!B460=\"\",\"\",DATA_SISWA!B460)","v":""}]
[{"$f":"IF(DATA_SISWA!A461=\"\",\"\",DATA_SISWA!A461)","v":""},{"$f":"IF(DATA_SISWA!B461=\"\",\"\",DATA_SISWA!B461)","v":""}]
[{"$f":"IF(DATA_SISWA!A462=\"\",\"\",DATA_SISWA!A462)","v":""},{"$f":"IF(DATA_SISWA!B462=\"\",\"\",DATA_SISWA!B462)","v":""}]
[{"$f":"IF(DATA_SISWA!A463=\"\",\"\",DATA_SISWA!A463)","v":""},{"$f":"IF(DATA_SISWA!B463=\"\",\"\",DATA_SISWA!B463)","v":""}]
[{"$f":"IF(DATA_SISWA!A464=\"\",\"\",DATA_SISWA!A464)","v":""},{"$f":"IF(DATA_SISWA!B464=\"\",\"\",DATA_SISWA!B464)","v":""}]
[{"$f":"IF(DATA_SISWA!A465=\"\",\"\",DATA_SISWA!A465)","v":""},{"$f":"IF(DATA_SISWA!B465=\"\",\"\",DATA_SISWA!B465)","v":""}]
[{"$f":"IF(DATA_SISWA!A466=\"\",\"\",DATA_SISWA!A466)","v":""},{"$f":"IF(DATA_SISWA!B466=\"\",\"\",DATA_SISWA!B466)","v":""}]
[{"$f":"IF(DATA_SISWA!A467=\"\",\"\",DATA_SISWA!A467)","v":""},{"$f":"IF(DATA_SISWA!B467=\"\",\"\",DATA_SISWA!B467)","v":""}]
[{"$f":"IF(DATA_SISWA!A468=\"\",\"\",DATA_SISWA!A468)","v":""},{"$f":"IF(DATA_SISWA!B468=\"\",\"\",DATA_SISWA!B468)","v":""}]
[{"$f":"IF(DATA_SISWA!A469=\"\",\"\",DATA_SISWA!A469)","v":""},{"$f":"IF(DATA_SISWA!B469=\"\",\"\",DATA_SISWA!B469)","v":""}]
[{"$f":"IF(DATA_SISWA!A470=\"\",\"\",DATA_SISWA!A470)","v":""},{"$f":"IF(DATA_SISWA!B470=\"\",\"\",DATA_SISWA!B470)","v":""}]
[{"$f":"IF(DATA_SISWA!A471=\"\",\"\",DATA_SISWA!A471)","v":""},{"$f":"IF(DATA_SISWA!B471=\"\",\"\",DATA_SISWA!B471)","v":""}]
[{"$f":"IF(DATA_SISWA!A472=\"\",\"\",DATA_SISWA!A472)","v":""},{"$f":"IF(DATA_SISWA!B472=\"\",\"\",DATA_SISWA!B472)","v":""}]
[{"$f":"IF(DATA_SISWA!A473=\"\",\"\",DATA_SISWA!A473)","v":""},{"$f":"IF(DATA_SISWA!B473=\"\",\"\",DATA_SISWA!B473)","v":""}]
[{"$f":"IF(DATA_SISWA!A474=\"\",\"\",DATA_SISWA!A474)","v":""},{"$f":"IF(DATA_SISWA!B474=\"\",\"\",DATA_SISWA!B474)","v":""}]
[{"$f":"IF(DATA_SISWA!A475=\"\",\"\",DATA_SISWA!A475)","v":""},{"$f":"IF(DATA_SISWA!B475=\"\",\"\",DATA_SISWA!B475)","v":""}]
[{"$f":"IF(DATA_SISWA!A476=\"\",\"\",DATA_SISWA!A476)","v":""},{"$f":"IF(DATA_SISWA!B476=\"\",\"\",DATA_SISWA!B476)","v":""}]
[{"$f":"IF(DATA_SISWA!A477=\"\",\"\",DATA_SISWA!A477)","v":""},{"$f":"IF(DATA_SISWA!B477=\"\",\"\",DATA_SISWA!B477)","v":""}]
[{"$f":"IF(DATA_SISWA!A478=\"\",\"\",DATA_SISWA!A478)","v":""},{"$f":"IF(DATA_SISWA!B478=\"\",\"\",DATA_SISWA!B478)","v":""}]
[{"$f":"IF(DATA_SISWA!A479=\"\",\"\",DATA_SISWA!A479)","v":""},{"$f":"IF(DATA_SISWA!B479=\"\",\"\",DATA_SISWA!B479)","v":""}]
[{"$f":"IF(DATA_SISWA!A480=\"\",\"\",DATA_SISWA!A480)","v":""},{"$f":"IF(DATA_SISWA!B480=\"\",\"\",DATA_SISWA!B480)","v":""}]
[{"$f":"IF(DATA_SISWA!A481=\"\",\"\",DATA_SISWA!A481)","v":""},{"$f":"IF(DATA_SISWA!B481=\"\",\"\",DATA_SISWA!B481)","v":""}]
[{"$f":"IF(DATA_SISWA!A482=\"\",\"\",DATA_SISWA!A482)","v":""},{"$f":"IF(DATA_SISWA!B482=\"\",\"\",DATA_SISWA!B482)","v":""}]
[{"$f":"IF(DATA_SISWA!A483=\"\",\"\",DATA_SISWA!A483)","v":""},{"$f":"IF(DATA_SISWA!B483=\"\",\"\",DATA_SISWA!B483)","v":""}]
[{"$f":"IF(DATA_SISWA!A484=\"\",\"\",DATA_SISWA!A484)","v":""},{"$f":"IF(DATA_SISWA!B484=\"\",\"\",DATA_SISWA!B484)","v":""}]
[{"$f":"IF(DATA_SISWA!A485=\"\",\"\",DATA_SISWA!A485)","v":""},{"$f":"IF(DATA_SISWA!B485=\"\",\"\",DATA_SISWA!B485)","v":""}]
[{"$f":"IF(DATA_SISWA!A486=\"\",\"\",DATA_SISWA!A486)","v":""},{"$f":"IF(DATA_SISWA!B486=\"\",\"\",DATA_SISWA!B486)","v":""}]
[{"$f":"IF(DATA_SISWA!A487=\"\",\"\",DATA_SISWA!A487)","v":""},{"$f":"IF(DATA_SISWA!B487=\"\",\"\",DATA_SISWA!B487)","v":""}]
[{"$f":"IF(DATA_SISWA!A488=\"\",\"\",DATA_SISWA!A488)","v":""},{"$f":"IF(DATA_SISWA!B488=\"\",\"\",DATA_SISWA!B488)","v":""}]
[{"$f":"IF(DATA_SISWA!A489=\"\",\"\",DATA_SISWA!A489)","v":""},{"$f":"IF(DATA_SISWA!B489=\"\",\"\",DATA_SISWA!B489)","v":""}]
[{"$f":"IF(DATA_SISWA!A490=\"\",\"\",DATA_SISWA!A490)","v":""},{"$f":"IF(DATA_SISWA!B490=\"\",\"\",DATA_SISWA!B490)","v":""}]
[{"$f":"IF(DATA_SISWA!A491=\"\",\"\",DATA_SISWA!A491)","v":""},{"$f":"IF(DATA_SISWA!B491=\"\",\"\",DATA_SISWA!B491)","v":""}]
[{"$f":"IF(DATA_SISWA!A492=\"\",\"\",DATA_SISWA!A492)","v":""},{"$f":"IF(DATA_SISWA!B492=\"\",\"\",DATA_SISWA!B492)","v":""}]
[{"$f":"IF(DATA_SISWA!A493=\"\",\"\",DATA_SISWA!A493)","v":""},{"$f":"IF(DATA_SISWA!B493=\"\",\"\",DATA_SISWA!B493)","v":""}]
[{"$f":"IF(DATA_SISWA!A494=\"\",\"\",DATA_SISWA!A494)","v":""},{"$f":"IF(DATA_SISWA!B494=\"\",\"\",DATA_SISWA!B494)","v":""}]
[{"$f":"IF(DATA_SISWA!A495=\"\",\"\",DATA_SISWA!A495)","v":""},{"$f":"IF(DATA_SISWA!B495=\"\",\"\",DATA_SISWA!B495)","v":""}]
[{"$f":"IF(DATA_SISWA!A496=\"\",\"\",DATA_SISWA!A496)","v":""},{"$f":"IF(DATA_SISWA!B496=\"\",\"\",DATA_SISWA!B496)","v":""}]
[{"$f":"IF(DATA_SISWA!A497=\"\",\"\",DATA_SISWA!A497)","v":""},{"$f":"IF(DATA_SISWA!B497=\"\",\"\",DATA_SISWA!B497)","v":""}]
[{"$f":"IF(DATA_SISWA!A498=\"\",\"\",DATA_SISWA!A498)","v":""},{"$f":"IF(DATA_SISWA!B498=\"\",\"\",DATA_SISWA!B498)","v":""}]
[{"$f":"IF(DATA_SISWA!A499=\"\",\"\",DATA_SISWA!A499)","v":""},{"$f":"IF(DATA_SISWA!B499=\"\",\"\",DATA_SISWA!B499)","v":""}]
[{"$f":"IF(DATA_SISWA!A500=\"\",\"\",DATA_SISWA!A500)","v":""},{"$f":"IF(DATA_SISWA!B500=\"\",\"\",DATA_SISWA!B500)","v":""}]
[{"$f":"IF(DATA_SISWA!A501=\"\",\"\",DATA_SISWA!A501)","v":""},{"$f":"IF(DATA_SISWA!B501=\"\",\"\",DATA_SISWA!B501)","v":""}]
[{"$f":"IF(DATA_SISWA!A502=\"\",\"\",DATA_SISWA!A502)","v":""},{"$f":"IF(DATA_SISWA!B502=\"\",\"\",DATA_SISWA!B502)","v":""}]
[{"$f":"IF(DATA_SISWA!A503=\"\",\"\",DATA_SISWA!A503)","v":""},{"$f":"IF(DATA_SISWA!B503=\"\",\"\",DATA_SISWA!B503)","v":""}]
[{"$f":"IF(DATA_SISWA!A504=\"\",\"\",DATA_SISWA!A504)","v":""},{"$f":"IF(DATA_SISWA!B504=\"\",\"\",DATA_SISWA!B504)","v":""}]
[{"$f":"IF(DATA_SISWA!A505=\"\",\"\",DATA_SISWA!A505)","v":""},{"$f":"IF(DATA_SISWA!B505=\"\",\"\",DATA_SISWA!B505)","v":""}]
[{"$f":"IF(DATA_SISWA!A506=\"\",\"\",DATA_SISWA!A506)","v":""},{"$f":"IF(DATA_SISWA!B506=\"\",\"\",DATA_SISWA!B506)","v":""}]
[{"$f":"IF(DATA_SISWA!A507=\"\",\"\",DATA_SISWA!A507)","v":""},{"$f":"IF(DATA_SISWA!B507=\"\",\"\",DATA_SISWA!B507)","v":""}]
[{"$f":"IF(DATA_SISWA!A508=\"\",\"\",DATA_SISWA!A508)","v":""},{"$f":"IF(DATA_SISWA!B508=\"\",\"\",DATA_SISWA!B508)","v":""}]
[{"$f":"IF(DATA_SISWA!A509=\"\",\"\",DATA_SISWA!A509)","v":""},{"$f":"IF(DATA_SISWA!B509=\"\",\"\",DATA_SISWA!B509)","v":""}]
[{"$f":"IF(DATA_SISWA!A510=\"\",\"\",DATA_SISWA!A510)","v":""},{"$f":"IF(DATA_SISWA!B510=\"\",\"\",DATA_SISWA!B510)","v":""}]
[{"$f":"IF(DATA_SISWA!A511=\"\",\"\",DATA_SISWA!A511)","v":""},{"$f":"IF(DATA_SISWA!B511=\"\",\"\",DATA_SISWA!B511)","v":""}]
[{"$f":"IF(DATA_SISWA!A512=\"\",\"\",DATA_SISWA!A512)","v":""},{"$f":"IF(DATA_SISWA!B512=\"\",\"\",DATA_SISWA!B512)","v":""}]
[{"$f":"IF(DATA_SISWA!A513=\"\",\"\",DATA_SISWA!A513)","v":""},{"$f":"IF(DATA_SISWA!B513=\"\",\"\",DATA_SISWA!B513)","v":""}]
[{"$f":"IF(DATA_SISWA!A514=\"\",\"\",DATA_SISWA!A514)","v":""},{"$f":"IF(DATA_SISWA!B514=\"\",\"\",DATA_SISWA!B514)","v":""}]
[{"$f":"IF(DATA_SISWA!A515=\"\",\"\",DATA_SISWA!A515)","v":""},{"$f":"IF(DATA_SISWA!B515=\"\",\"\",DATA_SISWA!B515)","v":""}]
[{"$f":"IF(DATA_SISWA!A516=\"\",\"\",DATA_SISWA!A516)","v":""},{"$f":"IF(DATA_SISWA!B516=\"\",\"\",DATA_SISWA!B516)","v":""}]
[{"$f":"IF(DATA_SISWA!A517=\"\",\"\",DATA_SISWA!A517)","v":""},{"$f":"IF(DATA_SISWA!B517=\"\",\"\",DATA_SISWA!B517)","v":""}]
[{"$f":"IF(DATA_SISWA!A518=\"\",\"\",DATA_SISWA!A518)","v":""},{"$f":"IF(DATA_SISWA!B518=\"\",\"\",DATA_SISWA!B518)","v":""}]
[{"$f":"IF(DATA_SISWA!A519=\"\",\"\",DATA_SISWA!A519)","v":""},{"$f":"IF(DATA_SISWA!B519=\"\",\"\",DATA_SISWA!B519)","v":""}]
[{"$f":"IF(DATA_SISWA!A520=\"\",\"\",DATA_SISWA!A520)","v":""},{"$f":"IF(DATA_SISWA!B520=\"\",\"\",DATA_SISWA!B520)","v":""}]
[{"$f":"IF(DATA_SISWA!A521=\"\",\"\",DATA_SISWA!A521)","v":""},{"$f":"IF(DATA_SISWA!B521=\"\",\"\",DATA_SISWA!B521)","v":""}]
[{"$f":"IF(DATA_SISWA!A522=\"\",\"\",DATA_SISWA!A522)","v":""},{"$f":"IF(DATA_SISWA!B522=\"\",\"\",DATA_SISWA!B522)","v":""}]
[{"$f":"IF(DATA_SISWA!A523=\"\",\"\",DATA_SISWA!A523)","v":""},{"$f":"IF(DATA_SISWA!B523=\"\",\"\",DATA_SISWA!B523)","v":""}]
[{"$f":"IF(DATA_SISWA!A524=\"\",\"\",DATA_SISWA!A524)","v":""},{"$f":"IF(DATA_SISWA!B524=\"\",\"\",DATA_SISWA!B524)","v":""}]
[{"$f":"IF(DATA_SISWA!A525=\"\",\"\",DATA_SISWA!A525)","v":""},{"$f":"IF(DATA_SISWA!B525=\"\",\"\",DATA_SISWA!B525)","v":""}]
[{"$f":"IF(DATA_SISWA!A526=\"\",\"\",DATA_SISWA!A526)","v":""},{"$f":"IF(DATA_SISWA!B526=\"\",\"\",DATA_SISWA!B526)","v":""}]
[{"$f":"IF(DATA_SISWA!A527=\"\",\"\",DATA_SISWA!A527)","v":""},{"$f":"IF(DATA_SISWA!B527=\"\",\"\",DATA_SISWA!B527)","v":""}]
[{"$f":"IF(DATA_SISWA!A528=\"\",\"\",DATA_SISWA!A528)","v":""},{"$f":"IF(DATA_SISWA!B528=\"\",\"\",DATA_SISWA!B528)","v":""}]
[{"$f":"IF(DATA_SISWA!A529=\"\",\"\",DATA_SISWA!A529)","v":""},{"$f":"IF(DATA_SISWA!B529=\"\",\"\",DATA_SISWA!B529)","v":""}]
[{"$f":"IF(DATA_SISWA!A530=\"\",\"\",DATA_SISWA!A530)","v":""},{"$f":"IF(DATA_SISWA!B530=\"\",\"\",DATA_SISWA!B530)","v":""}]
[{"$f":"IF(DATA_SISWA!A531=\"\",\"\",DATA_SISWA!A531)","v":""},{"$f":"IF(DATA_SISWA!B531=\"\",\"\",DATA_SISWA!B531)","v":""}]
[{"$f":"IF(DATA_SISWA!A532=\"\",\"\",DATA_SISWA!A532)","v":""},{"$f":"IF(DATA_SISWA!B532=\"\",\"\",DATA_SISWA!B532)","v":""}]
[{"$f":"IF(DATA_SISWA!A533=\"\",\"\",DATA_SISWA!A533)","v":""},{"$f":"IF(DATA_SISWA!B533=\"\",\"\",DATA_SISWA!B533)","v":""}]
[{"$f":"IF(DATA_SISWA!A534=\"\",\"\",DATA_SISWA!A534)","v":""},{"$f":"IF(DATA_SISWA!B534=\"\",\"\",DATA_SISWA!B534)","v":""}]
[{"$f":"IF(DATA_SISWA!A535=\"\",\"\",DATA_SISWA!A535)","v":""},{"$f":"IF(DATA_SISWA!B535=\"\",\"\",DATA_SISWA!B535)","v":""}]
[{"$f":"IF(DATA_SISWA!A536=\"\",\"\",DATA_SISWA!A536)","v":""},{"$f":"IF(DATA_SISWA!B536=\"\",\"\",DATA_SISWA!B536)","v":""}]
[{"$f":"IF(DATA_SISWA!A537=\"\",\"\",DATA_SISWA!A537)","v":""},{"$f":"IF(DATA_SISWA!B537=\"\",\"\",DATA_SISWA!B537)","v":""}]
[{"$f":"IF(DATA_SISWA!A538=\"\",\"\",DATA_SISWA!A538)","v":""},{"$f":"IF(DATA_SISWA!B538=\"\",\"\",DATA_SISWA!B538)","v":""}]
[{"$f":"IF(DATA_SISWA!A539=\"\",\"\",DATA_SISWA!A539)","v":""},{"$f":"IF(DATA_SISWA!B539=\"\",\"\",DATA_SISWA!B539)","v":""}]
[{"$f":"IF(DATA_SISWA!A540=\"\",\"\",DATA_SISWA!A540)","v":""},{"$f":"IF(DATA_SISWA!B540=\"\",\"\",DATA_SISWA!B540)","v":""}]
[{"$f":"IF(DATA_SISWA!A541=\"\",\"\",DATA_SISWA!A541)","v":""},{"$f":"IF(DATA_SISWA!B541=\"\",\"\",DATA_SISWA!B541)","v":""}]
[{"$f":"IF(DATA_SISWA!A542=\"\",\"\",DATA_SISWA!A542)","v":""},{"$f":"IF(DATA_SISWA!B542=\"\",\"\",DATA_SISWA!B542)","v":""}]
[{"$f":"IF(DATA_SISWA!A543=\"\",\"\",DATA_SISWA!A543)","v":""},{"$f":"IF(DATA_SISWA!B543=\"\",\"\",DATA_SISWA!B543)","v":""}]
[{"$f":"IF(DATA_SISWA!A544=\"\",\"\",DATA_SISWA!A544)","v":""},{"$f":"IF(DATA_SISWA!B544=\"\",\"\",DATA_SISWA!B544)","v":""}]
[{"$f":"IF(DATA_SISWA!A545=\"\",\"\",DATA_SISWA!A545)","v":""},{"$f":"IF(DATA_SISWA!B545=\"\",\"\",DATA_SISWA!B545)","v":""}]
[{"$f":"IF(DATA_SISWA!A546=\"\",\"\",DATA_SISWA!A546)","v":""},{"$f":"IF(DATA_SISWA!B546=\"\",\"\",DATA_SISWA!B546)","v":""}]
[{"$f":"IF(DATA_SISWA!A547=\"\",\"\",DATA_SISWA!A547)","v":""},{"$f":"IF(DATA_SISWA!B547=\"\",\"\",DATA_SISWA!B547)","v":""}]
[{"$f":"IF(DATA_SISWA!A548=\"\",\"\",DATA_SISWA!A548)","v":""},{"$f":"IF(DATA_SISWA!B548=\"\",\"\",DATA_SISWA!B548)","v":""}]
[{"$f":"IF(DATA_SISWA!A549=\"\",\"\",DATA_SISWA!A549)","v":""},{"$f":"IF(DATA_SISWA!B549=\"\",\"\",DATA_SISWA!B549)","v":""}]
[{"$f":"IF(DATA_SISWA!A550=\"\",\"\",DATA_SISWA!A550)","v":""},{"$f":"IF(DATA_SISWA!B550=\"\",\"\",DATA_SISWA!B550)","v":""}]
[{"$f":"IF(DATA_SISWA!A551=\"\",\"\",DATA_SISWA!A551)","v":""},{"$f":"IF(DATA_SISWA!B551=\"\",\"\",DATA_SISWA!B551)","v":""}]
[{"$f":"IF(DATA_SISWA!A552=\"\",\"\",DATA_SISWA!A552)","v":""},{"$f":"IF(DATA_SISWA!B552=\"\",\"\",DATA_SISWA!B552)","v":""}]
[{"$f":"IF(DATA_SISWA!A553=\"\",\"\",DATA_SISWA!A553)","v":""},{"$f":"IF(DATA_SISWA!B553=\"\",\"\",DATA_SISWA!B553)","v":""}]
[{"$f":"IF(DATA_SISWA!A554=\"\",\"\",DATA_SISWA!A554)","v":""},{"$f":"IF(DATA_SISWA!B554=\"\",\"\",DATA_SISWA!B554)","v":""}]
[{"$f":"IF(DATA_SISWA!A555=\"\",\"\",DATA_SISWA!A555)","v":""},{"$f":"IF(DATA_SISWA!B555=\"\",\"\",DATA_SISWA!B555)","v":""}]
[{"$f":"IF(DATA_SISWA!A556=\"\",\"\",DATA_SISWA!A556)","v":""},{"$f":"IF(DATA_SISWA!B556=\"\",\"\",DATA_SISWA!B556)","v":""}]
[{"$f":"IF(DATA_SISWA!A557=\"\",\"\",DATA_SISWA!A557)","v":""},{"$f":"IF(DATA_SISWA!B557=\"\",\"\",DATA_SISWA!B557)","v":""}]
[{"$f":"IF(DATA_SISWA!A558=\"\",\"\",DATA_SISWA!A558)","v":""},{"$f":"IF(DATA_SISWA!B558=\"\",\"\",DATA_SISWA!B558)","v":""}]
[{"$f":"IF(DATA_SISWA!A559=\"\",\"\",DATA_SISWA!A559)","v":""},{"$f":"IF(DATA_SISWA!B559=\"\",\"\",DATA_SISWA!B559)","v":""}]
[{"$f":"IF(DATA_SISWA!A560=\"\",\"\",DATA_SISWA!A560)","v":""},{"$f":"IF(DATA_SISWA!B560=\"\",\"\",DATA_SISWA!B560)","v":""}]
[{"$f":"IF(DATA_SISWA!A561=\"\",\"\",DATA_SISWA!A561)","v":""},{"$f":"IF(DATA_SISWA!B561=\"\",\"\",DATA_SISWA!B561)","v":""}]
[{"$f":"IF(DATA_SISWA!A562=\"\",\"\",DATA_SISWA!A562)","v":""},{"$f":"IF(DATA_SISWA!B562=\"\",\"\",DATA_SISWA!B562)","v":""}]
[{"$f":"IF(DATA_SISWA!A563=\"\",\"\",DATA_SISWA!A563)","v":""},{"$f":"IF(DATA_SISWA!B563=\"\",\"\",DATA_SISWA!B563)","v":""}]
[{"$f":"IF(DATA_SISWA!A564=\"\",\"\",DATA_SISWA!A564)","v":""},{"$f":"IF(DATA_SISWA!B564=\"\",\"\",DATA_SISWA!B564)","v":""}]
[{"$f":"IF(DATA_SISWA!A565=\"\",\"\",DATA_SISWA!A565)","v":""},{"$f":"IF(DATA_SISWA!B565=\"\",\"\",DATA_SISWA!B565)","v":""}]
[{"$f":"IF(DATA_SISWA!A566=\"\",\"\",DATA_SISWA!A566)","v":""},{"$f":"IF(DATA_SISWA!B566=\"\",\"\",DATA_SISWA!B566)","v":""}]
[{"$f":"IF(DATA_SISWA!A567=\"\",\"\",DATA_SISWA!A567)","v":""},{"$f":"IF(DATA_SISWA!B567=\"\",\"\",DATA_SISWA!B567)","v":""}]
[{"$f":"IF(DATA_SISWA!A568=\"\",\"\",DATA_SISWA!A568)","v":""},{"$f":"IF(DATA_SISWA!B568=\"\",\"\",DATA_SISWA!B568)","v":""}]
[{"$f":"IF(DATA_SISWA!A569=\"\",\"\",DATA_SISWA!A569)","v":""},{"$f":"IF(DATA_SISWA!B569=\"\",\"\",DATA_SISWA!B569)","v":""}]
[{"$f":"IF(DATA_SISWA!A570=\"\",\"\",DATA_SISWA!A570)","v":""},{"$f":"IF(DATA_SISWA!B570=\"\",\"\",DATA_SISWA!B570)","v":""}]
[{"$f":"IF(DATA_SISWA!A571=\"\",\"\",DATA_SISWA!A571)","v":""},{"$f":"IF(DATA_SISWA!B571=\"\",\"\",DATA_SISWA!B571)","v":""}]
[{"$f":"IF(DATA_SISWA!A572=\"\",\"\",DATA_SISWA!A572)","v":""},{"$f":"IF(DATA_SISWA!B572=\"\",\"\",DATA_SISWA!B572)","v":""}]
[{"$f":"IF(DATA_SISWA!A573=\"\",\"\",DATA_SISWA!A573)","v":""},{"$f":"IF(DATA_SISWA!B573=\"\",\"\",DATA_SISWA!B573)","v":""}]
[{"$f":"IF(DATA_SISWA!A574=\"\",\"\",DATA_SISWA!A574)","v":""},{"$f":"IF(DATA_SISWA!B574=\"\",\"\",DATA_SISWA!B574)","v":""}]
[{"$f":"IF(DATA_SISWA!A575=\"\",\"\",DATA_SISWA!A575)","v":""},{"$f":"IF(DATA_SISWA!B575=\"\",\"\",DATA_SISWA!B575)","v":""}]
[{"$f":"IF(DATA_SISWA!A576=\"\",\"\",DATA_SISWA!A576)","v":""},{"$f":"IF(DATA_SISWA!B576=\"\",\"\",DATA_SISWA!B576)","v":""}]
[{"$f":"IF(DATA_SISWA!A577=\"\",\"\",DATA_SISWA!A577)","v":""},{"$f":"IF(DATA_SISWA!B577=\"\",\"\",DATA_SISWA!B577)","v":""}]
[{"$f":"IF(DATA_SISWA!A578=\"\",\"\",DATA_SISWA!A578)","v":""},{"$f":"IF(DATA_SISWA!B578=\"\",\"\",DATA_SISWA!B578)","v":""}]
[{"$f":"IF(DATA_SISWA!A579=\"\",\"\",DATA_SISWA!A579)","v":""},{"$f":"IF(DATA_SISWA!B579=\"\",\"\",DATA_SISWA!B579)","v":""}]
[{"$f":"IF(DATA_SISWA!A580=\"\",\"\",DATA_SISWA!A580)","v":""},{"$f":"IF(DATA_SISWA!B580=\"\",\"\",DATA_SISWA!B580)","v":""}]
[{"$f":"IF(DATA_SISWA!A581=\"\",\"\",DATA_SISWA!A581)","v":""},{"$f":"IF(DATA_SISWA!B581=\"\",\"\",DATA_SISWA!B581)","v":""}]
[{"$f":"IF(DATA_SISWA!A582=\"\",\"\",DATA_SISWA!A582)","v":""},{"$f":"IF(DATA_SISWA!B582=\"\",\"\",DATA_SISWA!B582)","v":""}]
[{"$f":"IF(DATA_SISWA!A583=\"\",\"\",DATA_SISWA!A583)","v":""},{"$f":"IF(DATA_SISWA!B583=\"\",\"\",DATA_SISWA!B583)","v":""}]
[{"$f":"IF(DATA_SISWA!A584=\"\",\"\",DATA_SISWA!A584)","v":""},{"$f":"IF(DATA_SISWA!B584=\"\",\"\",DATA_SISWA!B584)","v":""}]
[{"$f":"IF(DATA_SISWA!A585=\"\",\"\",DATA_SISWA!A585)","v":""},{"$f":"IF(DATA_SISWA!B585=\"\",\"\",DATA_SISWA!B585)","v":""}]
[{"$f":"IF(DATA_SISWA!A586=\"\",\"\",DATA_SISWA!A586)","v":""},{"$f":"IF(DATA_SISWA!B586=\"\",\"\",DATA_SISWA!B586)","v":""}]
[{"$f":"IF(DATA_SISWA!A587=\"\",\"\",DATA_SISWA!A587)","v":""},{"$f":"IF(DATA_SISWA!B587=\"\",\"\",DATA_SISWA!B587)","v":""}]
[{"$f":"IF(DATA_SISWA!A588=\"\",\"\",DATA_SISWA!A588)","v":""},{"$f":"IF(DATA_SISWA!B588=\"\",\"\",DATA_SISWA!B588)","v":""}]
[{"$f":"IF(DATA_SISWA!A589=\"\",\"\",DATA_SISWA!A589)","v":""},{"$f":"IF(DATA_SISWA!B589=\"\",\"\",DATA_SISWA!B589)","v":""}]
[{"$f":"IF(DATA_SISWA!A590=\"\",\"\",DATA_SISWA!A590)","v":""},{"$f":"IF(DATA_SISWA!B590=\"\",\"\",DATA_SISWA!B590)","v":""}]
[{"$f":"IF(DATA_SISWA!A591=\"\",\"\",DATA_SISWA!A591)","v":""},{"$f":"IF(DATA_SISWA!B591=\"\",\"\",DATA_SISWA!B591)","v":""}]
[{"$f":"IF(DATA_SISWA!A592=\"\",\"\",DATA_SISWA!A592)","v":""},{"$f":"IF(DATA_SISWA!B592=\"\",\"\",DATA_SISWA!B592)","v":""}]
[{"$f":"IF(DATA_SISWA!A593=\"\",\"\",DATA_SISWA!A593)","v":""},{"$f":"IF(DATA_SISWA!B593=\"\",\"\",DATA_SISWA!B593)","v":""}]
[{"$f":"IF(DATA_SISWA!A594=\"\",\"\",DATA_SISWA!A594)","v":""},{"$f":"IF(DATA_SISWA!B594=\"\",\"\",DATA_SISWA!B594)","v":""}]
[{"$f":"IF(DATA_SISWA!A595=\"\",\"\",DATA_SISWA!A595)","v":""},{"$f":"IF(DATA_SISWA!B595=\"\",\"\",DATA_SISWA!B595)","v":""}]
[{"$f":"IF(DATA_SISWA!A596=\"\",\"\",DATA_SISWA!A596)","v":""},{"$f":"IF(DATA_SISWA!B596=\"\",\"\",DATA_SISWA!B596)","v":""}]
[{"$f":"IF(DATA_SISWA!A597=\"\",\"\",DATA_SISWA!A597)","v":""},{"$f":"IF(DATA_SISWA!B597=\"\",\"\",DATA_SISWA!B597)","v":""}]
[{"$f":"IF(DATA_SISWA!A598=\"\",\"\",DATA_SISWA!A598)","v":""},{"$f":"IF(DATA_SISWA!B598=\"\",\"\",DATA_SISWA!B598)","v":""}]
[{"$f":"IF(DATA_SISWA!A599=\"\",\"\",DATA_SISWA!A599)","v":""},{"$f":"IF(DATA_SISWA!B599=\"\",\"\",DATA_SISWA!B599)","v":""}]
[{"$f":"IF(DATA_SISWA!A600=\"\",\"\",DATA_SISWA!A600)","v":""},{"$f":"IF(DATA_SISWA!B600=\"\",\"\",DATA_SISWA!B600)","v":""}]
[{"$f":"IF(DATA_SISWA!A601=\"\",\"\",DATA_SISWA!A601)","v":""},{"$f":"IF(DATA_SISWA!B601=\"\",\"\",DATA_SISWA!B601)","v":""}]
[{"$f":"IF(DATA_SISWA!A602=\"\",\"\",DATA_SISWA!A602)","v":""},{"$f":"IF(DATA_SISWA!B602=\"\",\"\",DATA_SISWA!B602)","v":""}]
[{"$f":"IF(DATA_SISWA!A603=\"\",\"\",DATA_SISWA!A603)","v":""},{"$f":"IF(DATA_SISWA!B603=\"\",\"\",DATA_SISWA!B603)","v":""}]
[{"$f":"IF(DATA_SISWA!A604=\"\",\"\",DATA_SISWA!A604)","v":""},{"$f":"IF(DATA_SISWA!B604=\"\",\"\",DATA_SISWA!B604)","v":""}]
[{"$f":"IF(DATA_SISWA!A605=\"\",\"\",DATA_SISWA!A605)","v":""},{"$f":"IF(DATA_SISWA!B605=\"\",\"\",DATA_SISWA!B605)","v":""}]
[{"$f":"IF(DATA_SISWA!A606=\"\",\"\",DATA_SISWA!A606)","v":""},{"$f":"IF(DATA_SISWA!B606=\"\",\"\",DATA_SISWA!B606)","v":""}]
[{"$f":"IF(DATA_SISWA!A607=\"\",\"\",DATA_SISWA!A607)","v":""},{"$f":"IF(DATA_SISWA!B607=\"\",\"\",DATA_SISWA!B607)","v":""}]
[{"$f":"IF(DATA_SISWA!A608=\"\",\"\",DATA_SISWA!A608)","v":""},{"$f":"IF(DATA_SISWA!B608=\"\",\"\",DATA_SISWA!B608)","v":""}]
[{"$f":"IF(DATA_SISWA!A609=\"\",\"\",DATA_SISWA!A609)","v":""},{"$f":"IF(DATA_SISWA!B609=\"\",\"\",DATA_SISWA!B609)","v":""}]
[{"$f":"IF(DATA_SISWA!A610=\"\",\"\",DATA_SISWA!A610)","v":""},{"$f":"IF(DATA_SISWA!B610=\"\",\"\",DATA_SISWA!B610)","v":""}]
[{"$f":"IF(DATA_SISWA!A611=\"\",\"\",DATA_SISWA!A611)","v":""},{"$f":"IF(DATA_SISWA!B611=\"\",\"\",DATA_SISWA!B611)","v":""}]
[{"$f":"IF(DATA_SISWA!A612=\"\",\"\",DATA_SISWA!A612)","v":""},{"$f":"IF(DATA_SISWA!B612=\"\",\"\",DATA_SISWA!B612)","v":""}]
[{"$f":"IF(DATA_SISWA!A613=\"\",\"\",DATA_SISWA!A613)","v":""},{"$f":"IF(DATA_SISWA!B613=\"\",\"\",DATA_SISWA!B613)","v":""}]
[{"$f":"IF(DATA_SISWA!A614=\"\",\"\",DATA_SISWA!A614)","v":""},{"$f":"IF(DATA_SISWA!B614=\"\",\"\",DATA_SISWA!B614)","v":""}]
[{"$f":"IF(DATA_SISWA!A615=\"\",\"\",DATA_SISWA!A615)","v":""},{"$f":"IF(DATA_SISWA!B615=\"\",\"\",DATA_SISWA!B615)","v":""}]
[{"$f":"IF(DATA_SISWA!A616=\"\",\"\",DATA_SISWA!A616)","v":""},{"$f":"IF(DATA_SISWA!B616=\"\",\"\",DATA_SISWA!B616)","v":""}]
[{"$f":"IF(DATA_SISWA!A617=\"\",\"\",DATA_SISWA!A617)","v":""},{"$f":"IF(DATA_SISWA!B617=\"\",\"\",DATA_SISWA!B617)","v":""}]
[{"$f":"IF(DATA_SISWA!A618=\"\",\"\",DATA_SISWA!A618)","v":""},{"$f":"IF(DATA_SISWA!B618=\"\",\"\",DATA_SISWA!B618)","v":""}]
[{"$f":"IF(DATA_SISWA!A619=\"\",\"\",DATA_SISWA!A619)","v":""},{"$f":"IF(DATA_SISWA!B619=\"\",\"\",DATA_SISWA!B619)","v":""}]
[{"$f":"IF(DATA_SISWA!A620=\"\",\"\",DATA_SISWA!A620)","v":""},{"$f":"IF(DATA_SISWA!B620=\"\",\"\",DATA_SISWA!B620)","v":""}]
[{"$f":"IF(DATA_SISWA!A621=\"\",\"\",DATA_SISWA!A621)","v":""},{"$f":"IF(DATA_SISWA!B621=\"\",\"\",DATA_SISWA!B621)","v":""}]
[{"$f":"IF(DATA_SISWA!A622=\"\",\"\",DATA_SISWA!A622)","v":""},{"$f":"IF(DATA_SISWA!B622=\"\",\"\",DATA_SISWA!B622)","v":""}]
[{"$f":"IF(DATA_SISWA!A623=\"\",\"\",DATA_SISWA!A623)","v":""},{"$f":"IF(DATA_SISWA!B623=\"\",\"\",DATA_SISWA!B623)","v":""}]
[{"$f":"IF(DATA_SISWA!A624=\"\",\"\",DATA_SISWA!A624)","v":""},{"$f":"IF(DATA_SISWA!B624=\"\",\"\",DATA_SISWA!B624)","v":""}]
[{"$f":"IF(DATA_SISWA!A625=\"\",\"\",DATA_SISWA!A625)","v":""},{"$f":"IF(DATA_SISWA!B625=\"\",\"\",DATA_SISWA!B625)","v":""}]
[{"$f":"IF(DATA_SISWA!A626=\"\",\"\",DATA_SISWA!A626)","v":""},{"$f":"IF(DATA_SISWA!B626=\"\",\"\",DATA_SISWA!B626)","v":""}]
[{"$f":"IF(DATA_SISWA!A627=\"\",\"\",DATA_SISWA!A627)","v":""},{"$f":"IF(DATA_SISWA!B627=\"\",\"\",DATA_SISWA!B627)","v":""}]
[{"$f":"IF(DATA_SISWA!A628=\"\",\"\",DATA_SISWA!A628)","v":""},{"$f":"IF(DATA_SISWA!B628=\"\",\"\",DATA_SISWA!B628)","v":""}]
[{"$f":"IF(DATA_SISWA!A629=\"\",\"\",DATA_SISWA!A629)","v":""},{"$f":"IF(DATA_SISWA!B629=\"\",\"\",DATA_SISWA!B629)","v":""}]
[{"$f":"IF(DATA_SISWA!A630=\"\",\"\",DATA_SISWA!A630)","v":""},{"$f":"IF(DATA_SISWA!B630=\"\",\"\",DATA_SISWA!B630)","v":""}]
[{"$f":"IF(DATA_SISWA!A631=\"\",\"\",DATA_SISWA!A631)","v":""},{"$f":"IF(DATA_SISWA!B631=\"\",\"\",DATA_SISWA!B631)","v":""}]
[{"$f":"IF(DATA_SISWA!A632=\"\",\"\",DATA_SISWA!A632)","v":""},{"$f":"IF(DATA_SISWA!B632=\"\",\"\",DATA_SISWA!B632)","v":""}]
[{"$f":"IF(DATA_SISWA!A633=\"\",\"\",DATA_SISWA!A633)","v":""},{"$f":"IF(DATA_SISWA!B633=\"\",\"\",DATA_SISWA!B633)","v":""}]
[{"$f":"IF(DATA_SISWA!A634=\"\",\"\",DATA_SISWA!A634)","v":""},{"$f":"IF(DATA_SISWA!B634=\"\",\"\",DATA_SISWA!B634)","v":""}]
[{"$f":"IF(DATA_SISWA!A635=\"\",\"\",DATA_SISWA!A635)","v":""},{"$f":"IF(DATA_SISWA!B635=\"\",\"\",DATA_SISWA!B635)","v":""}]
[{"$f":"IF(DATA_SISWA!A636=\"\",\"\",DATA_SISWA!A636)","v":""},{"$f":"IF(DATA_SISWA!B636=\"\",\"\",DATA_SISWA!B636)","v":""}]
[{"$f":"IF(DATA_SISWA!A637=\"\",\"\",DATA_SISWA!A637)","v":""},{"$f":"IF(DATA_SISWA!B637=\"\",\"\",DATA_SISWA!B637)","v":""}]
[{"$f":"IF(DATA_SISWA!A638=\"\",\"\",DATA_SISWA!A638)","v":""},{"$f":"IF(DATA_SISWA!B638=\"\",\"\",DATA_SISWA!B638)","v":""}]
[{"$f":"IF(DATA_SISWA!A639=\"\",\"\",DATA_SISWA!A639)","v":""},{"$f":"IF(DATA_SISWA!B639=\"\",\"\",DATA_SISWA!B639)","v":""}]
[{"$f":"IF(DATA_SISWA!A640=\"\",\"\",DATA_SISWA!A640)","v":""},{"$f":"IF(DATA_SISWA!B640=\"\",\"\",DATA_SISWA!B640)","v":""}]
[{"$f":"IF(DATA_SISWA!A641=\"\",\"\",DATA_SISWA!A641)","v":""},{"$f":"IF(DATA_SISWA!B641=\"\",\"\",DATA_SISWA!B641)","v":""}]
[{"$f":"IF(DATA_SISWA!A642=\"\",\"\",DATA_SISWA!A642)","v":""},{"$f":"IF(DATA_SISWA!B642=\"\",\"\",DATA_SISWA!B642)","v":""}]
[{"$f":"IF(DATA_SISWA!A643=\"\",\"\",DATA_SISWA!A643)","v":""},{"$f":"IF(DATA_SISWA!B643=\"\",\"\",DATA_SISWA!B643)","v":""}]
[{"$f":"IF(DATA_SISWA!A644=\"\",\"\",DATA_SISWA!A644)","v":""},{"$f":"IF(DATA_SISWA!B644=\"\",\"\",DATA_SISWA!B644)","v":""}]
[{"$f":"IF(DATA_SISWA!A645=\"\",\"\",DATA_SISWA!A645)","v":""},{"$f":"IF(DATA_SISWA!B645=\"\",\"\",DATA_SISWA!B645)","v":""}]
[{"$f":"IF(DATA_SISWA!A646=\"\",\"\",DATA_SISWA!A646)","v":""},{"$f":"IF(DATA_SISWA!B646=\"\",\"\",DATA_SISWA!B646)","v":""}]
[{"$f":"IF(DATA_SISWA!A647=\"\",\"\",DATA_SISWA!A647)","v":""},{"$f":"IF(DATA_SISWA!B647=\"\",\"\",DATA_SISWA!B647)","v":""}]
[{"$f":"IF(DATA_SISWA!A648=\"\",\"\",DATA_SISWA!A648)","v":""},{"$f":"IF(DATA_SISWA!B648=\"\",\"\",DATA_SISWA!B648)","v":""}]
[{"$f":"IF(DATA_SISWA!A649=\"\",\"\",DATA_SISWA!A649)","v":""},{"$f":"IF(DATA_SISWA!B649=\"\",\"\",DATA_SISWA!B649)","v":""}]
[{"$f":"IF(DATA_SISWA!A650=\"\",\"\",DATA_SISWA!A650)","v":""},{"$f":"IF(DATA_SISWA!B650=\"\",\"\",DATA_SISWA!B650)","v":""}]
[{"$f":"IF(DATA_SISWA!A651=\"\",\"\",DATA_SISWA!A651)","v":""},{"$f":"IF(DATA_SISWA!B651=\"\",\"\",DATA_SISWA!B651)","v":""}]
[{"$f":"IF(DATA_SISWA!A652=\"\",\"\",DATA_SISWA!A652)","v":""},{"$f":"IF(DATA_SISWA!B652=\"\",\"\",DATA_SISWA!B652)","v":""}]
[{"$f":"IF(DATA_SISWA!A653=\"\",\"\",DATA_SISWA!A653)","v":""},{"$f":"IF(DATA_SISWA!B653=\"\",\"\",DATA_SISWA!B653)","v":""}]
[{"$f":"IF(DATA_SISWA!A654=\"\",\"\",DATA_SISWA!A654)","v":""},{"$f":"IF(DATA_SISWA!B654=\"\",\"\",DATA_SISWA!B654)","v":""}]
[{"$f":"IF(DATA_SISWA!A655=\"\",\"\",DATA_SISWA!A655)","v":""},{"$f":"IF(DATA_SISWA!B655=\"\",\"\",DATA_SISWA!B655)","v":""}]
[{"$f":"IF(DATA_SISWA!A656=\"\",\"\",DATA_SISWA!A656)","v":""},{"$f":"IF(DATA_SISWA!B656=\"\",\"\",DATA_SISWA!B656)","v":""}]
[{"$f":"IF(DATA_SISWA!A657=\"\",\"\",DATA_SISWA!A657)","v":""},{"$f":"IF(DATA_SISWA!B657=\"\",\"\",DATA_SISWA!B657)","v":""}]
[{"$f":"IF(DATA_SISWA!A658=\"\",\"\",DATA_SISWA!A658)","v":""},{"$f":"IF(DATA_SISWA!B658=\"\",\"\",DATA_SISWA!B658)","v":""}]
[{"$f":"IF(DATA_SISWA!A659=\"\",\"\",DATA_SISWA!A659)","v":""},{"$f":"IF(DATA_SISWA!B659=\"\",\"\",DATA_SISWA!B659)","v":""}]
[{"$f":"IF(DATA_SISWA!A660=\"\",\"\",DATA_SISWA!A660)","v":""},{"$f":"IF(DATA_SISWA!B660=\"\",\"\",DATA_SISWA!B660)","v":""}]
[{"$f":"IF(DATA_SISWA!A661=\"\",\"\",DATA_SISWA!A661)","v":""},{"$f":"IF(DATA_SISWA!B661=\"\",\"\",DATA_SISWA!B661)","v":""}]
[{"$f":"IF(DATA_SISWA!A662=\"\",\"\",DATA_SISWA!A662)","v":""},{"$f":"IF(DATA_SISWA!B662=\"\",\"\",DATA_SISWA!B662)","v":""}]
[{"$f":"IF(DATA_SISWA!A663=\"\",\"\",DATA_SISWA!A663)","v":""},{"$f":"IF(DATA_SISWA!B663=\"\",\"\",DATA_SISWA!B663)","v":""}]
[{"$f":"IF(DATA_SISWA!A664=\"\",\"\",DATA_SISWA!A664)","v":""},{"$f":"IF(DATA_SISWA!B664=\"\",\"\",DATA_SISWA!B664)","v":""}]
[{"$f":"IF(DATA_SISWA!A665=\"\",\"\",DATA_SISWA!A665)","v":""},{"$f":"IF(DATA_SISWA!B665=\"\",\"\",DATA_SISWA!B665)","v":""}]
[{"$f":"IF(DATA_SISWA!A666=\"\",\"\",DATA_SISWA!A666)","v":""},{"$f":"IF(DATA_SISWA!B666=\"\",\"\",DATA_SISWA!B666)","v":""}]
[{"$f":"IF(DATA_SISWA!A667=\"\",\"\",DATA_SISWA!A667)","v":""},{"$f":"IF(DATA_SISWA!B667=\"\",\"\",DATA_SISWA!B667)","v":""}]
[{"$f":"IF(DATA_SISWA!A668=\"\",\"\",DATA_SISWA!A668)","v":""},{"$f":"IF(DATA_SISWA!B668=\"\",\"\",DATA_SISWA!B668)","v":""}]
[{"$f":"IF(DATA_SISWA!A669=\"\",\"\",DATA_SISWA!A669)","v":""},{"$f":"IF(DATA_SISWA!B669=\"\",\"\",DATA_SISWA!B669)","v":""}]
[{"$f":"IF(DATA_SISWA!A670=\"\",\"\",DATA_SISWA!A670)","v":""},{"$f":"IF(DATA_SISWA!B670=\"\",\"\",DATA_SISWA!B670)","v":""}]
[{"$f":"IF(DATA_SISWA!A671=\"\",\"\",DATA_SISWA!A671)","v":""},{"$f":"IF(DATA_SISWA!B671=\"\",\"\",DATA_SISWA!B671)","v":""}]
[{"$f":"IF(DATA_SISWA!A672=\"\",\"\",DATA_SISWA!A672)","v":""},{"$f":"IF(DATA_SISWA!B672=\"\",\"\",DATA_SISWA!B672)","v":""}]
[{"$f":"IF(DATA_SISWA!A673=\"\",\"\",DATA_SISWA!A673)","v":""},{"$f":"IF(DATA_SISWA!B673=\"\",\"\",DATA_SISWA!B673)","v":""}]
[{"$f":"IF(DATA_SISWA!A674=\"\",\"\",DATA_SISWA!A674)","v":""},{"$f":"IF(DATA_SISWA!B674=\"\",\"\",DATA_SISWA!B674)","v":""}]
[{"$f":"IF(DATA_SISWA!A675=\"\",\"\",DATA_SISWA!A675)","v":""},{"$f":"IF(DATA_SISWA!B675=\"\",\"\",DATA_SISWA!B675)","v":""}]
[{"$f":"IF(DATA_SISWA!A676=\"\",\"\",DATA_SISWA!A676)","v":""},{"$f":"IF(DATA_SISWA!B676=\"\",\"\",DATA_SISWA!B676)","v":""}]
[{"$f":"IF(DATA_SISWA!A677=\"\",\"\",DATA_SISWA!A677)","v":""},{"$f":"IF(DATA_SISWA!B677=\"\",\"\",DATA_SISWA!B677)","v":""}]
[{"$f":"IF(DATA_SISWA!A678=\"\",\"\",DATA_SISWA!A678)","v":""},{"$f":"IF(DATA_SISWA!B678=\"\",\"\",DATA_SISWA!B678)","v":""}]
[{"$f":"IF(DATA_SISWA!A679=\"\",\"\",DATA_SISWA!A679)","v":""},{"$f":"IF(DATA_SISWA!B679=\"\",\"\",DATA_SISWA!B679)","v":""}]
[{"$f":"IF(DATA_SISWA!A680=\"\",\"\",DATA_SISWA!A680)","v":""},{"$f":"IF(DATA_SISWA!B680=\"\",\"\",DATA_SISWA!B680)","v":""}]
[{"$f":"IF(DATA_SISWA!A681=\"\",\"\",DATA_SISWA!A681)","v":""},{"$f":"IF(DATA_SISWA!B681=\"\",\"\",DATA_SISWA!B681)","v":""}]
[{"$f":"IF(DATA_SISWA!A682=\"\",\"\",DATA_SISWA!A682)","v":""},{"$f":"IF(DATA_SISWA!B682=\"\",\"\",DATA_SISWA!B682)","v":""}]
[{"$f":"IF(DATA_SISWA!A683=\"\",\"\",DATA_SISWA!A683)","v":""},{"$f":"IF(DATA_SISWA!B683=\"\",\"\",DATA_SISWA!B683)","v":""}]
[{"$f":"IF(DATA_SISWA!A684=\"\",\"\",DATA_SISWA!A684)","v":""},{"$f":"IF(DATA_SISWA!B684=\"\",\"\",DATA_SISWA!B684)","v":""}]
[{"$f":"IF(DATA_SISWA!A685=\"\",\"\",DATA_SISWA!A685)","v":""},{"$f":"IF(DATA_SISWA!B685=\"\",\"\",DATA_SISWA!B685)","v":""}]
[{"$f":"IF(DATA_SISWA!A686=\"\",\"\",DATA_SISWA!A686)","v":""},{"$f":"IF(DATA_SISWA!B686=\"\",\"\",DATA_SISWA!B686)","v":""}]
[{"$f":"IF(DATA_SISWA!A687=\"\",\"\",DATA_SISWA!A687)","v":""},{"$f":"IF(DATA_SISWA!B687=\"\",\"\",DATA_SISWA!B687)","v":""}]
[{"$f":"IF(DATA_SISWA!A688=\"\",\"\",DATA_SISWA!A688)","v":""},{"$f":"IF(DATA_SISWA!B688=\"\",\"\",DATA_SISWA!B688)","v":""}]
[{"$f":"IF(DATA_SISWA!A689=\"\",\"\",DATA_SISWA!A689)","v":""},{"$f":"IF(DATA_SISWA!B689=\"\",\"\",DATA_SISWA!B689)","v":""}]
[{"$f":"IF(DATA_SISWA!A690=\"\",\"\",DATA_SISWA!A690)","v":""},{"$f":"IF(DATA_SISWA!B690=\"\",\"\",DATA_SISWA!B690)","v":""}]
[{"$f":"IF(DATA_SISWA!A691=\"\",\"\",DATA_SISWA!A691)","v":""},{"$f":"IF(DATA_SISWA!B691=\"\",\"\",DATA_SISWA!B691)","v":""}]
[{"$f":"IF(DATA_SISWA!A692=\"\",\"\",DATA_SISWA!A692)","v":""},{"$f":"IF(DATA_SISWA!B692=\"\",\"\",DATA_SISWA!B692)","v":""}]
[{"$f":"IF(DATA_SISWA!A693=\"\",\"\",DATA_SISWA!A693)","v":""},{"$f":"IF(DATA_SISWA!B693=\"\",\"\",DATA_SISWA!B693)","v":""}]
[{"$f":"IF(DATA_SISWA!A694=\"\",\"\",DATA_SISWA!A694)","v":""},{"$f":"IF(DATA_SISWA!B694=\"\",\"\",DATA_SISWA!B694)","v":""}]
[{"$f":"IF(DATA_SISWA!A695=\"\",\"\",DATA_SISWA!A695)","v":""},{"$f":"IF(DATA_SISWA!B695=\"\",\"\",DATA_SISWA!B695)","v":""}]
[{"$f":"IF(DATA_SISWA!A696=\"\",\"\",DATA_SISWA!A696)","v":""},{"$f":"IF(DATA_SISWA!B696=\"\",\"\",DATA_SISWA!B696)","v":""}]
[{"$f":"IF(DATA_SISWA!A697=\"\",\"\",DATA_SISWA!A697)","v":""},{"$f":"IF(DATA_SISWA!B697=\"\",\"\",DATA_SISWA!B697)","v":""}]
[{"$f":"IF(DATA_SISWA!A698=\"\",\"\",DATA_SISWA!A698)","v":""},{"$f":"IF(DATA_SISWA!B698=\"\",\"\",DATA_SISWA!B698)","v":""}]
[{"$f":"IF(DATA_SISWA!A699=\"\",\"\",DATA_SISWA!A699)","v":""},{"$f":"IF(DATA_SISWA!B699=\"\",\"\",DATA_SISWA!B699)","v":""}]
[{"$f":"IF(DATA_SISWA!A700=\"\",\"\",DATA_SISWA!A700)","v":""},{"$f":"IF(DATA_SISWA!B700=\"\",\"\",DATA_SISWA!B700)","v":""}]
[{"$f":"IF(DATA_SISWA!A701=\"\",\"\",DATA_SISWA!A701)","v":""},{"$f":"IF(DATA_SISWA!B701=\"\",\"\",DATA_SISWA!B701)","v":""}]
[{"$f":"IF(DATA_SISWA!A702=\"\",\"\",DATA_SISWA!A702)","v":""},{"$f":"IF(DATA_SISWA!B702=\"\",\"\",DATA_SISWA!B702)","v":""}]
[{"$f":"IF(DATA_SISWA!A703=\"\",\"\",DATA_SISWA!A703)","v":""},{"$f":"IF(DATA_SISWA!B703=\"\",\"\",DATA_SISWA!B703)","v":""}]
[{"$f":"IF(DATA_SISWA!A704=\"\",\"\",DATA_SISWA!A704)","v":""},{"$f":"IF(DATA_SISWA!B704=\"\",\"\",DATA_SISWA!B704)","v":""}]
[{"$f":"IF(DATA_SISWA!A705=\"\",\"\",DATA_SISWA!A705)","v":""},{"$f":"IF(DATA_SISWA!B705=\"\",\"\",DATA_SISWA!B705)","v":""}]
[{"$f":"IF(DATA_SISWA!A706=\"\",\"\",DATA_SISWA!A706)","v":""},{"$f":"IF(DATA_SISWA!B706=\"\",\"\",DATA_SISWA!B706)","v":""}]
[{"$f":"IF(DATA_SISWA!A707=\"\",\"\",DATA_SISWA!A707)","v":""},{"$f":"IF(DATA_SISWA!B707=\"\",\"\",DATA_SISWA!B707)","v":""}]
[{"$f":"IF(DATA_SISWA!A708=\"\",\"\",DATA_SISWA!A708)","v":""},{"$f":"IF(DATA_SISWA!B708=\"\",\"\",DATA_SISWA!B708)","v":""}]
[{"$f":"IF(DATA_SISWA!A709=\"\",\"\",DATA_SISWA!A709)","v":""},{"$f":"IF(DATA_SISWA!B709=\"\",\"\",DATA_SISWA!B709)","v":""}]
[{"$f":"IF(DATA_SISWA!A710=\"\",\"\",DATA_SISWA!A710)","v":""},{"$f":"IF(DATA_SISWA!B710=\"\",\"\",DATA_SISWA!B710)","v":""}]
[{"$f":"IF(DATA_SISWA!A711=\"\",\"\",DATA_SISWA!A711)","v":""},{"$f":"IF(DATA_SISWA!B711=\"\",\"\",DATA_SISWA!B711)","v":""}]
[{"$f":"IF(DATA_SISWA!A712=\"\",\"\",DATA_SISWA!A712)","v":""},{"$f":"IF(DATA_SISWA!B712=\"\",\"\",DATA_SISWA!B712)","v":""}]
[{"$f":"IF(DATA_SISWA!A713=\"\",\"\",DATA_SISWA!A713)","v":""},{"$f":"IF(DATA_SISWA!B713=\"\",\"\",DATA_SISWA!B713)","v":""}]
[{"$f":"IF(DATA_SISWA!A714=\"\",\"\",DATA_SISWA!A714)","v":""},{"$f":"IF(DATA_SISWA!B714=\"\",\"\",DATA_SISWA!B714)","v":""}]
[{"$f":"IF(DATA_SISWA!A715=\"\",\"\",DATA_SISWA!A715)","v":""},{"$f":"IF(DATA_SISWA!B715=\"\",\"\",DATA_SISWA!B715)","v":""}]
[{"$f":"IF(DATA_SISWA!A716=\"\",\"\",DATA_SISWA!A716)","v":""},{"$f":"IF(DATA_SISWA!B716=\"\",\"\",DATA_SISWA!B716)","v":""}]
[{"$f":"IF(DATA_SISWA!A717=\"\",\"\",DATA_SISWA!A717)","v":""},{"$f":"IF(DATA_SISWA!B717=\"\",\"\",DATA_SISWA!B717)","v":""}]
[{"$f":"IF(DATA_SISWA!A718=\"\",\"\",DATA_SISWA!A718)","v":""},{"$f":"IF(DATA_SISWA!B718=\"\",\"\",DATA_SISWA!B718)","v":""}]
[{"$f":"IF(DATA_SISWA!A719=\"\",\"\",DATA_SISWA!A719)","v":""},{"$f":"IF(DATA_SISWA!B719=\"\",\"\",DATA_SISWA!B719)","v":""}]
[{"$f":"IF(DATA_SISWA!A720=\"\",\"\",DATA_SISWA!A720)","v":""},{"$f":"IF(DATA_SISWA!B720=\"\",\"\",DATA_SISWA!B720)","v":""}]
[{"$f":"IF(DATA_SISWA!A721=\"\",\"\",DATA_SISWA!A721)","v":""},{"$f":"IF(DATA_SISWA!B721=\"\",\"\",DATA_SISWA!B721)","v":""}]
[{"$f":"IF(DATA_SISWA!A722=\"\",\"\",DATA_SISWA!A722)","v":""},{"$f":"IF(DATA_SISWA!B722=\"\",\"\",DATA_SISWA!B722)","v":""}]
[{"$f":"IF(DATA_SISWA!A723=\"\",\"\",DATA_SISWA!A723)","v":""},{"$f":"IF(DATA_SISWA!B723=\"\",\"\",DATA_SISWA!B723)","v":""}]
[{"$f":"IF(DATA_SISWA!A724=\"\",\"\",DATA_SISWA!A724)","v":""},{"$f":"IF(DATA_SISWA!B724=\"\",\"\",DATA_SISWA!B724)","v":""}]
[{"$f":"IF(DATA_SISWA!A725=\"\",\"\",DATA_SISWA!A725)","v":""},{"$f":"IF(DATA_SISWA!B725=\"\",\"\",DATA_SISWA!B725)","v":""}]
[{"$f":"IF(DATA_SISWA!A726=\"\",\"\",DATA_SISWA!A726)","v":""},{"$f":"IF(DATA_SISWA!B726=\"\",\"\",DATA_SISWA!B726)","v":""}]
[{"$f":"IF(DATA_SISWA!A727=\"\",\"\",DATA_SISWA!A727)","v":""},{"$f":"IF(DATA_SISWA!B727=\"\",\"\",DATA_SISWA!B727)","v":""}]
[{"$f":"IF(DATA_SISWA!A728=\"\",\"\",DATA_SISWA!A728)","v":""},{"$f":"IF(DATA_SISWA!B728=\"\",\"\",DATA_SISWA!B728)","v":""}]
[{"$f":"IF(DATA_SISWA!A729=\"\",\"\",DATA_SISWA!A729)","v":""},{"$f":"IF(DATA_SISWA!B729=\"\",\"\",DATA_SISWA!B729)","v":""}]
[{"$f":"IF(DATA_SISWA!A730=\"\",\"\",DATA_SISWA!A730)","v":""},{"$f":"IF(DATA_SISWA!B730=\"\",\"\",DATA_SISWA!B730)","v":""}]
[{"$f":"IF(DATA_SISWA!A731=\"\",\"\",DATA_SISWA!A731)","v":""},{"$f":"IF(DATA_SISWA!B731=\"\",\"\",DATA_SISWA!B731)","v":""}]
[{"$f":"IF(DATA_SISWA!A732=\"\",\"\",DATA_SISWA!A732)","v":""},{"$f":"IF(DATA_SISWA!B732=\"\",\"\",DATA_SISWA!B732)","v":""}]
[{"$f":"IF(DATA_SISWA!A733=\"\",\"\",DATA_SISWA!A733)","v":""},{"$f":"IF(DATA_SISWA!B733=\"\",\"\",DATA_SISWA!B733)","v":""}]
[{"$f":"IF(DATA_SISWA!A734=\"\",\"\",DATA_SISWA!A734)","v":""},{"$f":"IF(DATA_SISWA!B734=\"\",\"\",DATA_SISWA!B734)","v":""}]
[{"$f":"IF(DATA_SISWA!A735=\"\",\"\",DATA_SISWA!A735)","v":""},{"$f":"IF(DATA_SISWA!B735=\"\",\"\",DATA_SISWA!B735)","v":""}]
[{"$f":"IF(DATA_SISWA!A736=\"\",\"\",DATA_SISWA!A736)","v":""},{"$f":"IF(DATA_SISWA!B736=\"\",\"\",DATA_SISWA!B736)","v":""}]
[{"$f":"IF(DATA_SISWA!A737=\"\",\"\",DATA_SISWA!A737)","v":""},{"$f":"IF(DATA_SISWA!B737=\"\",\"\",DATA_SISWA!B737)","v":""}]
[{"$f":"IF(DATA_SISWA!A738=\"\",\"\",DATA_SISWA!A738)","v":""},{"$f":"IF(DATA_SISWA!B738=\"\",\"\",DATA_SISWA!B738)","v":""}]
[{"$f":"IF(DATA_SISWA!A739=\"\",\"\",DATA_SISWA!A739)","v":""},{"$f":"IF(DATA_SISWA!B739=\"\",\"\",DATA_SISWA!B739)","v":""}]
[{"$f":"IF(DATA_SISWA!A740=\"\",\"\",DATA_SISWA!A740)","v":""},{"$f":"IF(DATA_SISWA!B740=\"\",\"\",DATA_SISWA!B740)","v":""}]
[{"$f":"IF(DATA_SISWA!A741=\"\",\"\",DATA_SISWA!A741)","v":""},{"$f":"IF(DATA_SISWA!B741=\"\",\"\",DATA_SISWA!B741)","v":""}]
[{"$f":"IF(DATA_SISWA!A742=\"\",\"\",DATA_SISWA!A742)","v":""},{"$f":"IF(DATA_SISWA!B742=\"\",\"\",DATA_SISWA!B742)","v":""}]
[{"$f":"IF(DATA_SISWA!A743=\"\",\"\",DATA_SISWA!A743)","v":""},{"$f":"IF(DATA_SISWA!B743=\"\",\"\",DATA_SISWA!B743)","v":""}]
[{"$f":"IF(DATA_SISWA!A744=\"\",\"\",DATA_SISWA!A744)","v":""},{"$f":"IF(DATA_SISWA!B744=\"\",\"\",DATA_SISWA!B744)","v":""}]
[{"$f":"IF(DATA_SISWA!A745=\"\",\"\",DATA_SISWA!A745)","v":""},{"$f":"IF(DATA_SISWA!B745=\"\",\"\",DATA_SISWA!B745)","v":""}]
[{"$f":"IF(DATA_SISWA!A746=\"\",\"\",DATA_SISWA!A746)","v":""},{"$f":"IF(DATA_SISWA!B746=\"\",\"\",DATA_SISWA!B746)","v":""}]
[{"$f":"IF(DATA_SISWA!A747=\"\",\"\",DATA_SISWA!A747)","v":""},{"$f":"IF(DATA_SISWA!B747=\"\",\"\",DATA_SISWA!B747)","v":""}]
[{"$f":"IF(DATA_SISWA!A748=\"\",\"\",DATA_SISWA!A748)","v":""},{"$f":"IF(DATA_SISWA!B748=\"\",\"\",DATA_SISWA!B748)","v":""}]
[{"$f":"IF(DATA_SISWA!A749=\"\",\"\",DATA_SISWA!A749)","v":""},{"$f":"IF(DATA_SISWA!B749=\"\",\"\",DATA_SISWA!B749)","v":""}]
[{"$f":"IF(DATA_SISWA!A750=\"\",\"\",DATA_SISWA!A750)","v":""},{"$f":"IF(DATA_SISWA!B750=\"\",\"\",DATA_SISWA!B750)","v":""}]
[{"$f":"IF(DATA_SISWA!A751=\"\",\"\",DATA_SISWA!A751)","v":""},{"$f":"IF(DATA_SISWA!B751=\"\",\"\",DATA_SISWA!B751)","v":""}]
[{"$f":"IF(DATA_SISWA!A752=\"\",\"\",DATA_SISWA!A752)","v":""},{"$f":"IF(DATA_SISWA!B752=\"\",\"\",DATA_SISWA!B752)","v":""}]
[{"$f":"IF(DATA_SISWA!A753=\"\",\"\",DATA_SISWA!A753)","v":""},{"$f":"IF(DATA_SISWA!B753=\"\",\"\",DATA_SISWA!B753)","v":""}]
[{"$f":"IF(DATA_SISWA!A754=\"\",\"\",DATA_SISWA!A754)","v":""},{"$f":"IF(DATA_SISWA!B754=\"\",\"\",DATA_SISWA!B754)","v":""}]
[{"$f":"IF(DATA_SISWA!A755=\"\",\"\",DATA_SISWA!A755)","v":""},{"$f":"IF(DATA_SISWA!B755=\"\",\"\",DATA_SISWA!B755)","v":""}]
[{"$f":"IF(DATA_SISWA!A756=\"\",\"\",DATA_SISWA!A756)","v":""},{"$f":"IF(DATA_SISWA!B756=\"\",\"\",DATA_SISWA!B756)","v":""}]
[{"$f":"IF(DATA_SISWA!A757=\"\",\"\",DATA_SISWA!A757)","v":""},{"$f":"IF(DATA_SISWA!B757=\"\",\"\",DATA_SISWA!B757)","v":""}]
[{"$f":"IF(DATA_SISWA!A758=\"\",\"\",DATA_SISWA!A758)","v":""},{"$f":"IF(DATA_SISWA!B758=\"\",\"\",DATA_SISWA!B758)","v":""}]
[{"$f":"IF(DATA_SISWA!A759=\"\",\"\",DATA_SISWA!A759)","v":""},{"$f":"IF(DATA_SISWA!B759=\"\",\"\",DATA_SISWA!B759)","v":""}]
[{"$f":"IF(DATA_SISWA!A760=\"\",\"\",DATA_SISWA!A760)","v":""},{"$f":"IF(DATA_SISWA!B760=\"\",\"\",DATA_SISWA!B760)","v":""}]
[{"$f":"IF(DATA_SISWA!A761=\"\",\"\",DATA_SISWA!A761)","v":""},{"$f":"IF(DATA_SISWA!B761=\"\",\"\",DATA_SISWA!B761)","v":""}]
[{"$f":"IF(DATA_SISWA!A762=\"\",\"\",DATA_SISWA!A762)","v":""},{"$f":"IF(DATA_SISWA!B762=\"\",\"\",DATA_SISWA!B762)","v":""}]
[{"$f":"IF(DATA_SISWA!A763=\"\",\"\",DATA_SISWA!A763)","v":""},{"$f":"IF(DATA_SISWA!B763=\"\",\"\",DATA_SISWA!B763)","v":""}]
[{"$f":"IF(DATA_SISWA!A764=\"\",\"\",DATA_SISWA!A764)","v":""},{"$f":"IF(DATA_SISWA!B764=\"\",\"\",DATA_SISWA!B764)","v":""}]
[{"$f":"IF(DATA_SISWA!A765=\"\",\"\",DATA_SISWA!A765)","v":""},{"$f":"IF(DATA_SISWA!B765=\"\",\"\",DATA_SISWA!B765)","v":""}]
[{"$f":"IF(DATA_SISWA!A766=\"\",\"\",DATA_SISWA!A766)","v":""},{"$f":"IF(DATA_SISWA!B766=\"\",\"\",DATA_SISWA!B766)","v":""}]
[{"$f":"IF(DATA_SISWA!A767=\"\",\"\",DATA_SISWA!A767)","v":""},{"$f":"IF(DATA_SISWA!B767=\"\",\"\",DATA_SISWA!B767)","v":""}]
[{"$f":"IF(DATA_SISWA!A768=\"\",\"\",DATA_SISWA!A768)","v":""},{"$f":"IF(DATA_SISWA!B768=\"\",\"\",DATA_SISWA!B768)","v":""}]
[{"$f":"IF(DATA_SISWA!A769=\"\",\"\",DATA_SISWA!A769)","v":""},{"$f":"IF(DATA_SISWA!B769=\"\",\"\",DATA_SISWA!B769)","v":""}]
[{"$f":"IF(DATA_SISWA!A770=\"\",\"\",DATA_SISWA!A770)","v":""},{"$f":"IF(DATA_SISWA!B770=\"\",\"\",DATA_SISWA!B770)","v":""}]
[{"$f":"IF(DATA_SISWA!A771=\"\",\"\",DATA_SISWA!A771)","v":""},{"$f":"IF(DATA_SISWA!B771=\"\",\"\",DATA_SISWA!B771)","v":""}]
[{"$f":"IF(DATA_SISWA!A772=\"\",\"\",DATA_SISWA!A772)","v":""},{"$f":"IF(DATA_SISWA!B772=\"\",\"\",DATA_SISWA!B772)","v":""}]
[{"$f":"IF(DATA_SISWA!A773=\"\",\"\",DATA_SISWA!A773)","v":""},{"$f":"IF(DATA_SISWA!B773=\"\",\"\",DATA_SISWA!B773)","v":""}]
[{"$f":"IF(DATA_SISWA!A774=\"\",\"\",DATA_SISWA!A774)","v":""},{"$f":"IF(DATA_SISWA!B774=\"\",\"\",DATA_SISWA!B774)","v":""}]
[{"$f":"IF(DATA_SISWA!A775=\"\",\"\",DATA_SISWA!A775)","v":""},{"$f":"IF(DATA_SISWA!B775=\"\",\"\",DATA_SISWA!B775)","v":""}]
[{"$f":"IF(DATA_SISWA!A776=\"\",\"\",DATA_SISWA!A776)","v":""},{"$f":"IF(DATA_SISWA!B776=\"\",\"\",DATA_SISWA!B776)","v":""}]
[{"$f":"IF(DATA_SISWA!A777=\"\",\"\",DATA_SISWA!A777)","v":""},{"$f":"IF(DATA_SISWA!B777=\"\",\"\",DATA_SISWA!B777)","v":""}]
[{"$f":"IF(DATA_SISWA!A778=\"\",\"\",DATA_SISWA!A778)","v":""},{"$f":"IF(DATA_SISWA!B778=\"\",\"\",DATA_SISWA!B778)","v":""}]
[{"$f":"IF(DATA_SISWA!A779=\"\",\"\",DATA_SISWA!A779)","v":""},{"$f":"IF(DATA_SISWA!B779=\"\",\"\",DATA_SISWA!B779)","v":""}]
[{"$f":"IF(DATA_SISWA!A780=\"\",\"\",DATA_SISWA!A780)","v":""},{"$f":"IF(DATA_SISWA!B780=\"\",\"\",DATA_SISWA!B780)","v":""}]
[{"$f":"IF(DATA_SISWA!A781=\"\",\"\",DATA_SISWA!A781)","v":""},{"$f":"IF(DATA_SISWA!B781=\"\",\"\",DATA_SISWA!B781)","v":""}]
[{"$f":"IF(DATA_SISWA!A782=\"\",\"\",DATA_SISWA!A782)","v":""},{"$f":"IF(DATA_SISWA!B782=\"\",\"\",DATA_SISWA!B782)","v":""}]
[{"$f":"IF(DATA_SISWA!A783=\"\",\"\",DATA_SISWA!A783)","v":""},{"$f":"IF(DATA_SISWA!B783=\"\",\"\",DATA_SISWA!B783)","v":""}]
[{"$f":"IF(DATA_SISWA!A784=\"\",\"\",DATA_SISWA!A784)","v":""},{"$f":"IF(DATA_SISWA!B784=\"\",\"\",DATA_SISWA!B784)","v":""}]
[{"$f":"IF(DATA_SISWA!A785=\"\",\"\",DATA_SISWA!A785)","v":""},{"$f":"IF(DATA_SISWA!B785=\"\",\"\",DATA_SISWA!B785)","v":""}]
[{"$f":"IF(DATA_SISWA!A786=\"\",\"\",DATA_SISWA!A786)","v":""},{"$f":"IF(DATA_SISWA!B786=\"\",\"\",DATA_SISWA!B786)","v":""}]
[{"$f":"IF(DATA_SISWA!A787=\"\",\"\",DATA_SISWA!A787)","v":""},{"$f":"IF(DATA_SISWA!B787=\"\",\"\",DATA_SISWA!B787)","v":""}]
[{"$f":"IF(DATA_SISWA!A788=\"\",\"\",DATA_SISWA!A788)","v":""},{"$f":"IF(DATA_SISWA!B788=\"\",\"\",DATA_SISWA!B788)","v":""}]
[{"$f":"IF(DATA_SISWA!A789=\"\",\"\",DATA_SISWA!A789)","v":""},{"$f":"IF(DATA_SISWA!B789=\"\",\"\",DATA_SISWA!B789)","v":""}]
[{"$f":"IF(DATA_SISWA!A790=\"\",\"\",DATA_SISWA!A790)","v":""},{"$f":"IF(DATA_SISWA!B790=\"\",\"\",DATA_SISWA!B790)","v":""}]
[{"$f":"IF(DATA_SISWA!A791=\"\",\"\",DATA_SISWA!A791)","v":""},{"$f":"IF(DATA_SISWA!B791=\"\",\"\",DATA_SISWA!B791)","v":""}]
[{"$f":"IF(DATA_SISWA!A792=\"\",\"\",DATA_SISWA!A792)","v":""},{"$f":"IF(DATA_SISWA!B792=\"\",\"\",DATA_SISWA!B792)","v":""}]
[{"$f":"IF(DATA_SISWA!A793=\"\",\"\",DATA_SISWA!A793)","v":""},{"$f":"IF(DATA_SISWA!B793=\"\",\"\",DATA_SISWA!B793)","v":""}]
[{"$f":"IF(DATA_SISWA!A794=\"\",\"\",DATA_SISWA!A794)","v":""},{"$f":"IF(DATA_SISWA!B794=\"\",\"\",DATA_SISWA!B794)","v":""}]
[{"$f":"IF(DATA_SISWA!A795=\"\",\"\",DATA_SISWA!A795)","v":""},{"$f":"IF(DATA_SISWA!B795=\"\",\"\",DATA_SISWA!B795)","v":""}]
[{"$f":"IF(DATA_SISWA!A796=\"\",\"\",DATA_SISWA!A796)","v":""},{"$f":"IF(DATA_SISWA!B796=\"\",\"\",DATA_SISWA!B796)","v":""}]
[{"$f":"IF(DATA_SISWA!A797=\"\",\"\",DATA_SISWA!A797)","v":""},{"$f":"IF(DATA_SISWA!B797=\"\",\"\",DATA_SISWA!B797)","v":""}]
[{"$f":"IF(DATA_SISWA!A798=\"\",\"\",DATA_SISWA!A798)","v":""},{"$f":"IF(DATA_SISWA!B798=\"\",\"\",DATA_SISWA!B798)","v":""}]
[{"$f":"IF(DATA_SISWA!A799=\"\",\"\",DATA_SISWA!A799)","v":""},{"$f":"IF(DATA_SISWA!B799=\"\",\"\",DATA_SISWA!B799)","v":""}]
[{"$f":"IF(DATA_SISWA!A800=\"\",\"\",DATA_SISWA!A800)","v":""},{"$f":"IF(DATA_SISWA!B800=\"\",\"\",DATA_SISWA!B800)","v":""}]
[{"$f":"IF(DATA_SISWA!A801=\"\",\"\",DATA_SISWA!A801)","v":""},{"$f":"IF(DATA_SISWA!B801=\"\",\"\",DATA_SISWA!B801)","v":""}]
[{"$f":"IF(DATA_SISWA!A802=\"\",\"\",DATA_SISWA!A802)","v":""},{"$f":"IF(DATA_SISWA!B802=\"\",\"\",DATA_SISWA!B802)","v":""}]
[{"$f":"IF(DATA_SISWA!A803=\"\",\"\",DATA_SISWA!A803)","v":""},{"$f":"IF(DATA_SISWA!B803=\"\",\"\",DATA_SISWA!B803)","v":""}]
[{"$f":"IF(DATA_SISWA!A804=\"\",\"\",DATA_SISWA!A804)","v":""},{"$f":"IF(DATA_SISWA!B804=\"\",\"\",DATA_SISWA!B804)","v":""}]
[{"$f":"IF(DATA_SISWA!A805=\"\",\"\",DATA_SISWA!A805)","v":""},{"$f":"IF(DATA_SISWA!B805=\"\",\"\",DATA_SISWA!B805)","v":""}]
[{"$f":"IF(DATA_SISWA!A806=\"\",\"\",DATA_SISWA!A806)","v":""},{"$f":"IF(DATA_SISWA!B806=\"\",\"\",DATA_SISWA!B806)","v":""}]
[{"$f":"IF(DATA_SISWA!A807=\"\",\"\",DATA_SISWA!A807)","v":""},{"$f":"IF(DATA_SISWA!B807=\"\",\"\",DATA_SISWA!B807)","v":""}]
[{"$f":"IF(DATA_SISWA!A808=\"\",\"\",DATA_SISWA!A808)","v":""},{"$f":"IF(DATA_SISWA!B808=\"\",\"\",DATA_SISWA!B808)","v":""}]
[{"$f":"IF(DATA_SISWA!A809=\"\",\"\",DATA_SISWA!A809)","v":""},{"$f":"IF(DATA_SISWA!B809=\"\",\"\",DATA_SISWA!B809)","v":""}]
[{"$f":"IF(DATA_SISWA!A810=\"\",\"\",DATA_SISWA!A810)","v":""},{"$f":"IF(DATA_SISWA!B810=\"\",\"\",DATA_SISWA!B810)","v":""}]
[{"$f":"IF(DATA_SISWA!A811=\"\",\"\",DATA_SISWA!A811)","v":""},{"$f":"IF(DATA_SISWA!B811=\"\",\"\",DATA_SISWA!B811)","v":""}]
[{"$f":"IF(DATA_SISWA!A812=\"\",\"\",DATA_SISWA!A812)","v":""},{"$f":"IF(DATA_SISWA!B812=\"\",\"\",DATA_SISWA!B812)","v":""}]
[{"$f":"IF(DATA_SISWA!A813=\"\",\"\",DATA_SISWA!A813)","v":""},{"$f":"IF(DATA_SISWA!B813=\"\",\"\",DATA_SISWA!B813)","v":""}]
[{"$f":"IF(DATA_SISWA!A814=\"\",\"\",DATA_SISWA!A814)","v":""},{"$f":"IF(DATA_SISWA!B814=\"\",\"\",DATA_SISWA!B814)","v":""}]
[{"$f":"IF(DATA_SISWA!A815=\"\",\"\",DATA_SISWA!A815)","v":""},{"$f":"IF(DATA_SISWA!B815=\"\",\"\",DATA_SISWA!B815)","v":""}]
[{"$f":"IF(DATA_SISWA!A816=\"\",\"\",DATA_SISWA!A816)","v":""},{"$f":"IF(DATA_SISWA!B816=\"\",\"\",DATA_SISWA!B816)","v":""}]
[{"$f":"IF(DATA_SISWA!A817=\"\",\"\",DATA_SISWA!A817)","v":""},{"$f":"IF(DATA_SISWA!B817=\"\",\"\",DATA_SISWA!B817)","v":""}]
[{"$f":"IF(DATA_SISWA!A818=\"\",\"\",DATA_SISWA!A818)","v":""},{"$f":"IF(DATA_SISWA!B818=\"\",\"\",DATA_SISWA!B818)","v":""}]
[{"$f":"IF(DATA_SISWA!A819=\"\",\"\",DATA_SISWA!A819)","v":""},{"$f":"IF(DATA_SISWA!B819=\"\",\"\",DATA_SISWA!B819)","v":""}]
[{"$f":"IF(DATA_SISWA!A820=\"\",\"\",DATA_SISWA!A820)","v":""},{"$f":"IF(DATA_SISWA!B820=\"\",\"\",DATA_SISWA!B820)","v":""}]
[{"$f":"IF(DATA_SISWA!A821=\"\",\"\",DATA_SISWA!A821)","v":""},{"$f":"IF(DATA_SISWA!B821=\"\",\"\",DATA_SISWA!B821)","v":""}]
[{"$f":"IF(DATA_SISWA!A822=\"\",\"\",DATA_SISWA!A822)","v":""},{"$f":"IF(DATA_SISWA!B822=\"\",\"\",DATA_SISWA!B822)","v":""}]
[{"$f":"IF(DATA_SISWA!A823=\"\",\"\",DATA_SISWA!A823)","v":""},{"$f":"IF(DATA_SISWA!B823=\"\",\"\",DATA_SISWA!B823)","v":""}]
[{"$f":"IF(DATA_SISWA!A824=\"\",\"\",DATA_SISWA!A824)","v":""},{"$f":"IF(DATA_SISWA!B824=\"\",\"\",DATA_SISWA!B824)","v":""}]
[{"$f":"IF(DATA_SISWA!A825=\"\",\"\",DATA_SISWA!A825)","v":""},{"$f":"IF(DATA_SISWA!B825=\"\",\"\",DATA_SISWA!B825)","v":""}]
[{"$f":"IF(DATA_SISWA!A826=\"\",\"\",DATA_SISWA!A826)","v":""},{"$f":"IF(DATA_SISWA!B826=\"\",\"\",DATA_SISWA!B826)","v":""}]
[{"$f":"IF(DATA_SISWA!A827=\"\",\"\",DATA_SISWA!A827)","v":""},{"$f":"IF(DATA_SISWA!B827=\"\",\"\",DATA_SISWA!B827)","v":""}]
[{"$f":"IF(DATA_SISWA!A828=\"\",\"\",DATA_SISWA!A828)","v":""},{"$f":"IF(DATA_SISWA!B828=\"\",\"\",DATA_SISWA!B828)","v":""}]
[{"$f":"IF(DATA_SISWA!A829=\"\",\"\",DATA_SISWA!A829)","v":""},{"$f":"IF(DATA_SISWA!B829=\"\",\"\",DATA_SISWA!B829)","v":""}]
[{"$f":"IF(DATA_SISWA!A830=\"\",\"\",DATA_SISWA!A830)","v":""},{"$f":"IF(DATA_SISWA!B830=\"\",\"\",DATA_SISWA!B830)","v":""}]
[{"$f":"IF(DATA_SISWA!A831=\"\",\"\",DATA_SISWA!A831)","v":""},{"$f":"IF(DATA_SISWA!B831=\"\",\"\",DATA_SISWA!B831)","v":""}]
[{"$f":"IF(DATA_SISWA!A832=\"\",\"\",DATA_SISWA!A832)","v":""},{"$f":"IF(DATA_SISWA!B832=\"\",\"\",DATA_SISWA!B832)","v":""}]
[{"$f":"IF(DATA_SISWA!A833=\"\",\"\",DATA_SISWA!A833)","v":""},{"$f":"IF(DATA_SISWA!B833=\"\",\"\",DATA_SISWA!B833)","v":""}]
[{"$f":"IF(DATA_SISWA!A834=\"\",\"\",DATA_SISWA!A834)","v":""},{"$f":"IF(DATA_SISWA!B834=\"\",\"\",DATA_SISWA!B834)","v":""}]
[{"$f":"IF(DATA_SISWA!A835=\"\",\"\",DATA_SISWA!A835)","v":""},{"$f":"IF(DATA_SISWA!B835=\"\",\"\",DATA_SISWA!B835)","v":""}]
[{"$f":"IF(DATA_SISWA!A836=\"\",\"\",DATA_SISWA!A836)","v":""},{"$f":"IF(DATA_SISWA!B836=\"\",\"\",DATA_SISWA!B836)","v":""}]
[{"$f":"IF(DATA_SISWA!A837=\"\",\"\",DATA_SISWA!A837)","v":""},{"$f":"IF(DATA_SISWA!B837=\"\",\"\",DATA_SISWA!B837)","v":""}]
[{"$f":"IF(DATA_SISWA!A838=\"\",\"\",DATA_SISWA!A838)","v":""},{"$f":"IF(DATA_SISWA!B838=\"\",\"\",DATA_SISWA!B838)","v":""}]
[{"$f":"IF(DATA_SISWA!A839=\"\",\"\",DATA_SISWA!A839)","v":""},{"$f":"IF(DATA_SISWA!B839=\"\",\"\",DATA_SISWA!B839)","v":""}]
[{"$f":"IF(DATA_SISWA!A840=\"\",\"\",DATA_SISWA!A840)","v":""},{"$f":"IF(DATA_SISWA!B840=\"\",\"\",DATA_SISWA!B840)","v":""}]
[{"$f":"IF(DATA_SISWA!A841=\"\",\"\",DATA_SISWA!A841)","v":""},{"$f":"IF(DATA_SISWA!B841=\"\",\"\",DATA_SISWA!B841)","v":""}]
[{"$f":"IF(DATA_SISWA!A842=\"\",\"\",DATA_SISWA!A842)","v":""},{"$f":"IF(DATA_SISWA!B842=\"\",\"\",DATA_SISWA!B842)","v":""}]
[{"$f":"IF(DATA_SISWA!A843=\"\",\"\",DATA_SISWA!A843)","v":""},{"$f":"IF(DATA_SISWA!B843=\"\",\"\",DATA_SISWA!B843)","v":""}]
[{"$f":"IF(DATA_SISWA!A844=\"\",\"\",DATA_SISWA!A844)","v":""},{"$f":"IF(DATA_SISWA!B844=\"\",\"\",DATA_SISWA!B844)","v":""}]
[{"$f":"IF(DATA_SISWA!A845=\"\",\"\",DATA_SISWA!A845)","v":""},{"$f":"IF(DATA_SISWA!B845=\"\",\"\",DATA_SISWA!B845)","v":""}]
[{"$f":"IF(DATA_SISWA!A846=\"\",\"\",DATA_SISWA!A846)","v":""},{"$f":"IF(DATA_SISWA!B846=\"\",\"\",DATA_SISWA!B846)","v":""}]
[{"$f":"IF(DATA_SISWA!A847=\"\",\"\",DATA_SISWA!A847)","v":""},{"$f":"IF(DATA_SISWA!B847=\"\",\"\",DATA_SISWA!B847)","v":""}]
[{"$f":"IF(DATA_SISWA!A848=\"\",\"\",DATA_SISWA!A848)","v":""},{"$f":"IF(DATA_SISWA!B848=\"\",\"\",DATA_SISWA!B848)","v":""}]
[{"$f":"IF(DATA_SISWA!A849=\"\",\"\",DATA_SISWA!A849)","v":""},{"$f":"IF(DATA_SISWA!B849=\"\",\"\",DATA_SISWA!B849)","v":""}]
[{"$f":"IF(DATA_SISWA!A850=\"\",\"\",DATA_SISWA!A850)","v":""},{"$f":"IF(DATA_SISWA!B850=\"\",\"\",DATA_SISWA!B850)","v":""}]
[{"$f":"IF(DATA_SISWA!A851=\"\",\"\",DATA_SISWA!A851)","v":""},{"$f":"IF(DATA_SISWA!B851=\"\",\"\",DATA_SISWA!B851)","v":""}]
[{"$f":"IF(DATA_SISWA!A852=\"\",\"\",DATA_SISWA!A852)","v":""},{"$f":"IF(DATA_SISWA!B852=\"\",\"\",DATA_SISWA!B852)","v":""}]
[{"$f":"IF(DATA_SISWA!A853=\"\",\"\",DATA_SISWA!A853)","v":""},{"$f":"IF(DATA_SISWA!B853=\"\",\"\",DATA_SISWA!B853)","v":""}]
[{"$f":"IF(DATA_SISWA!A854=\"\",\"\",DATA_SISWA!A854)","v":""},{"$f":"IF(DATA_SISWA!B854=\"\",\"\",DATA_SISWA!B854)","v":""}]
[{"$f":"IF(DATA_SISWA!A855=\"\",\"\",DATA_SISWA!A855)","v":""},{"$f":"IF(DATA_SISWA!B855=\"\",\"\",DATA_SISWA!B855)","v":""}]
[{"$f":"IF(DATA_SISWA!A856=\"\",\"\",DATA_SISWA!A856)","v":""},{"$f":"IF(DATA_SISWA!B856=\"\",\"\",DATA_SISWA!B856)","v":""}]
[{"$f":"IF(DATA_SISWA!A857=\"\",\"\",DATA_SISWA!A857)","v":""},{"$f":"IF(DATA_SISWA!B857=\"\",\"\",DATA_SISWA!B857)","v":""}]
[{"$f":"IF(DATA_SISWA!A858=\"\",\"\",DATA_SISWA!A858)","v":""},{"$f":"IF(DATA_SISWA!B858=\"\",\"\",DATA_SISWA!B858)","v":""}]
[{"$f":"IF(DATA_SISWA!A859=\"\",\"\",DATA_SISWA!A859)","v":""},{"$f":"IF(DATA_SISWA!B859=\"\",\"\",DATA_SISWA!B859)","v":""}]
[{"$f":"IF(DATA_SISWA!A860=\"\",\"\",DATA_SISWA!A860)","v":""},{"$f":"IF(DATA_SISWA!B860=\"\",\"\",DATA_SISWA!B860)","v":""}]
[{"$f":"IF(DATA_SISWA!A861=\"\",\"\",DATA_SISWA!A861)","v":""},{"$f":"IF(DATA_SISWA!B861=\"\",\"\",DATA_SISWA!B861)","v":""}]
[{"$f":"IF(DATA_SISWA!A862=\"\",\"\",DATA_SISWA!A862)","v":""},{"$f":"IF(DATA_SISWA!B862=\"\",\"\",DATA_SISWA!B862)","v":""}]
[{"$f":"IF(DATA_SISWA!A863=\"\",\"\",DATA_SISWA!A863)","v":""},{"$f":"IF(DATA_SISWA!B863=\"\",\"\",DATA_SISWA!B863)","v":""}]
[{"$f":"IF(DATA_SISWA!A864=\"\",\"\",DATA_SISWA!A864)","v":""},{"$f":"IF(DATA_SISWA!B864=\"\",\"\",DATA_SISWA!B864)","v":""}]
[{"$f":"IF(DATA_SISWA!A865=\"\",\"\",DATA_SISWA!A865)","v":""},{"$f":"IF(DATA_SISWA!B865=\"\",\"\",DATA_SISWA!B865)","v":""}]
[{"$f":"IF(DATA_SISWA!A866=\"\",\"\",DATA_SISWA!A866)","v":""},{"$f":"IF(DATA_SISWA!B866=\"\",\"\",DATA_SISWA!B866)","v":""}]
[{"$f":"IF(DATA_SISWA!A867=\"\",\"\",DATA_SISWA!A867)","v":""},{"$f":"IF(DATA_SISWA!B867=\"\",\"\",DATA_SISWA!B867)","v":""}]
[{"$f":"IF(DATA_SISWA!A868=\"\",\"\",DATA_SISWA!A868)","v":""},{"$f":"IF(DATA_SISWA!B868=\"\",\"\",DATA_SISWA!B868)","v":""}]
[{"$f":"IF(DATA_SISWA!A869=\"\",\"\",DATA_SISWA!A869)","v":""},{"$f":"IF(DATA_SISWA!B869=\"\",\"\",DATA_SISWA!B869)","v":""}]
[{"$f":"IF(DATA_SISWA!A870=\"\",\"\",DATA_SISWA!A870)","v":""},{"$f":"IF(DATA_SISWA!B870=\"\",\"\",DATA_SISWA!B870)","v":""}]
[{"$f":"IF(DATA_SISWA!A871=\"\",\"\",DATA_SISWA!A871)","v":""},{"$f":"IF(DATA_SISWA!B871=\"\",\"\",DATA_SISWA!B871)","v":""}]
[{"$f":"IF(DATA_SISWA!A872=\"\",\"\",DATA_SISWA!A872)","v":""},{"$f":"IF(DATA_SISWA!B872=\"\",\"\",DATA_SISWA!B872)","v":""}]
[{"$f":"IF(DATA_SISWA!A873=\"\",\"\",DATA_SISWA!A873)","v":""},{"$f":"IF(DATA_SISWA!B873=\"\",\"\",DATA_SISWA!B873)","v":""}]
[{"$f":"IF(DATA_SISWA!A874=\"\",\"\",DATA_SISWA!A874)","v":""},{"$f":"IF(DATA_SISWA!B874=\"\",\"\",DATA_SISWA!B874)","v":""}]
[{"$f":"IF(DATA_SISWA!A875=\"\",\"\",DATA_SISWA!A875)","v":""},{"$f":"IF(DATA_SISWA!B875=\"\",\"\",DATA_SISWA!B875)","v":""}]
[{"$f":"IF(DATA_SISWA!A876=\"\",\"\",DATA_SISWA!A876)","v":""},{"$f":"IF(DATA_SISWA!B876=\"\",\"\",DATA_SISWA!B876)","v":""}]
[{"$f":"IF(DATA_SISWA!A877=\"\",\"\",DATA_SISWA!A877)","v":""},{"$f":"IF(DATA_SISWA!B877=\"\",\"\",DATA_SISWA!B877)","v":""}]
[{"$f":"IF(DATA_SISWA!A878=\"\",\"\",DATA_SISWA!A878)","v":""},{"$f":"IF(DATA_SISWA!B878=\"\",\"\",DATA_SISWA!B878)","v":""}]
[{"$f":"IF(DATA_SISWA!A879=\"\",\"\",DATA_SISWA!A879)","v":""},{"$f":"IF(DATA_SISWA!B879=\"\",\"\",DATA_SISWA!B879)","v":""}]
[{"$f":"IF(DATA_SISWA!A880=\"\",\"\",DATA_SISWA!A880)","v":""},{"$f":"IF(DATA_SISWA!B880=\"\",\"\",DATA_SISWA!B880)","v":""}]
[{"$f":"IF(DATA_SISWA!A881=\"\",\"\",DATA_SISWA!A881)","v":""},{"$f":"IF(DATA_SISWA!B881=\"\",\"\",DATA_SISWA!B881)","v":""}]
[{"$f":"IF(DATA_SISWA!A882=\"\",\"\",DATA_SISWA!A882)","v":""},{"$f":"IF(DATA_SISWA!B882=\"\",\"\",DATA_SISWA!B882)","v":""}]
[{"$f":"IF(DATA_SISWA!A883=\"\",\"\",DATA_SISWA!A883)","v":""},{"$f":"IF(DATA_SISWA!B883=\"\",\"\",DATA_SISWA!B883)","v":""}]
[{"$f":"IF(DATA_SISWA!A884=\"\",\"\",DATA_SISWA!A884)","v":""},{"$f":"IF(DATA_SISWA!B884=\"\",\"\",DATA_SISWA!B884)","v":""}]
[{"$f":"IF(DATA_SISWA!A885=\"\",\"\",DATA_SISWA!A885)","v":""},{"$f":"IF(DATA_SISWA!B885=\"\",\"\",DATA_SISWA!B885)","v":""}]
[{"$f":"IF(DATA_SISWA!A886=\"\",\"\",DATA_SISWA!A886)","v":""},{"$f":"IF(DATA_SISWA!B886=\"\",\"\",DATA_SISWA!B886)","v":""}]
[{"$f":"IF(DATA_SISWA!A887=\"\",\"\",DATA_SISWA!A887)","v":""},{"$f":"IF(DATA_SISWA!B887=\"\",\"\",DATA_SISWA!B887)","v":""}]
[{"$f":"IF(DATA_SISWA!A888=\"\",\"\",DATA_SISWA!A888)","v":""},{"$f":"IF(DATA_SISWA!B888=\"\",\"\",DATA_SISWA!B888)","v":""}]
[{"$f":"IF(DATA_SISWA!A889=\"\",\"\",DATA_SISWA!A889)","v":""},{"$f":"IF(DATA_SISWA!B889=\"\",\"\",DATA_SISWA!B889)","v":""}]
[{"$f":"IF(DATA_SISWA!A890=\"\",\"\",DATA_SISWA!A890)","v":""},{"$f":"IF(DATA_SISWA!B890=\"\",\"\",DATA_SISWA!B890)","v":""}]
[{"$f":"IF(DATA_SISWA!A891=\"\",\"\",DATA_SISWA!A891)","v":""},{"$f":"IF(DATA_SISWA!B891=\"\",\"\",DATA_SISWA!B891)","v":""}]
[{"$f":"IF(DATA_SISWA!A892=\"\",\"\",DATA_SISWA!A892)","v":""},{"$f":"IF(DATA_SISWA!B892=\"\",\"\",DATA_SISWA!B892)","v":""}]
[{"$f":"IF(DATA_SISWA!A893=\"\",\"\",DATA_SISWA!A893)","v":""},{"$f":"IF(DATA_SISWA!B893=\"\",\"\",DATA_SISWA!B893)","v":""}]
[{"$f":"IF(DATA_SISWA!A894=\"\",\"\",DATA_SISWA!A894)","v":""},{"$f":"IF(DATA_SISWA!B894=\"\",\"\",DATA_SISWA!B894)","v":""}]
[{"$f":"IF(DATA_SISWA!A895=\"\",\"\",DATA_SISWA!A895)","v":""},{"$f":"IF(DATA_SISWA!B895=\"\",\"\",DATA_SISWA!B895)","v":""}]
[{"$f":"IF(DATA_SISWA!A896=\"\",\"\",DATA_SISWA!A896)","v":""},{"$f":"IF(DATA_SISWA!B896=\"\",\"\",DATA_SISWA!B896)","v":""}]
[{"$f":"IF(DATA_SISWA!A897=\"\",\"\",DATA_SISWA!A897)","v":""},{"$f":"IF(DATA_SISWA!B897=\"\",\"\",DATA_SISWA!B897)","v":""}]
[{"$f":"IF(DATA_SISWA!A898=\"\",\"\",DATA_SISWA!A898)","v":""},{"$f":"IF(DATA_SISWA!B898=\"\",\"\",DATA_SISWA!B898)","v":""}]
[{"$f":"IF(DATA_SISWA!A899=\"\",\"\",DATA_SISWA!A899)","v":""},{"$f":"IF(DATA_SISWA!B899=\"\",\"\",DATA_SISWA!B899)","v":""}]
[{"$f":"IF(DATA_SISWA!A900=\"\",\"\",DATA_SISWA!A900)","v":""},{"$f":"IF(DATA_SISWA!B900=\"\",\"\",DATA_SISWA!B900)","v":""}]
[{"$f":"IF(DATA_SISWA!A901=\"\",\"\",DATA_SISWA!A901)","v":""},{"$f":"IF(DATA_SISWA!B901=\"\",\"\",DATA_SISWA!B901)","v":""}]
[{"$f":"IF(DATA_SISWA!A902=\"\",\"\",DATA_SISWA!A902)","v":""},{"$f":"IF(DATA_SISWA!B902=\"\",\"\",DATA_SISWA!B902)","v":""}]
[{"$f":"IF(DATA_SISWA!A903=\"\",\"\",DATA_SISWA!A903)","v":""},{"$f":"IF(DATA_SISWA!B903=\"\",\"\",DATA_SISWA!B903)","v":""}]
[{"$f":"IF(DATA_SISWA!A904=\"\",\"\",DATA_SISWA!A904)","v":""},{"$f":"IF(DATA_SISWA!B904=\"\",\"\",DATA_SISWA!B904)","v":""}]
[{"$f":"IF(DATA_SISWA!A905=\"\",\"\",DATA_SISWA!A905)","v":""},{"$f":"IF(DATA_SISWA!B905=\"\",\"\",DATA_SISWA!B905)","v":""}]
[{"$f":"IF(DATA_SISWA!A906=\"\",\"\",DATA_SISWA!A906)","v":""},{"$f":"IF(DATA_SISWA!B906=\"\",\"\",DATA_SISWA!B906)","v":""}]
[{"$f":"IF(DATA_SISWA!A907=\"\",\"\",DATA_SISWA!A907)","v":""},{"$f":"IF(DATA_SISWA!B907=\"\",\"\",DATA_SISWA!B907)","v":""}]
[{"$f":"IF(DATA_SISWA!A908=\"\",\"\",DATA_SISWA!A908)","v":""},{"$f":"IF(DATA_SISWA!B908=\"\",\"\",DATA_SISWA!B908)","v":""}]
[{"$f":"IF(DATA_SISWA!A909=\"\",\"\",DATA_SISWA!A909)","v":""},{"$f":"IF(DATA_SISWA!B909=\"\",\"\",DATA_SISWA!B909)","v":""}]
[{"$f":"IF(DATA_SISWA!A910=\"\",\"\",DATA_SISWA!A910)","v":""},{"$f":"IF(DATA_SISWA!B910=\"\",\"\",DATA_SISWA!B910)","v":""}]
[{"$f":"IF(DATA_SISWA!A911=\"\",\"\",DATA_SISWA!A911)","v":""},{"$f":"IF(DATA_SISWA!B911=\"\",\"\",DATA_SISWA!B911)","v":""}]
[{"$f":"IF(DATA_SISWA!A912=\"\",\"\",DATA_SISWA!A912)","v":""},{"$f":"IF(DATA_SISWA!B912=\"\",\"\",DATA_SISWA!B912)","v":""}]
[{"$f":"IF(DATA_SISWA!A913=\"\",\"\",DATA_SISWA!A913)","v":""},{"$f":"IF(DATA_SISWA!B913=\"\",\"\",DATA_SISWA!B913)","v":""}]
[{"$f":"IF(DATA_SISWA!A914=\"\",\"\",DATA_SISWA!A914)","v":""},{"$f":"IF(DATA_SISWA!B914=\"\",\"\",DATA_SISWA!B914)","v":""}]
[{"$f":"IF(DATA_SISWA!A915=\"\",\"\",DATA_SISWA!A915)","v":""},{"$f":"IF(DATA_SISWA!B915=\"\",\"\",DATA_SISWA!B915)","v":""}]
[{"$f":"IF(DATA_SISWA!A916=\"\",\"\",DATA_SISWA!A916)","v":""},{"$f":"IF(DATA_SISWA!B916=\"\",\"\",DATA_SISWA!B916)","v":""}]
[{"$f":"IF(DATA_SISWA!A917=\"\",\"\",DATA_SISWA!A917)","v":""},{"$f":"IF(DATA_SISWA!B917=\"\",\"\",DATA_SISWA!B917)","v":""}]
[{"$f":"IF(DATA_SISWA!A918=\"\",\"\",DATA_SISWA!A918)","v":""},{"$f":"IF(DATA_SISWA!B918=\"\",\"\",DATA_SISWA!B918)","v":""}]
[{"$f":"IF(DATA_SISWA!A919=\"\",\"\",DATA_SISWA!A919)","v":""},{"$f":"IF(DATA_SISWA!B919=\"\",\"\",DATA_SISWA!B919)","v":""}]
[{"$f":"IF(DATA_SISWA!A920=\"\",\"\",DATA_SISWA!A920)","v":""},{"$f":"IF(DATA_SISWA!B920=\"\",\"\",DATA_SISWA!B920)","v":""}]
[{"$f":"IF(DATA_SISWA!A921=\"\",\"\",DATA_SISWA!A921)","v":""},{"$f":"IF(DATA_SISWA!B921=\"\",\"\",DATA_SISWA!B921)","v":""}]
[{"$f":"IF(DATA_SISWA!A922=\"\",\"\",DATA_SISWA!A922)","v":""},{"$f":"IF(DATA_SISWA!B922=\"\",\"\",DATA_SISWA!B922)","v":""}]
[{"$f":"IF(DATA_SISWA!A923=\"\",\"\",DATA_SISWA!A923)","v":""},{"$f":"IF(DATA_SISWA!B923=\"\",\"\",DATA_SISWA!B923)","v":""}]
[{"$f":"IF(DATA_SISWA!A924=\"\",\"\",DATA_SISWA!A924)","v":""},{"$f":"IF(DATA_SISWA!B924=\"\",\"\",DATA_SISWA!B924)","v":""}]
[{"$f":"IF(DATA_SISWA!A925=\"\",\"\",DATA_SISWA!A925)","v":""},{"$f":"IF(DATA_SISWA!B925=\"\",\"\",DATA_SISWA!B925)","v":""}]
[{"$f":"IF(DATA_SISWA!A926=\"\",\"\",DATA_SISWA!A926)","v":""},{"$f":"IF(DATA_SISWA!B926=\"\",\"\",DATA_SISWA!B926)","v":""}]
[{"$f":"IF(DATA_SISWA!A927=\"\",\"\",DATA_SISWA!A927)","v":""},{"$f":"IF(DATA_SISWA!B927=\"\",\"\",DATA_SISWA!B927)","v":""}]
[{"$f":"IF(DATA_SISWA!A928=\"\",\"\",DATA_SISWA!A928)","v":""},{"$f":"IF(DATA_SISWA!B928=\"\",\"\",DATA_SISWA!B928)","v":""}]
[{"$f":"IF(DATA_SISWA!A929=\"\",\"\",DATA_SISWA!A929)","v":""},{"$f":"IF(DATA_SISWA!B929=\"\",\"\",DATA_SISWA!B929)","v":""}]
[{"$f":"IF(DATA_SISWA!A930=\"\",\"\",DATA_SISWA!A930)","v":""},{"$f":"IF(DATA_SISWA!B930=\"\",\"\",DATA_SISWA!B930)","v":""}]
[{"$f":"IF(DATA_SISWA!A931=\"\",\"\",DATA_SISWA!A931)","v":""},{"$f":"IF(DATA_SISWA!B931=\"\",\"\",DATA_SISWA!B931)","v":""}]
[{"$f":"IF(DATA_SISWA!A932=\"\",\"\",DATA_SISWA!A932)","v":""},{"$f":"IF(DATA_SISWA!B932=\"\",\"\",DATA_SISWA!B932)","v":""}]
[{"$f":"IF(DATA_SISWA!A933=\"\",\"\",DATA_SISWA!A933)","v":""},{"$f":"IF(DATA_SISWA!B933=\"\",\"\",DATA_SISWA!B933)","v":""}]
[{"$f":"IF(DATA_SISWA!A934=\"\",\"\",DATA_SISWA!A934)","v":""},{"$f":"IF(DATA_SISWA!B934=\"\",\"\",DATA_SISWA!B934)","v":""}]
[{"$f":"IF(DATA_SISWA!A935=\"\",\"\",DATA_SISWA!A935)","v":""},{"$f":"IF(DATA_SISWA!B935=\"\",\"\",DATA_SISWA!B935)","v":""}]
[{"$f":"IF(DATA_SISWA!A936=\"\",\"\",DATA_SISWA!A936)","v":""},{"$f":"IF(DATA_SISWA!B936=\"\",\"\",DATA_SISWA!B936)","v":""}]
[{"$f":"IF(DATA_SISWA!A937=\"\",\"\",DATA_SISWA!A937)","v":""},{"$f":"IF(DATA_SISWA!B937=\"\",\"\",DATA_SISWA!B937)","v":""}]
[{"$f":"IF(DATA_SISWA!A938=\"\",\"\",DATA_SISWA!A938)","v":""},{"$f":"IF(DATA_SISWA!B938=\"\",\"\",DATA_SISWA!B938)","v":""}]
[{"$f":"IF(DATA_SISWA!A939=\"\",\"\",DATA_SISWA!A939)","v":""},{"$f":"IF(DATA_SISWA!B939=\"\",\"\",DATA_SISWA!B939)","v":""}]
[{"$f":"IF(DATA_SISWA!A940=\"\",\"\",DATA_SISWA!A940)","v":""},{"$f":"IF(DATA_SISWA!B940=\"\",\"\",DATA_SISWA!B940)","v":""}]
[{"$f":"IF(DATA_SISWA!A941=\"\",\"\",DATA_SISWA!A941)","v":""},{"$f":"IF(DATA_SISWA!B941=\"\",\"\",DATA_SISWA!B941)","v":""}]
[{"$f":"IF(DATA_SISWA!A942=\"\",\"\",DATA_SISWA!A942)","v":""},{"$f":"IF(DATA_SISWA!B942=\"\",\"\",DATA_SISWA!B942)","v":""}]
[{"$f":"IF(DATA_SISWA!A943=\"\",\"\",DATA_SISWA!A943)","v":""},{"$f":"IF(DATA_SISWA!B943=\"\",\"\",DATA_SISWA!B943)","v":""}]
[{"$f":"IF(DATA_SISWA!A944=\"\",\"\",DATA_SISWA!A944)","v":""},{"$f":"IF(DATA_SISWA!B944=\"\",\"\",DATA_SISWA!B944)","v":""}]
[{"$f":"IF(DATA_SISWA!A945=\"\",\"\",DATA_SISWA!A945)","v":""},{"$f":"IF(DATA_SISWA!B945=\"\",\"\",DATA_SISWA!B945)","v":""}]
[{"$f":"IF(DATA_SISWA!A946=\"\",\"\",DATA_SISWA!A946)","v":""},{"$f":"IF(DATA_SISWA!B946=\"\",\"\",DATA_SISWA!B946)","v":""}]
[{"$f":"IF(DATA_SISWA!A947=\"\",\"\",DATA_SISWA!A947)","v":""},{"$f":"IF(DATA_SISWA!B947=\"\",\"\",DATA_SISWA!B947)","v":""}]
[{"$f":"IF(DATA_SISWA!A948=\"\",\"\",DATA_SISWA!A948)","v":""},{"$f":"IF(DATA_SISWA!B948=\"\",\"\",DATA_SISWA!B948)","v":""}]
[{"$f":"IF(DATA_SISWA!A949=\"\",\"\",DATA_SISWA!A949)","v":""},{"$f":"IF(DATA_SISWA!B949=\"\",\"\",DATA_SISWA!B949)","v":""}]
[{"$f":"IF(DATA_SISWA!A950=\"\",\"\",DATA_SISWA!A950)","v":""},{"$f":"IF(DATA_SISWA!B950=\"\",\"\",DATA_SISWA!B950)","v":""}]
[{"$f":"IF(DATA_SISWA!A951=\"\",\"\",DATA_SISWA!A951)","v":""},{"$f":"IF(DATA_SISWA!B951=\"\",\"\",DATA_SISWA!B951)","v":""}]
[{"$f":"IF(DATA_SISWA!A952=\"\",\"\",DATA_SISWA!A952)","v":""},{"$f":"IF(DATA_SISWA!B952=\"\",\"\",DATA_SISWA!B952)","v":""}]
[{"$f":"IF(DATA_SISWA!A953=\"\",\"\",DATA_SISWA!A953)","v":""},{"$f":"IF(DATA_SISWA!B953=\"\",\"\",DATA_SISWA!B953)","v":""}]
[{"$f":"IF(DATA_SISWA!A954=\"\",\"\",DATA_SISWA!A954)","v":""},{"$f":"IF(DATA_SISWA!B954=\"\",\"\",DATA_SISWA!B954)","v":""}]
[{"$f":"IF(DATA_SISWA!A955=\"\",\"\",DATA_SISWA!A955)","v":""},{"$f":"IF(DATA_SISWA!B955=\"\",\"\",DATA_SISWA!B955)","v":""}]
[{"$f":"IF(DATA_SISWA!A956=\"\",\"\",DATA_SISWA!A956)","v":""},{"$f":"IF(DATA_SISWA!B956=\"\",\"\",DATA_SISWA!B956)","v":""}]
[{"$f":"IF(DATA_SISWA!A957=\"\",\"\",DATA_SISWA!A957)","v":""},{"$f":"IF(DATA_SISWA!B957=\"\",\"\",DATA_SISWA!B957)","v":""}]
[{"$f":"IF(DATA_SISWA!A958=\"\",\"\",DATA_SISWA!A958)","v":""},{"$f":"IF(DATA_SISWA!B958=\"\",\"\",DATA_SISWA!B958)","v":""}]
[{"$f":"IF(DATA_SISWA!A959=\"\",\"\",DATA_SISWA!A959)","v":""},{"$f":"IF(DATA_SISWA!B959=\"\",\"\",DATA_SISWA!B959)","v":""}]
[{"$f":"IF(DATA_SISWA!A960=\"\",\"\",DATA_SISWA!A960)","v":""},{"$f":"IF(DATA_SISWA!B960=\"\",\"\",DATA_SISWA!B960)","v":""}]
[{"$f":"IF(DATA_SISWA!A961=\"\",\"\",DATA_SISWA!A961)","v":""},{"$f":"IF(DATA_SISWA!B961=\"\",\"\",DATA_SISWA!B961)","v":""}]
[{"$f":"IF(DATA_SISWA!A962=\"\",\"\",DATA_SISWA!A962)","v":""},{"$f":"IF(DATA_SISWA!B962=\"\",\"\",DATA_SISWA!B962)","v":""}]
[{"$f":"IF(DATA_SISWA!A963=\"\",\"\",DATA_SISWA!A963)","v":""},{"$f":"IF(DATA_SISWA!B963=\"\",\"\",DATA_SISWA!B963)","v":""}]
[{"$f":"IF(DATA_SISWA!A964=\"\",\"\",DATA_SISWA!A964)","v":""},{"$f":"IF(DATA_SISWA!B964=\"\",\"\",DATA_SISWA!B964)","v":""}]
[{"$f":"IF(DATA_SISWA!A965=\"\",\"\",DATA_SISWA!A965)","v":""},{"$f":"IF(DATA_SISWA!B965=\"\",\"\",DATA_SISWA!B965)","v":""}]
[{"$f":"IF(DATA_SISWA!A966=\"\",\"\",DATA_SISWA!A966)","v":""},{"$f":"IF(DATA_SISWA!B966=\"\",\"\",DATA_SISWA!B966)","v":""}]
[{"$f":"IF(DATA_SISWA!A967=\"\",\"\",DATA_SISWA!A967)","v":""},{"$f":"IF(DATA_SISWA!B967=\"\",\"\",DATA_SISWA!B967)","v":""}]
[{"$f":"IF(DATA_SISWA!A968=\"\",\"\",DATA_SISWA!A968)","v":""},{"$f":"IF(DATA_SISWA!B968=\"\",\"\",DATA_SISWA!B968)","v":""}]
[{"$f":"IF(DATA_SISWA!A969=\"\",\"\",DATA_SISWA!A969)","v":""},{"$f":"IF(DATA_SISWA!B969=\"\",\"\",DATA_SISWA!B969)","v":""}]
[{"$f":"IF(DATA_SISWA!A970=\"\",\"\",DATA_SISWA!A970)","v":""},{"$f":"IF(DATA_SISWA!B970=\"\",\"\",DATA_SISWA!B970)","v":""}]
[{"$f":"IF(DATA_SISWA!A971=\"\",\"\",DATA_SISWA!A971)","v":""},{"$f":"IF(DATA_SISWA!B971=\"\",\"\",DATA_SISWA!B971)","v":""}]
[{"$f":"IF(DATA_SISWA!A972=\"\",\"\",DATA_SISWA!A972)","v":""},{"$f":"IF(DATA_SISWA!B972=\"\",\"\",DATA_SISWA!B972)","v":""}]
[{"$f":"IF(DATA_SISWA!A973=\"\",\"\",DATA_SISWA!A973)","v":""},{"$f":"IF(DATA_SISWA!B973=\"\",\"\",DATA_SISWA!B973)","v":""}]
[{"$f":"IF(DATA_SISWA!A974=\"\",\"\",DATA_SISWA!A974)","v":""},{"$f":"IF(DATA_SISWA!B974=\"\",\"\",DATA_SISWA!B974)","v":""}]
[{"$f":"IF(DATA_SISWA!A975=\"\",\"\",DATA_SISWA!A975)","v":""},{"$f":"IF(DATA_SISWA!B975=\"\",\"\",DATA_SISWA!B975)","v":""}]
[{"$f":"IF(DATA_SISWA!A976=\"\",\"\",DATA_SISWA!A976)","v":""},{"$f":"IF(DATA_SISWA!B976=\"\",\"\",DATA_SISWA!B976)","v":""}]
[{"$f":"IF(DATA_SISWA!A977=\"\",\"\",DATA_SISWA!A977)","v":""},{"$f":"IF(DATA_SISWA!B977=\"\",\"\",DATA_SISWA!B977)","v":""}]
[{"$f":"IF(DATA_SISWA!A978=\"\",\"\",DATA_SISWA!A978)","v":""},{"$f":"IF(DATA_SISWA!B978=\"\",\"\",DATA_SISWA!B978)","v":""}]
[{"$f":"IF(DATA_SISWA!A979=\"\",\"\",DATA_SISWA!A979)","v":""},{"$f":"IF(DATA_SISWA!B979=\"\",\"\",DATA_SISWA!B979)","v":""}]
[{"$f":"IF(DATA_SISWA!A980=\"\",\"\",DATA_SISWA!A980)","v":""},{"$f":"IF(DATA_SISWA!B980=\"\",\"\",DATA_SISWA!B980)","v":""}]
[{"$f":"IF(DATA_SISWA!A981=\"\",\"\",DATA_SISWA!A981)","v":""},{"$f":"IF(DATA_SISWA!B981=\"\",\"\",DATA_SISWA!B981)","v":""}]
[{"$f":"IF(DATA_SISWA!A982=\"\",\"\",DATA_SISWA!A982)","v":""},{"$f":"IF(DATA_SISWA!B982=\"\",\"\",DATA_SISWA!B982)","v":""}]
[{"$f":"IF(DATA_SISWA!A983=\"\",\"\",DATA_SISWA!A983)","v":""},{"$f":"IF(DATA_SISWA!B983=\"\",\"\",DATA_SISWA!B983)","v":""}]
[{"$f":"IF(DATA_SISWA!A984=\"\",\"\",DATA_SISWA!A984)","v":""},{"$f":"IF(DATA_SISWA!B984=\"\",\"\",DATA_SISWA!B984)","v":""}]
[{"$f":"IF(DATA_SISWA!A985=\"\",\"\",DATA_SISWA!A985)","v":""},{"$f":"IF(DATA_SISWA!B985=\"\",\"\",DATA_SISWA!B985)","v":""}]
[{"$f":"IF(DATA_SISWA!A986=\"\",\"\",DATA_SISWA!A986)","v":""},{"$f":"IF(DATA_SISWA!B986=\"\",\"\",DATA_SISWA!B986)","v":""}]
[{"$f":"IF(DATA_SISWA!A987=\"\",\"\",DATA_SISWA!A987)","v":""},{"$f":"IF(DATA_SISWA!B987=\"\",\"\",DATA_SISWA!B987)","v":""}]
[{"$f":"IF(DATA_SISWA!A988=\"\",\"\",DATA_SISWA!A988)","v":""},{"$f":"IF(DATA_SISWA!B988=\"\",\"\",DATA_SISWA!B988)","v":""}]
[{"$f":"IF(DATA_SISWA!A989=\"\",\"\",DATA_SISWA!A989)","v":""},{"$f":"IF(DATA_SISWA!B989=\"\",\"\",DATA_SISWA!B989)","v":""}]
[{"$f":"IF(DATA_SISWA!A990=\"\",\"\",DATA_SISWA!A990)","v":""},{"$f":"IF(DATA_SISWA!B990=\"\",\"\",DATA_SISWA!B990)","v":""}]
[{"$f":"IF(DATA_SISWA!A991=\"\",\"\",DATA_SISWA!A991)","v":""},{"$f":"IF(DATA_SISWA!B991=\"\",\"\",DATA_SISWA!B991)","v":""}]
[{"$f":"IF(DATA_SISWA!A992=\"\",\"\",DATA_SISWA!A992)","v":""},{"$f":"IF(DATA_SISWA!B992=\"\",\"\",DATA_SISWA!B992)","v":""}]
[{"$f":"IF(DATA_SISWA!A993=\"\",\"\",DATA_SISWA!A993)","v":""},{"$f":"IF(DATA_SISWA!B993=\"\",\"\",DATA_SISWA!B993)","v":""}]
[{"$f":"IF(DATA_SISWA!A994=\"\",\"\",DATA_SISWA!A994)","v":""},{"$f":"IF(DATA_SISWA!B994=\"\",\"\",DATA_SISWA!B994)","v":""}]
[{"$f":"IF(DATA_SISWA!A995=\"\",\"\",DATA_SISWA!A995)","v":""},{"$f":"IF(DATA_SISWA!B995=\"\",\"\",DATA_SISWA!B995)","v":""}]
[{"$f":"IF(DATA_SISWA!A996=\"\",\"\",DATA_SISWA!A996)","v":""},{"$f":"IF(DATA_SISWA!B996=\"\",\"\",DATA_SISWA!B996)","v":""}]
[{"$f":"IF(DATA_SISWA!A997=\"\",\"\",DATA_SISWA!A997)","v":""},{"$f":"IF(DATA_SISWA!B997=\"\",\"\",DATA_SISWA!B997)","v":""}]
[{"$f":"IF(DATA_SISWA!A998=\"\",\"\",DATA_SISWA!A998)","v":""},{"$f":"IF(DATA_SISWA!B998=\"\",\"\",DATA_SISWA!B998)","v":""}]
[{"$f":"IF(DATA_SISWA!A999=\"\",\"\",DATA_SISWA!A999)","v":""},{"$f":"IF(DATA_SISWA!B999=\"\",\"\",DATA_SISWA!B999)","v":""}]
[{"$f":"IF(DATA_SISWA!A1000=\"\",\"\",DATA_SISWA!A1000)","v":""},{"$f":"IF(DATA_SISWA!B1000=\"\",\"\",DATA_SISWA!B1000)","v":""}]
[{"$f":"IF(DATA_SISWA!A1001=\"\",\"\",DATA_SISWA!A1001)","v":""},{"$f":"IF(DATA_SISWA!B1001=\"\",\"\",DATA_SISWA!B1001)","v":""}]
[{"$f":"IF(DATA_SISWA!A1002=\"\",\"\",DATA_SISWA!A1002)","v":""},{"$f":"IF(DATA_SISWA!B1002=\"\",\"\",DATA_SISWA!B1002)","v":""}]
[{"$f":"IF(DATA_SISWA!A1003=\"\",\"\",DATA_SISWA!A1003)","v":""},{"$f":"IF(DATA_SISWA!B1003=\"\",\"\",DATA_SISWA!B1003)","v":""}]
[{"$f":"IF(DATA_SISWA!A1004=\"\",\"\",DATA_SISWA!A1004)","v":""},{"$f":"IF(DATA_SISWA!B1004=\"\",\"\",DATA_SISWA!B1004)","v":""}]
[{"$f":"IF(DATA_SISWA!A1005=\"\",\"\",DATA_SISWA!A1005)","v":""},{"$f":"IF(DATA_SISWA!B1005=\"\",\"\",DATA_SISWA!B1005)","v":""}]
[{"$f":"IF(DATA_SISWA!A1006=\"\",\"\",DATA_SISWA!A1006)","v":""},{"$f":"IF(DATA_SISWA!B1006=\"\",\"\",DATA_SISWA!B1006)","v":""}]
[{"$f":"IF(DATA_SISWA!A1007=\"\",\"\",DATA_SISWA!A1007)","v":""},{"$f":"IF(DATA_SISWA!B1007=\"\",\"\",DATA_SISWA!B1007)","v":""}]
["x","x","x","x"]

{"sheet":"CETAK","index":3,"n_rows":18,"n_cols":22,"rows_kept":18,"cut":false,"hidden":false,"merged":[[1,20,2,24],[13,5,13,8],[17,5,17,8],[12,5,12,8],[12,11,13,15],[14,11,14,15],[5,4,5,8],[5,12,6,17],[5,21,5,22],[6,4,6,8],[6,21,7,22],[7,4,7,8],[8,4,8,8],[8,21,8,22],[9,21,10,22],[16,11,17,11],[16,12,17,16],[9,11,11,15],[9,4,9,6]]}
[]
[null,null,null,null,null,null,null,null,null,null,null,null,null,null,null,null,null,null,null,null,"Design by : Salih Sapari, SE"]
[]
[]
[]
[null,null,"Nama Lengkap",":",{"$f":"UPPER(INDEX(DATA_SISWA,NO,2))","v":"SAFA FITRI ANGGRAINI"},null,null,null,null,null,null,null,{"$f":"INDEX(DATA_SISWA,NO,5)","v":0},null,null,null,null,null,null,null,null,"No Urut Ke"]
[null,null,"Tempat, Tgl. Lahir",":",{"$f":"PROPER(INDEX(DATA_SISWA,NO,6))&\", \"&TEXT(INDEX(DATA_SISWA,NO,7),\"dd mmmm yyyy\")","v":"Bogor, 27 September 2009"},null,null,null,null,null,null,null,null,null,null,null,null,null,null,null,null,1]
[null,null,"Jenis Kelamin",":",{"$f":"IF(PROPER(INDEX(DATA_SISWA,NO,3))=\"L\",\"Laki-laki\",\"Perempuan\")","v":"Perempuan"}]
[null,null,"Alamat",":",{"$f":"PROPER(INDEX(DATA_SISWA,NO,9))&\", \"&PROPER(INDEX(DATA_SISWA,NO,10))&\"/\"&PROPER(INDEX(DATA_SISWA,NO,11))&\" - \"&PROPER(INDEX(DATA_SISWA,NO,12))","v":", / - Labruk Kidul"},null,null,null,null,null,null,null,null,null,null,null,null,null,null,null,null,"Dari"]
[null,null,"NISN",":",{"$f":"INDEX(DATA_SISWA,NO,5)","v":0},null,null,null,null,null,null,"Kartu Pelajar",null,null,null,null,null,null,null,null,null,{"$f":"COUNTA(NO_URUT)","v":42}]
[]
[]
[null,null,null,null,null,{"$f":"Kec&\", \"&TEXT(PROFIL!$C$5,\"dd mmmm yyyy\")","v":"Sumbersuko, 18 Juli 2017"},null,null,null,null,null,{"$f":"PROFIL!$C$6","v":"MIS NURUL ISLAM LABRUK KIDUL "}]
[null,null,null,null,null,"Mi. Al Ishlah Sumberanyar"]
[null,null,null,null,null,null,null,null,null,null,null,{"$f":"PROFIL!$C$7","v":"Desa Labruk Kidul"}]
[]
[null,null,null,null,null,{"$f":"PROFIL!$C$13","v":"SAHRONI, S.Pd"},null,null,null,null,null,"No Kartu :",{"$f":"INDEX(DATA_SISWA,NO,4)","v":0}]
[null,null,null,null,null,{"$f":"\"NIP. \"&PROFIL!$C$14","v":"NIP. -"}]

{"sheet":"TEMPLATE","index":4,"n_rows":0,"n_cols":0,"rows_kept":0,"cut":false,"hidden":true,"merged":[[5,3,5,7],[5,10,7,13],[6,3,6,7],[1,3,1,7],[1,11,2,16],[2,3,2,7],[3,3,3,7],[4,3,4,7],[19,3,19,7],[8,4,8,7],[8,10,8,13],[9,4,9,7],[10,10,11,13],[12,10,12,13],[13,4,13,7],[14,4,14,7],[14,10,14,16],[17,3,17,7],[17,11,18,16],[18,3,18,7],[20,3,20,7],[21,3,21,7],[21,10,23,13],[22,3,22,7],[24,4,24,7],[24,10,24,13],[37,3,37,7],[37,10,39,13],[38,3,38,7],[25,4,25,7],[26,10,27,13],[28,10,28,13],[29,4,29,7],[30,4,30,7],[30,10,30,16],[33,3,33,7],[33,11,34,16],[34,3,34,7],[35,3,35,7],[36,3,36,7],[51,3,51,7],[40,4,40,7],[40,10,40,13],[41,4,41,7],[42,10,43,13],[44,10,44,13],[45,4,45,7],[46,4,46,7],[46,10,46,16],[49,3,49,7],[49,11,50,16],[50,3,50,7],[52,3,52,7],[53,3,53,7],[53,10,55,13],[54,3,54,7],[56,4,56,7],[56,10,56,13],[69,3,69,7],[69,10,71,13],[70,3,70,7],[57,4,57,7],[58,10,59,13],[60,10,60,13],[61,4,61,7],[62,4,62,7],[62,10,62,16],[65,3,65,7],[65,11,66,16],[66,3,66,7],[67,3,67,7],[68,3,68,7],[78,4,78,7],[78,10,78,16],[72,4,72,7],[72,10,72,13],[73,4,73,7],[74,10,75,13],[76,10,76,13],[77,4,77,7]]}

{"sheet":"STEMPEL","index":5,"n_rows":10,"n_cols":5,"rows_kept":10,"cut":false,"hidden":false,"merged":[]}
[]
[]
[]
[]
[]
[null,null,null,null,"SUMBERANYAR "]
[null,null,null,null,"MADRASAH IBTIDAIYAH MAARIF NU"]
[null,null,null,null,"MI. AL ISHLAH"]
[null,null,null,null,"111235080146"]
[null,null,null,null,"KEC. ROWOKANGKUNG"]