{"text_format":"1","workbook":"xlsx","n_sheets":7,"sheets":["DATA SISWA","KKM","REKAP NILAI","RAPOR","olahan nilai","HITUNGAN UTS (ABAIKAN)","HITUNGAN UTS (ABAIKAN) (2)"],"not_rendered":{"charts":0,"images":3,"macros":1,"external_links":1,"defined_names":4,"comments":0,"pivot_tables":0},"unopened":[],"bounds":{"document_bytes":16777216,"sheet_cells":100000,"rows_first":2000,"rows_last":500,"rows_between":2000,"halvings":0,"cell_chars":16384,"cell_head_chars":4096},"cells_cut":0,"cells_raw":0,"read":"whole","date_system":"1900"}

{"sheet":"DATA SISWA","index":0,"n_rows":72,"n_cols":16,"rows_kept":72,"cut":false,"hidden":false,"merged":[[0,0,0,7]]}
["PROFIL SEKOLAH",null,null,null,null,null,null,null,null,"made by Chusni Kurniawan"]
[null,"NAMA SATUAN PENDIDIKAN",null,":","MI NURUL ISLAM LABRUK KIDUL",null,null,null,null,"(c.kurniawan@ymail.com)"]
[null,"KEPALA MADRASAH",null,":","SAHRONI,S.Pd.I"]
[null,"KELAS",null,":","IV (EMPAT) A",null,null,null,null,null,null,{"$f":"B4&\" \"&E4","v":"KELAS IV (EMPAT) A"}]
[null,"WALI KELAS",null,":","CHUSNI KURNIAWAN,S.Pd.",null,null,null,null,null,null,{"$f":"B5&\" \"&E4","v":"WALI KELAS IV (EMPAT) A"}]
[null,"SEMESTER",null,":","II (GENAP)",null,null,null,null,null,{"$f":"B6&\" \"&E6","v":"SEMESTER II (GENAP)"},{"$f":"E8&\" \"&E6","v":"UJIAN TENGAH SEMESTER II (GENAP)"},"I (SATU) A","UJIAN SEMESTER","2014/2015","I (GANJIL)"]
[null,"TAHUN PELAJARAN",null,":","2017/2018",null,null,null,null,null,null,{"$f":"B7&\" \"&E7","v":"TAHUN PELAJARAN 2017/2018"},"I (SATU) B","UJIAN TENGAH SEMESTER","2015/2016","II (GENAP)"]
[null,"JUDUL RAPORT",null,":","UJIAN TENGAH SEMESTER",null,null,null,null,null,null,null,"II (DUA) A",null,"2016/2017"]
[null,"Tempat&Tgl PENERIMAAN RAPOR",null,":","Labruk kidul, 28 April 2018",null,null,null,null,null,null,null,"II (DUA) B",null,"2017/2018"]
[null,null,null,null,null,null,null,null,null,null,null,null,"III (TIGA) A",null,"2018/2019"]
["NO","NISN","NO.INDUK","NAMA SISWA","NAMA PANGGILAN","TEMPAT LAHIR","TANGGAL LAHIR","NAMA ORTU","PESAN WALI KELAS TERHADAP NILAI (BARIS 1)","PESAN WALI KELAS TERHADAP NILAI (BARIS 2)","rank",null,"III (TIGA) B",null,"2019/2020"]
[1,2,3,4,5,6,7,8,9,10,11,12,"IV (EMPAT) A"]
[1,"0078140536",4331,"ACHMAD FATHIR IZUDDIN","FATIR","Lumajang","2007-11-09","NURUDDIN",{"$f":"IF(K13>20,\"Jangan malas belajar, lebih giat dalam belajar!\",IF(K13>10,\"Pacu Semangat Belajarmu,& Tingkatkan nilaimu!\",IF(K13>1,\"Pertahankan Nilaimu, jangan lengah belajar!\",\"Jangan Lengah, terus semangat belajar\")))","v":"Jangan malas belajar, lebih giat dalam belajar!"},"-",{"$f":"VALUE('REKAP NILAI'!AB7)","v":21},{"$f":"F13&\", \"&TEXT(G13,\"dd mmmm yyyy\")","v":"Lumajang, 09 November 2007"},"IV (EMPAT) B"]
[2,"0075656390",4361,"ACHMAD SEPTIAN HAMDANI","DANI","LUMAJANG","2007-09-10","SYAIFUL ARIS",{"$f":"IF(K14>20,\"Jangan malas belajar, lebih giat dalam belajar!\",IF(K14>10,\"Pacu Semangat Belajarmu,& Tingkatkan nilaimu!\",IF(K14>1,\"Pertahankan Nilaimu, jangan lengah belajar!\",\"Jangan Lengah, terus semangat belajar\")))","v":"Jangan malas belajar, lebih giat dalam belajar!"},"-",{"$f":"VALUE('REKAP NILAI'!AB8)","v":30},{"$f":"F14&\", \"&TEXT(G14,\"dd mmmm yyyy\")","v":"LUMAJANG, 10 September 2007"},"V (LIMA) A"]
[3,"0071796138",4362,"ACHMAD SULAIMAN","SULAIMAN","LUMAJANG","2007-07-26","AGUS SULAIMAN","Jangan malas belajar, lebih giat dalam belajar!","-",{"$f":"VALUE('REKAP NILAI'!AB9)","v":33},"LUMAJANG, 26 Juli 2007","V (LIMA) B"]
[4,"0084691896",4333,"AININ NAFISA FEBRIYANTI","AININ","Lumajang","2008-02-12","SUBOWO","Pertahankan Nilaimu, jangan lengah belajar!","-",{"$f":"VALUE('REKAP NILAI'!AB10)","v":6},"Lumajang, 12 Februari 2008","VI (ENAM) A"]
[5,"0075488897",4334,"AISYAH DWI ANDINI","ANDIN","Lumajang","2007-09-30","SAIFUL ANAM","Pertahankan Nilaimu, jangan lengah belajar!","-",{"$f":"VALUE('REKAP NILAI'!AB11)","v":2},"Lumajang, 30 September 2007","VI (ENAM) B"]
[6,null,4335,"AJENG AGUSTINA KIRANA PUTRI","AJENG","HANAU","2007-07-31","SUKIRNO","Pertahankan Nilaimu, jangan lengah belajar!","-",{"$f":"VALUE('REKAP NILAI'!AB12)","v":7},"HANAU, 31 Juli 2007"]
[7,"0078831956",4336,"ALVIAN FAIZULHAQQI","VIAN","Lumajang","2007-05-20","MUKHAMAD FAUZI","Pacu Semangat Belajarmu,& Tingkatkan nilaimu!","-",{"$f":"VALUE('REKAP NILAI'!AB13)","v":11},"Lumajang, 20 Mei 2007"]
[8,"0073667130",4337,"ANGGITA RIZKY YUGA MEISYA","ANGGI","Lumajang","2007-05-31","GALIH DWI APRIYANTO","Pertahankan Nilaimu, jangan lengah belajar!","-",{"$f":"VALUE('REKAP NILAI'!AB14)","v":5},"Lumajang, 31 Mei 2007"]
{"$rows_left_out":53}
{"sheet":"KKM","index":1,"n_rows":25,"n_cols":4,"rows_kept":25,"cut":false,"hidden":false,"merged":[]}
[]
["Pendidikan Agama"]
["a","Alquran Hadits","=",70]
["b","Aqidah Akhlak","=",70]
["c","Fiqih","=",70]
["d","Sejarah Kebudayaan Islam","=",70]
["PPKn",null,"=",70]
["B.Indonesia",null,"=",70]
["B. Arab",null,"=",70]
["Matematika",null,"=",70]
["IPA",null,"=",70]
["IPS",null,"=",70]
["Seni Budaya dan Prakarya",null,"=",75]
["Pend. Jasmani OR & Kesehatan",null,"=",75]
["Muatan Lokal :"]
["a","B. Daerah","=",70]
["b","B. Inggris","=",65]
["c","Aswaja","=",70]
["d","Nahwu-Shorof","=",70]
[]
{"$rows_left_out":6}
{"sheet":"REKAP NILAI","index":2,"n_rows":77,"n_cols":33,"rows_kept":77,"cut":false,"hidden":false,"merged":[[66,0,66,1],[67,0,67,1],[68,0,68,1],[69,0,69,1],[0,0,0,27],[1,0,1,27],[4,0,5,0],[4,1,5,1],[4,27,5,27],[2,15,2,20],[2,21,2,27],[4,24,4,26]]}
[{"$f":"'DATA SISWA'!L6","v":"UJIAN TENGAH SEMESTER II (GENAP)"}]
[{"$f":"'DATA SISWA'!L7","v":"TAHUN PELAJARAN 2017/2018"}]
["NAMA MADRASAH",null,":",{"$f":"'DATA SISWA'!E2","v":"MI NURUL ISLAM LABRUK KIDUL"},null,null,null,null,null,null,null,null,null,null,null,{"$f":"'DATA SISWA'!L4","v":"KELAS IV (EMPAT) A"},null,null,null,null,null,null,null,null,null,null,null,null,null,"TEMPAT LAHIR","TANGGAL LAHIR","ORANG TUA","NO. INDUK"]
[1,2,3,4,5,6,7,8,9,10,11,12,13,14,15,16,17,18,19,20,21,22,23,24,null,null,null,25]
["No. Absen","Nama Siswa",{"$f":"KKM!B3","v":"Alquran Hadits"},{"$f":"KKM!B4","v":"Aqidah Akhlak"},{"$f":"KKM!B5","v":"Fiqih"},{"$f":"KKM!B6","v":"Sejarah Kebudayaan Islam"},{"$f":"KKM!A7","v":"PPKn"},{"$f":"KKM!A8","v":"B.Indonesia"},{"$f":"KKM!A9","v":"B. Arab"},{"$f":"KKM!A10","v":"Matematika"},{"$f":"KKM!A11","v":"IPA"},{"$f":"KKM!A12","v":"IPS"},{"$f":"KKM!A13","v":"Seni Budaya dan Prakarya"},{"$f":"KKM!A14","v":"Pend. Jasmani OR & Kesehatan"},{"$f":"KKM!B16","v":"B. Daerah"},{"$f":"KKM!B17","v":"B. Inggris"},{"$f":"KKM!B18","v":"Aswaja"},{"$f":"KKM!B19","v":"Nahwu-Shorof"},{"$f":"KKM!B22","v":"TIK"},{"$f":"KKM!B23","v":"Ulangan"},{"$f":"KKM!B24","v":0},{"$f":"KKM!B25","v":0},"JUMLAH","Rata-rata","ABSENSI",null,null,"Peringkat"]
[null,null,"UTS","UTS","UTS","UTS","UTS","UTS","UTS","UTS","UTS","UTS","UTS","UTS","UTS","UTS","UTS","UTS","UTS","UTS","UTS","UTS","UTS","UTS","S","I","A"]
[1,{"$f":"IF('DATA SISWA'!D13=0,\"\",'DATA SISWA'!D13)","v":"ACHMAD FATHIR IZUDDIN"},85,47,80,45,70,75,40,80,70,70,70,80,40,70,63,60,null,null,null,null,{"$f":"SUM(C7:T7)","v":1045},{"$f":"IF(ISERROR(AVERAGE(C7:T7)),\"\",AVERAGE(C7:T7))","v":65.3125},"1",null,null,{"$f":"RANK(W7,$W$7:$W$66)","v":21},null,{"$f":"'[1]DATA SISWA'!D10","v":"Lumajang"},{"$f":"'[1]DATA SISWA'!E10","v":"2004-07-14"},{"$f":"'[1]DATA SISWA'!F10","v":"Achmad Kamali Alfan"},{"$f":"'[1]DATA SISWA'!B10","v":4121}]
[2,{"$f":"IF('DATA SISWA'!D14=0,\"\",'DATA SISWA'!D14)","v":"ACHMAD SEPTIAN HAMDANI"},60,44,85,43,70,60,40,60,60,60,72.5,80,30,60,71,70,null,null,null,null,{"$f":"SUM(C8:T8)","v":965.5},{"$f":"IF(ISERROR(AVERAGE(C8:T8)),\"\",AVERAGE(C8:T8))","v":60.34375},"2",null,null,{"$f":"RANK(W8,$W$7:$W$66)","v":30},null,{"$f":"'[1]DATA SISWA'!D11","v":"Lumajang"},{"$f":"'[1]DATA SISWA'!E11","v":"2003-07-16"},{"$f":"'[1]DATA SISWA'!F11","v":"Imam Nawawi"},{"$f":"'[1]DATA SISWA'!B11","v":4090}]
[3,{"$f":"IF('DATA SISWA'!D15=0,\"\",'DATA SISWA'!D15)","v":"ACHMAD SULAIMAN"},60,25,70,32,70,60,40,55,60,60,80,80,30,70,63,60,null,null,null,null,{"$f":"SUM(C9:T9)","v":915},{"$f":"IF(ISERROR(AVERAGE(C9:T9)),\"\",AVERAGE(C9:T9))","v":57.1875},"5",null,null,{"$f":"RANK(W9,$W$7:$W$66)","v":33},null,{"$f":"'[1]DATA SISWA'!D12","v":"Lumajang"},{"$f":"'[1]DATA SISWA'!E12","v":"2002-07-21"},{"$f":"'[1]DATA SISWA'!F12","v":"Moch. Basuni"},{"$f":"'[1]DATA SISWA'!B12","v":4124}]
[4,{"$f":"IF('DATA SISWA'!D16=0,\"\",'DATA SISWA'!D16)","v":"AININ NAFISA FEBRIYANTI"},85,65,85,54,70,80,45,86.666666666666671,75,78,80,80,60,70,75,70,null,null,null,null,{"$f":"SUM(C10:T10)","v":1158.6666666666665},{"$f":"IF(ISERROR(AVERAGE(C10:T10)),\"\",AVERAGE(C10:T10))","v":72.416666666666657},null,null,null,{"$f":"RANK(W10,$W$7:$W$66)","v":6},null,{"$f":"'[1]DATA SISWA'!D13","v":"Lumajang"},{"$f":"'[1]DATA SISWA'!E13","v":"2003-04-04"},{"$f":"'[1]DATA SISWA'!F13","v":"Zainul Atim Slamet"},{"$f":"'[1]DATA SISWA'!B13","v":4091}]
[5,{"$f":"IF('DATA SISWA'!D17=0,\"\",'DATA SISWA'!D17)","v":"AISYAH DWI ANDINI"},85,95,85,76,70,80,44,83.333333333333329,70,70,76.666666666666671,80,50,70,73,70,null,null,null,null,1178,73.625,"1","1","1",{"$f":"RANK(W11,$W$7:$W$66)","v":2},null,{"$f":"'[1]DATA SISWA'!D14","v":"Lumajang"},{"$f":"'[1]DATA SISWA'!E14","v":"2003-07-06"},{"$f":"'[1]DATA SISWA'!F14","v":"Slamet Riyadi"},{"$f":"'[1]DATA SISWA'!B14","v":4092}]
[6,{"$f":"IF('DATA SISWA'!D18=0,\"\",'DATA SISWA'!D18)","v":"AJENG AGUSTINA KIRANA PUTRI"},85,64,85,37,70,80,48,83.333333333333329,75,78,76.666666666666671,80,70,70,83,70,null,null,null,null,1155,72.1875,"2",null,null,7,null,{"$f":"'[1]DATA SISWA'!D15","v":"Lumajang"},{"$f":"'[1]DATA SISWA'!E15","v":"2003-08-12"},{"$f":"'[1]DATA SISWA'!F15","v":"Mochamad Amin"},{"$f":"'[1]DATA SISWA'!B15","v":4093}]
[7,{"$f":"IF('DATA SISWA'!D19=0,\"\",'DATA SISWA'!D19)","v":"ALVIAN FAIZULHAQQI"},85,65,85,23,70,75,45,82,70,70,80,80,65,60,77,60,null,null,null,null,1092,68.25,"3",null,"2",11,null,{"$f":"'[1]DATA SISWA'!D16","v":"Lumajang"},{"$f":"'[1]DATA SISWA'!E16","v":"2003-11-13"},{"$f":"'[1]DATA SISWA'!F16","v":"Mukhamad Fauzi"},{"$f":"'[1]DATA SISWA'!B16","v":4136}]
[8,{"$f":"IF('DATA SISWA'!D20=0,\"\",'DATA SISWA'!D20)","v":"ANGGITA RIZKY YUGA MEISYA"},80,67,85,45,70,75,59,80,75,78,70,80,65,70,90,70,null,null,null,null,1159,72.4375,"1",null,null,5,null,{"$f":"'[1]DATA SISWA'!D17","v":"Sidoarjo,"},{"$f":"'[1]DATA SISWA'!E17","v":"2003-10-29"},{"$f":"'[1]DATA SISWA'!F17","v":0},{"$f":"'[1]DATA SISWA'!B17","v":4094}]
[9,{"$f":"IF('DATA SISWA'!D21=0,\"\",'DATA SISWA'!D21)","v":"AUFAN AZKAL ABRORI"},80,44,85,43,70,70,50,81.666666666666671,70,70,77.333333333333329,80,50,70,63,60,null,null,null,null,1064,66.5,null,null,null,18,null,{"$f":"'[1]DATA SISWA'!D18","v":"Lumajang"},{"$f":"'[1]DATA SISWA'!E18","v":"2003-09-11"},{"$f":"'[1]DATA SISWA'!F18","v":"Samsuhar"},{"$f":"'[1]DATA SISWA'!B18","v":4095}]
[10,{"$f":"IF('DATA SISWA'!D22=0,\"\",'DATA SISWA'!D22)","v":"AURA SALSABILA WULAN SARI"},85,79,85,50,70,70,55,80,75,78,84.5,83,55,70,88,70,null,null,null,null,1177.5,73.59375,"3",null,"1",3,null,{"$f":"'[1]DATA SISWA'!D19","v":"Lumajang"},{"$f":"'[1]DATA SISWA'!E19","v":"2003-06-15"},{"$f":"'[1]DATA SISWA'!F19","v":"Wahyudi"},{"$f":"'[1]DATA SISWA'!B19","v":4135}]
[11,{"$f":"IF('DATA SISWA'!D23=0,\"\",'DATA SISWA'!D23)","v":"AZZA PRISHAL DWI PUTRA"},75,35,75,47,70,70,56,72.5,70,70,75,80,70,60,63,60,null,null,null,null,1048.5,65.53125,null,null,null,20,null,{"$f":"'[1]DATA SISWA'!D20","v":"Lumajang"},{"$f":"'[1]DATA SISWA'!E20","v":"2003-10-23"},{"$f":"'[1]DATA SISWA'!F20","v":"Sukadi"},{"$f":"'[1]DATA SISWA'!B20","v":4096}]
[12,{"$f":"IF('DATA SISWA'!D24=0,\"\",'DATA SISWA'!D24)","v":"BALQIS NAILA AUDIA"},85,86,85,76,70,80,77,90,75,78,70,82,60,70,88,70,null,null,null,null,1242,77.625,null,null,null,1,null,{"$f":"'[1]DATA SISWA'!D21","v":"Lumajang"},{"$f":"'[1]DATA SISWA'!E21","v":"2003-11-04"},{"$f":"'[1]DATA SISWA'!F21","v":"Zainul Muttaqin"},{"$f":"'[1]DATA SISWA'!B21","v":4097}]
[13,{"$f":"IF('DATA SISWA'!D25=0,\"\",'DATA SISWA'!D25)","v":"BIMA SATRIA DIRGANTARA"},80,54,85,37,70,70,48,81.666666666666671,70,70,74.333333333333329,83,30,70,73,60,null,null,null,null,1056,66,"3",null,"1",19,null,{"$f":"'[1]DATA SISWA'!D22","v":"Kampar"},{"$f":"'[1]DATA SISWA'!E22","v":"2002-11-09"},{"$f":"'[1]DATA SISWA'!F22","v":"Kastin"},{"$f":"'[1]DATA SISWA'!B22","v":4061}]
[14,{"$f":"IF('DATA SISWA'!D26=0,\"\",'DATA SISWA'!D26)","v":"DEVI KARUNIA RATNA PUTRI"},85,80,85,44,70,80,49,80,75,78,75,80,65,70,83,65,null,null,null,null,1164,72.75,"1",null,null,4,null,{"$f":"'[1]DATA SISWA'!D23","v":"Lumajang"},{"$f":"'[1]DATA SISWA'!E23","v":"2003-05-18"},{"$f":"'[1]DATA SISWA'!F23","v":"Kholiqul Sulton"},{"$f":"'[1]DATA SISWA'!B23","v":4099}]
{"$rows_left_out":58}
{"sheet":"RAPOR","index":3,"n_rows":55,"n_cols":11,"rows_kept":55,"cut":false,"hidden":false,"merged":[[17,6,18,6],[17,8,18,8],[11,4,11,8],[12,4,12,8],[13,4,13,8],[15,4,15,8],[17,7,18,7],[14,4,14,8],[42,5,42,7],[42,0,42,4],[7,0,7,8],[8,0,8,8],[9,0,9,8],[19,1,19,4],[24,1,24,4],[25,1,25,4],[26,1,26,4],[27,1,27,4],[28,1,28,4],[29,1,29,4],[30,1,30,4],[31,1,31,4],[17,0,18,0],[17,1,18,4],[46,7,46,8],[47,7,47,8],[43,0,43,4],[43,6,43,7],[9,10,10,10],[20,2,20,4],[21,2,21,4],[22,2,22,4],[38,2,38,4],[32,1,32,4],[37,1,37,4],[11,10,13,10],[23,2,23,4],[39,2,39,4],[40,2,40,4],[41,2,41,4]]}
[]
[]
[]
[]
[]
[]
[]
["DAFTAR NILAI"]
[{"$f":"'DATA SISWA'!L6","v":"UJIAN TENGAH SEMESTER II (GENAP)"}]
[{"$f":"'DATA SISWA'!L7","v":"TAHUN PELAJARAN 2017/2018"}]
[]
["N a m a",null,null,": ",{"$f":"UPPER(VLOOKUP($K$12,'DATA SISWA'!$A$13:$P$72,4,0))","v":"INES ARIFANI MAULINA"},null,null,null,null,null,25]
["Tempat,Tanggal Lahir",null,null,": ",{"$f":"PROPER(VLOOKUP($K$12,'DATA SISWA'!$A$13:$P$72,12,0))","v":"Lumajang, 04 April 2008"}]
["Nama Orang Tua",null,null,": ",{"$f":"PROPER(VLOOKUP($K$12,'DATA SISWA'!$A$13:$P$72,8,0))","v":"Mohamad Badri"}]
["Nomor Induk",null,null,": ",{"$f":"VLOOKUP($K$12,'DATA SISWA'!$A$13:$P$72,3,0)","v":4634}]
["NISN",null,null,": ",{"$f":"IF(VLOOKUP($K$12,'DATA SISWA'!$A$13:$P$72,2,0)=0,\"-\",VLOOKUP($K$12,'DATA SISWA'!$A$13:$P$72,2,0))","v":"0081758949"}]
[]
["NO","Mata Pelajaran",null,null,null,"NILAI ","KKM","Predikat","DESKRIPSI"]
[null,null,null,null,null,"UTS"]
["1.","Pendidikan Agama",null,null,null,null,null,{"$f":"IF(F20<G20,\"C\",IF(F20>G20,\"B\",\"\"))","v":""}]
{"$rows_left_out":36}
{"sheet":"olahan nilai","index":4,"n_rows":65,"n_cols":42,"rows_kept":65,"cut":false,"hidden":false,"merged":[[3,22,3,25],[3,0,4,0],[3,1,4,1],[0,0,0,45],[1,0,1,45],[3,2,3,5],[3,26,3,29],[3,30,3,33],[3,34,3,37],[3,38,3,41],[3,42,3,45],[3,6,3,9],[3,10,3,13],[3,14,3,17],[3,18,3,21]]}
["OLAHAN NILAI"]
[]
[]
["NO","NAMA","QH",null,null,null,"FQ",null,null,null,"PKN",null,null,null,"BID",null,null,null,"MTK",null,null,null,"IPA",null,null,null,"IPS",null,null,null,"SBDP(KTK)",null,null,null,"BIG",null,null,null,"AW"]
[null,null,1,2,"PTS","JML",1,2,"PTS","JML",1,2,"PTS","JML",1,2,"PTS","JML",1,2,"PTS","JML",1,2,"PTS","JML",1,2,"PTS","JML",1,2,"PTS","JML",1,2,"PTS","JML",1,2,"PTS","JML"]
[1,"ACHMAD FATHIR IZUDDIN",90,null,null,{"$f":"AVERAGE(C6:E6)","v":90},70,90,null,{"$f":"AVERAGE(G6:I6)","v":80},65,null,null,{"$f":"AVERAGE(K6:M6)","v":65},70,80,null,75,80,80,null,80,65,null,null,{"$f":"AVERAGE(W6:Y6)","v":65},65,null,null,{"$f":"AVERAGE(AA6:AC6)","v":65},70,null,null,{"$f":"AVERAGE(AE6:AG6)","v":70},70,null,null,{"$f":"AVERAGE(AI6:AK6)","v":70},63,null,null,{"$f":"AVERAGE(AM6:AO6)","v":63}]
[2,"ACHMAD SEPTIAN HAMDANI",60,null,null,{"$f":"AVERAGE(C7:E7)","v":60},80,90,null,{"$f":"AVERAGE(G7:I7)","v":85},65,null,null,{"$f":"AVERAGE(K7:M7)","v":65},60,null,null,60,50,70,null,60,65,null,null,{"$f":"AVERAGE(W7:Y7)","v":65},65,null,null,{"$f":"AVERAGE(AA7:AC7)","v":65},70,null,75,{"$f":"AVERAGE(AE7:AG7)","v":72.5},60,null,null,{"$f":"AVERAGE(AI7:AK7)","v":60},71,null,null,{"$f":"AVERAGE(AM7:AO7)","v":71}]
[3,"ACHMAD SULAIMAN",60,null,null,60,50,90,null,70,65,null,null,65,60,null,null,60,50,60,null,55,65,null,null,65,65,null,null,65,80,null,80,80,70,null,null,70,63,null,null,63]
[4,"AININ NAFISA FEBRIYANTI",90,null,null,90,80,90,null,85,65,null,null,65,70,80,90,80,80,80,100,86.666666666666671,65,null,null,65,65,null,null,65,80,null,null,80,70,null,null,70,75,null,null,75]
[5,"AISYAH DWI ANDINI",90,null,null,90,80,90,null,85,65,null,null,65,70,80,90,80,80,70,100,83.333333333333329,65,null,null,65,65,null,null,65,70,80,80,76.666666666666671,70,null,null,70,73,null,null,73]
[6,"AJENG AGUSTINA KIRANA PUTRI",90,null,null,90,80,90,null,85,65,null,null,65,70,80,90,80,80,70,100,83.333333333333329,65,null,null,65,65,null,null,65,70,80,80,76.666666666666671,70,null,null,70,83,null,null,83]
[7,"ALVIAN FAIZULHAQQI",90,null,null,90,80,90,null,85,65,null,null,65,70,80,null,75,76,70,100,82,65,null,null,65,65,null,null,65,90,70,null,80,60,null,null,60,77,null,null,77]
[8,"ANGGITA RIZKY YUGA MEISYA",90,null,null,90,80,90,null,85,65,null,null,65,70,80,null,75,90,70,null,80,65,null,null,65,65,null,null,65,70,null,null,70,70,null,null,70,90,null,null,90]
[9,"AUFAN AZKAL ABRORI",90,null,null,90,80,90,null,85,65,null,null,65,70,null,null,70,75,70,100,81.666666666666671,65,null,null,65,65,null,null,65,80,80,72,77.333333333333329,70,null,null,70,63,null,null,63]
[10,"AURA SALSABILA WULAN SARI",90,null,null,90,80,90,null,85,65,null,null,65,70,null,null,70,80,80,null,80,65,null,null,65,65,null,null,65,90,null,79,84.5,70,null,null,70,88,null,null,88]
[11,"AZZA PRISHAL DWI PUTRA",90,null,null,90,60,90,null,75,65,null,null,65,70,null,null,70,75,70,null,72.5,65,null,null,65,65,null,null,65,70,80,75,75,60,null,null,60,63,null,null,63]
[12,"BALQIS NAILA AUDIA",90,null,null,90,80,90,null,85,65,null,null,65,70,80,90,80,90,80,100,90,65,null,null,65,65,null,null,65,70,null,null,70,70,null,null,70,88,null,null,88]
[13,"BIMA SATRIA DIRGANTARA",90,null,null,90,80,90,null,85,65,null,null,65,70,null,null,70,65,80,100,81.666666666666671,65,null,null,65,65,null,null,65,70,80,73,74.333333333333329,70,null,null,70,73,null,null,73]
[14,"DEVI KARUNIA RATNA PUTRI",90,null,null,90,80,90,null,85,65,null,null,65,70,80,90,80,80,80,null,80,65,null,null,65,65,null,null,65,70,80,null,75,70,null,null,70,83,null,null,83]
[15,"DEVITA FEBRIANI PUTRI",90,null,null,90,80,90,null,85,65,null,null,65,70,null,90,80,80,80,100,86.666666666666671,65,null,null,65,65,null,null,65,70,80,null,75,70,null,null,70,85,null,null,85]
{"$rows_left_out":46}
{"sheet":"HITUNGAN UTS (ABAIKAN)","index":5,"n_rows":3,"n_cols":4,"rows_kept":3,"cut":false,"hidden":false,"merged":[]}
["ROM1",5,{"$f":"D1*B1","v":25},5]
["ROM2",10,{"$f":"D2/10*B2","v":14},14]
[null,null,null,{"$f":"SUM(C1:C2)","v":39}]

{"sheet":"HITUNGAN UTS (ABAIKAN) (2)","index":6,"n_rows":10,"n_cols":8,"rows_kept":10,"cut":false,"hidden":false,"merged":[]}
[null,"JML SOAL","JML POIN","POIN SEIMPURNA","MASUKKAN SKOR","MASUKKAN NILAINYA"]
["ROM1",15,1,{"$f":"B2*C2","v":15},5,"UNTUK ROM2"]
["ROM2",5,5,{"$f":"B3*C3","v":25},5]
["ROM3",5,10,50,5,14,1]
[null,null,null,"NILAI",{"$f":"SUM(E2:E4)/SUM(D2:D4)*100","v":16.666666666666664},1,2]
[null,null,null,null,null,7,3]
[null,null,null,null,null,3,4]
[null,null,null,null,null,{"$f":"AVERAGE(H8:H10)","v":13.333333333333334},5,14]
[null,null,null,null,null,null,null,14]
[null,null,null,null,null,null,null,12]