{"text_format":"1","workbook":"xlsx","n_sheets":6,"sheets":["DATA SISWA","KKM","REKAP NILAI","RAPOR","HITUNGAN UTS (ABAIKAN)","HITUNGAN UTS (ABAIKAN) (2)"],"not_rendered":{"charts":0,"images":1,"macros":1,"external_links":1,"defined_names":4,"comments":0,"pivot_tables":0},"unopened":[],"bounds":{"document_bytes":16777216,"sheet_cells":100000,"rows_first":2000,"rows_last":500,"rows_between":2000,"halvings":0,"cell_chars":16384,"cell_head_chars":4096},"cells_cut":0,"cells_raw":0,"read":"whole","date_system":"1900"}

{"sheet":"DATA SISWA","index":0,"n_rows":72,"n_cols":16,"rows_kept":72,"cut":false,"hidden":false,"merged":[[0,0,0,7]]}
["PROFIL SEKOLAH",null,null,null,null,null,null,null,null,"made by Chusni Kurniawan"]
[null,"NAMA SATUAN PENDIDIKAN",null,":","MI NURUL ISLAM LABRUK KIDUL",null,null,null,null,"(c.kurniawan@ymail.com)"]
[null,"KEPALA MADRASAH",null,":","SAHRONI,S.Pd.I"]
[null,"KELAS",null,":","IV (EMPAT) A",null,null,null,null,null,null,{"$f":"B4&\" \"&E4","v":"KELAS IV (EMPAT) A"}]
[null,"WALI KELAS",null,":","CHUSNI KURNIAWAN,S.Pd.",null,null,null,null,null,null,{"$f":"B5&\" \"&E4","v":"WALI KELAS IV (EMPAT) A"}]
[null,"SEMESTER",null,":","I (GANJIL)",null,null,null,null,null,{"$f":"B6&\" \"&E6","v":"SEMESTER I (GANJIL)"},{"$f":"E8&\" \"&E6","v":"UJIAN TENGAH SEMESTER I (GANJIL)"},"I (SATU) A","UJIAN SEMESTER","2014/2015","I (GANJIL)"]
[null,"TAHUN PELAJARAN",null,":","2017/2018",null,null,null,null,null,null,{"$f":"B7&\" \"&E7","v":"TAHUN PELAJARAN 2017/2018"},"I (SATU) B","UJIAN TENGAH SEMESTER","2015/2016","II (GENAP)"]
[null,"JUDUL RAPORT",null,":","UJIAN TENGAH SEMESTER",null,null,null,null,null,null,null,"II (DUA) A",null,"2016/2017"]
[null,"Tempat&Tgl PENERIMAAN RAPOR",null,":","Labruk kidul, 31 Oktober 2017",null,null,null,null,null,null,null,"II (DUA) B",null,"2017/2018"]
[null,null,null,null,null,null,null,null,null,null,null,null,"III (TIGA) A",null,"2018/2019"]
["NO","NISN","NO.INDUK","NAMA SISWA","NAMA PANGGILAN","TEMPAT LAHIR","TANGGAL LAHIR","NAMA ORTU","PESAN WALI KELAS TERHADAP NILAI (BARIS 1)","PESAN WALI KELAS TERHADAP NILAI (BARIS 2)","rank",null,"III (TIGA) B",null,"2019/2020"]
[1,2,3,4,5,6,7,8,9,10,11,12,"IV (EMPAT) A"]
[1,"0078140536",4331,"ACHMAD FATHIR IZUDDIN","FATHIR","Lumajang","2007-11-09","NURUDDIN",{"$f":"IF(K13>20,\"Jangan malas belajar, lebih giat dalam belajar!\",IF(K13>10,\"Pacu Semangat Belajarmu,& Tingkatkan nilaimu!\",IF(K13>1,\"Pertahankan Nilaimu, jangan lengah belajar!\",\"Jangan Lengah, terus semangat belajar\")))","v":"Pacu Semangat Belajarmu,& Tingkatkan nilaimu!"},"-",{"$f":"VALUE('REKAP NILAI'!AB7)","v":14},{"$f":"F13&\", \"&TEXT(G13,\"dd mmmm yyyy\")","v":"Lumajang, 09 November 2007"},"IV (EMPAT) B"]
[2,"0075656390",4361,"ACHMAD SEPTIAN HAMDANI","DANI","LUMAJANG","2007-09-10","SYAIFUL ARIS",{"$f":"IF(K14>20,\"Jangan malas belajar, lebih giat dalam belajar!\",IF(K14>10,\"Pacu Semangat Belajarmu,& Tingkatkan nilaimu!\",IF(K14>1,\"Pertahankan Nilaimu, jangan lengah belajar!\",\"Jangan Lengah, terus semangat belajar\")))","v":"Pacu Semangat Belajarmu,& Tingkatkan nilaimu!"},"-",{"$f":"VALUE('REKAP NILAI'!AB8)","v":13},{"$f":"F14&\", \"&TEXT(G14,\"dd mmmm yyyy\")","v":"LUMAJANG, 10 September 2007"},"V (LIMA) A"]
[3,"0071796138",4362,"ACHMAD SULAIMAN","SULAIMAN","LUMAJANG","2007-07-26","AGUS SULAIMAN","Jangan malas belajar, lebih giat dalam belajar!","-",{"$f":"VALUE('REKAP NILAI'!AB9)","v":32},"LUMAJANG, 26 Juli 2007","V (LIMA) B"]
[4,"0084691896",4333,"AININ NAFISA FEBRIYANTI","AININ","Lumajang","2008-02-12","SUBOWO","Pertahankan Nilaimu, jangan lengah belajar!","-",{"$f":"VALUE('REKAP NILAI'!AB10)","v":9},"Lumajang, 12 Februari 2008","VI (ENAM) A"]
[5,"0075488897",4334,"AISYAH DWI ANDINI","AISYAH","Lumajang","2007-09-30","SAIFUL ANAM","Pertahankan Nilaimu, jangan lengah belajar!","-",{"$f":"VALUE('REKAP NILAI'!AB11)","v":6},"Lumajang, 30 September 2007","VI (ENAM) B"]
[6,null,4335,"AJENG AGUSTINA KIRANA PUTRI","AJENG","HANAU","2007-07-31","SUKIRNO","Pertahankan Nilaimu, jangan lengah belajar!","-",{"$f":"VALUE('REKAP NILAI'!AB12)","v":4},"HANAU, 31 Juli 2007"]
[7,"0078831956",4336,"ALVIAN FAIZULHAQQI","VIAN","Lumajang","2007-05-20","MUKHAMAD FAUZI","Jangan malas belajar, lebih giat dalam belajar!","-",{"$f":"VALUE('REKAP NILAI'!AB13)","v":21},"Lumajang, 20 Mei 2007"]
[8,"0073667130",4337,"ANGGITA RIZKY YUGA MEISYA","ANGGI","Lumajang","2007-05-31","GALIH DWI APRIYANTO","Pertahankan Nilaimu, jangan lengah belajar!","-",{"$f":"VALUE('REKAP NILAI'!AB14)","v":2},"Lumajang, 31 Mei 2007"]
{"$rows_left_out":53}
{"sheet":"KKM","index":1,"n_rows":25,"n_cols":4,"rows_kept":25,"cut":false,"hidden":false,"merged":[]}
[]
["Pendidikan Agama"]
["a","Alquran Hadits","=",70]
["b","Aqidah Akhlak","=",70]
["c","Fiqih","=",70]
["d","Sejarah Kebudayaan Islam","=",70]
["PPKn",null,"=",70]
["B.Indonesia",null,"=",70]
["B. Arab",null,"=",70]
["Matematika",null,"=",70]
["IPA",null,"=",70]
["IPS",null,"=",70]
["Kertakes",null,"=",75]
["Penjaskes",null,"=",75]
["Muatan Lokal :"]
["a","B. Daerah","=",70]
["b","B. Inggris","=",65]
["c","Aswaja","=",70]
["d","Nahwu-Shorof","=",70]
[]
{"$rows_left_out":6}
{"sheet":"REKAP NILAI","index":2,"n_rows":66,"n_cols":33,"rows_kept":66,"cut":false,"hidden":false,"merged":[[0,0,0,27],[1,0,1,27],[4,0,5,0],[4,1,5,1],[4,27,5,27],[2,15,2,20],[2,21,2,27],[4,24,4,26]]}
[{"$f":"'DATA SISWA'!L6","v":"UJIAN TENGAH SEMESTER I (GANJIL)"}]
[{"$f":"'DATA SISWA'!L7","v":"TAHUN PELAJARAN 2017/2018"}]
["NAMA MADRASAH",null,":",{"$f":"'DATA SISWA'!E2","v":"MI NURUL ISLAM LABRUK KIDUL"},null,null,null,null,null,null,null,null,null,null,null,{"$f":"'DATA SISWA'!L4","v":"KELAS IV (EMPAT) A"},null,null,null,null,null,null,null,null,null,null,null,null,null,"TEMPAT LAHIR","TANGGAL LAHIR","ORANG TUA","NO. INDUK"]
[1,2,3,4,5,6,7,8,9,10,11,12,13,14,15,16,17,18,19,20,21,22,23,24,null,null,null,25]
["No. Absen","Nama Siswa",{"$f":"KKM!B3","v":"Alquran Hadits"},{"$f":"KKM!B4","v":"Aqidah Akhlak"},{"$f":"KKM!B5","v":"Fiqih"},{"$f":"KKM!B6","v":"Sejarah Kebudayaan Islam"},{"$f":"KKM!A7","v":"PPKn"},{"$f":"KKM!A8","v":"B.Indonesia"},{"$f":"KKM!A9","v":"B. Arab"},{"$f":"KKM!A10","v":"Matematika"},{"$f":"KKM!A11","v":"IPA"},{"$f":"KKM!A12","v":"IPS"},{"$f":"KKM!A13","v":"Kertakes"},{"$f":"KKM!A14","v":"Penjaskes"},{"$f":"KKM!B16","v":"B. Daerah"},{"$f":"KKM!B17","v":"B. Inggris"},{"$f":"KKM!B18","v":"Aswaja"},{"$f":"KKM!B19","v":"Nahwu-Shorof"},{"$f":"KKM!B22","v":"TIK"},{"$f":"KKM!B23","v":"Ulangan"},{"$f":"KKM!B24","v":0},{"$f":"KKM!B25","v":0},"JUMLAH","Rata-rata","ABSENSI",null,null,"Peringkat"]
[null,null,"UTS","UTS","UTS","UTS","UTS","UTS","UTS","UTS","UTS","UTS","UTS","UTS","UTS","UTS","UTS","UTS","UTS","UTS","UTS","UTS","UTS","UTS","S","I","A"]
[1,{"$f":"IF('DATA SISWA'!D13=0,\"\",'DATA SISWA'!D13)","v":"ACHMAD FATHIR IZUDDIN"},65,60,60,55,65,75,65,57,75,70,70,75,36,57,60,60,null,null,null,null,{"$f":"SUM(C7:T7)","v":1005},{"$f":"IF(ISERROR(AVERAGE(C7:T7)),\"\",AVERAGE(C7:T7))","v":62.8125},null,null,null,{"$f":"RANK(W7,$W$7:$W$66)","v":14},null,{"$f":"'[1]DATA SISWA'!D10","v":"Lumajang"},{"$f":"'[1]DATA SISWA'!E10","v":"2004-07-14"},{"$f":"'[1]DATA SISWA'!F10","v":"Achmad Kamali Alfan"},{"$f":"'[1]DATA SISWA'!B10","v":4121}]
[2,{"$f":"IF('DATA SISWA'!D14=0,\"\",'DATA SISWA'!D14)","v":"ACHMAD SEPTIAN HAMDANI"},65,68,70,78,65,60,65,46,65,70,70,75,36,36,68,70,null,null,null,null,{"$f":"SUM(C8:T8)","v":1007},{"$f":"IF(ISERROR(AVERAGE(C8:T8)),\"\",AVERAGE(C8:T8))","v":62.9375},null,null,null,{"$f":"RANK(W8,$W$7:$W$66)","v":13},null,{"$f":"'[1]DATA SISWA'!D11","v":"Lumajang"},{"$f":"'[1]DATA SISWA'!E11","v":"2003-07-16"},{"$f":"'[1]DATA SISWA'!F11","v":"Imam Nawawi"},{"$f":"'[1]DATA SISWA'!B11","v":4090}]
[3,{"$f":"IF('DATA SISWA'!D15=0,\"\",'DATA SISWA'!D15)","v":"ACHMAD SULAIMAN"},65,30,60,36,65,60,65,35,55,70,70,75,19,15,60,60,null,null,null,null,{"$f":"SUM(C9:T9)","v":840},{"$f":"IF(ISERROR(AVERAGE(C9:T9)),\"\",AVERAGE(C9:T9))","v":52.5},null,null,null,{"$f":"RANK(W9,$W$7:$W$66)","v":32},null,{"$f":"'[1]DATA SISWA'!D12","v":"Lumajang"},{"$f":"'[1]DATA SISWA'!E12","v":"2002-07-21"},{"$f":"'[1]DATA SISWA'!F12","v":"Moch. Basuni"},{"$f":"'[1]DATA SISWA'!B12","v":4124}]
[4,{"$f":"IF('DATA SISWA'!D16=0,\"\",'DATA SISWA'!D16)","v":"AININ NAFISA FEBRIYANTI"},85,72,60,56,65,75,70,70,75,70,70,75,36,59,72,70,null,null,null,null,{"$f":"SUM(C10:T10)","v":1080},{"$f":"IF(ISERROR(AVERAGE(C10:T10)),\"\",AVERAGE(C10:T10))","v":67.5},null,null,null,{"$f":"RANK(W10,$W$7:$W$66)","v":9},null,{"$f":"'[1]DATA SISWA'!D13","v":"Lumajang"},{"$f":"'[1]DATA SISWA'!E13","v":"2003-04-04"},{"$f":"'[1]DATA SISWA'!F13","v":"Zainul Atim Slamet"},{"$f":"'[1]DATA SISWA'!B13","v":4091}]
[5,{"$f":"IF('DATA SISWA'!D17=0,\"\",'DATA SISWA'!D17)","v":"AISYAH DWI ANDINI"},85,70,70,50,65,75,70,70,75,70,70,75,39,86,70,70,null,null,null,null,1110,69.375,null,null,null,{"$f":"RANK(W11,$W$7:$W$66)","v":6},null,{"$f":"'[1]DATA SISWA'!D14","v":"Lumajang"},{"$f":"'[1]DATA SISWA'!E14","v":"2003-07-06"},{"$f":"'[1]DATA SISWA'!F14","v":"Slamet Riyadi"},{"$f":"'[1]DATA SISWA'!B14","v":4092}]
[6,{"$f":"IF('DATA SISWA'!D18=0,\"\",'DATA SISWA'!D18)","v":"AJENG AGUSTINA KIRANA PUTRI"},80,80,70,60,65,75,70,70,75,70,70,75,48,72,80,70,null,null,null,null,1130,70.625,null,null,null,4,null,{"$f":"'[1]DATA SISWA'!D15","v":"Lumajang"},{"$f":"'[1]DATA SISWA'!E15","v":"2003-08-12"},{"$f":"'[1]DATA SISWA'!F15","v":"Mochamad Amin"},{"$f":"'[1]DATA SISWA'!B15","v":4093}]
[7,{"$f":"IF('DATA SISWA'!D19=0,\"\",'DATA SISWA'!D19)","v":"ALVIAN FAIZULHAQQI"},65,74,60,58,65,75,65,43,75,70,70,75,26,23,74,60,null,null,null,null,978,61.125,null,null,null,21,null,{"$f":"'[1]DATA SISWA'!D16","v":"Lumajang"},{"$f":"'[1]DATA SISWA'!E16","v":"2003-11-13"},{"$f":"'[1]DATA SISWA'!F16","v":"Mukhamad Fauzi"},{"$f":"'[1]DATA SISWA'!B16","v":4136}]
[8,{"$f":"IF('DATA SISWA'!D20=0,\"\",'DATA SISWA'!D20)","v":"ANGGITA RIZKY YUGA MEISYA"},85,90,70,68,65,75,70,70,85,70,70,75,42,56,90,70,null,null,null,null,1151,71.9375,null,null,null,2,null,{"$f":"'[1]DATA SISWA'!D17","v":"Sidoarjo,"},{"$f":"'[1]DATA SISWA'!E17","v":"2003-10-29"},{"$f":"'[1]DATA SISWA'!F17","v":0},{"$f":"'[1]DATA SISWA'!B17","v":4094}]
[9,{"$f":"IF('DATA SISWA'!D21=0,\"\",'DATA SISWA'!D21)","v":"AUFAN AZKAL ABRORI"},65,59,70,50,65,70,65,42,65,65,70,75,10,22,60,60,null,null,null,null,913,57.0625,null,null,null,29,null,{"$f":"'[1]DATA SISWA'!D18","v":"Lumajang"},{"$f":"'[1]DATA SISWA'!E18","v":"2003-09-11"},{"$f":"'[1]DATA SISWA'!F18","v":"Samsuhar"},{"$f":"'[1]DATA SISWA'!B18","v":4095}]
[10,{"$f":"IF('DATA SISWA'!D22=0,\"\",'DATA SISWA'!D22)","v":"AURA SALSABILA WULAN SARI"},65,92,70,85,65,70,65,70,85,65,70,75,37,70,85,70,null,null,null,null,1139,71.1875,null,null,null,3,null,{"$f":"'[1]DATA SISWA'!D19","v":"Lumajang"},{"$f":"'[1]DATA SISWA'!E19","v":"2003-06-15"},{"$f":"'[1]DATA SISWA'!F19","v":"Wahyudi"},{"$f":"'[1]DATA SISWA'!B19","v":4135}]
[11,{"$f":"IF('DATA SISWA'!D23=0,\"\",'DATA SISWA'!D23)","v":"AZZA PRISHAL DWI PUTRA"},65,53,70,43,65,70,65,44,65,70,75,75,27,24,60,60,null,null,null,null,931,58.1875,null,null,null,28,null,{"$f":"'[1]DATA SISWA'!D20","v":"Lumajang"},{"$f":"'[1]DATA SISWA'!E20","v":"2003-10-23"},{"$f":"'[1]DATA SISWA'!F20","v":"Sukadi"},{"$f":"'[1]DATA SISWA'!B20","v":4096}]
[12,{"$f":"IF('DATA SISWA'!D24=0,\"\",'DATA SISWA'!D24)","v":"BALQIS NAILA AUDIA"},85,94,70,82,65,75,70,75,85,70,70,75,52,73,85,70,null,null,null,null,1196,74.75,null,null,null,1,null,{"$f":"'[1]DATA SISWA'!D21","v":"Lumajang"},{"$f":"'[1]DATA SISWA'!E21","v":"2003-11-04"},{"$f":"'[1]DATA SISWA'!F21","v":"Zainul Muttaqin"},{"$f":"'[1]DATA SISWA'!B21","v":4097}]
[13,{"$f":"IF('DATA SISWA'!D25=0,\"\",'DATA SISWA'!D25)","v":"BIMA SATRIA DIRGANTARA"},70,70,70,58,65,70,65,50,75,65,75,75,23,30,70,60,null,null,null,null,991,61.9375,null,null,null,18,null,{"$f":"'[1]DATA SISWA'!D22","v":"Kampar"},{"$f":"'[1]DATA SISWA'!E22","v":"2002-11-09"},{"$f":"'[1]DATA SISWA'!F22","v":"Kastin"},{"$f":"'[1]DATA SISWA'!B22","v":4061}]
[14,{"$f":"IF('DATA SISWA'!D26=0,\"\",'DATA SISWA'!D26)","v":"DEVI KARUNIA RATNA PUTRI"},85,80,70,72,65,75,70,70,85,70,70,75,35,63,80,65,null,null,null,null,1130,70.625,null,null,null,4,null,{"$f":"'[1]DATA SISWA'!D23","v":"Lumajang"},{"$f":"'[1]DATA SISWA'!E23","v":"2003-05-18"},{"$f":"'[1]DATA SISWA'!F23","v":"Kholiqul Sulton"},{"$f":"'[1]DATA SISWA'!B23","v":4099}]
{"$rows_left_out":47}
{"sheet":"RAPOR","index":3,"n_rows":55,"n_cols":11,"rows_kept":55,"cut":false,"hidden":false,"merged":[[17,6,18,6],[17,8,18,8],[11,4,11,8],[12,4,12,8],[13,4,13,8],[15,4,15,8],[17,7,18,7],[14,4,14,8],[42,5,42,7],[42,0,42,4],[7,0,7,8],[8,0,8,8],[9,0,9,8],[19,1,19,4],[24,1,24,4],[25,1,25,4],[26,1,26,4],[27,1,27,4],[28,1,28,4],[29,1,29,4],[30,1,30,4],[31,1,31,4],[17,0,18,0],[17,1,18,4],[46,7,46,8],[47,7,47,8],[43,0,43,4],[43,6,43,7],[9,10,10,10],[20,2,20,4],[21,2,21,4],[22,2,22,4],[38,2,38,4],[32,1,32,4],[37,1,37,4],[11,10,13,10],[23,2,23,4],[39,2,39,4],[40,2,40,4],[41,2,41,4]]}
[]
[]
[]
[]
[]
[]
[]
["DAFTAR NILAI"]
[{"$f":"'DATA SISWA'!L6","v":"UJIAN TENGAH SEMESTER I (GANJIL)"}]
[{"$f":"'DATA SISWA'!L7","v":"TAHUN PELAJARAN 2017/2018"}]
[]
["N a m a",null,null,": ",{"$f":"UPPER(VLOOKUP($K$12,'DATA SISWA'!$A$13:$P$72,4,0))","v":"MOCHAMAD RAFLI DIAN SAPUTRA"},null,null,null,null,null,30]
["Tempat,Tanggal Lahir",null,null,": ",{"$f":"PROPER(VLOOKUP($K$12,'DATA SISWA'!$A$13:$P$72,12,0))","v":"Lumajang, 28 Juli 2007"}]
["Nama Orang Tua",null,null,": ",{"$f":"PROPER(VLOOKUP($K$12,'DATA SISWA'!$A$13:$P$72,8,0))","v":"Samsul Arifin"}]
["Nomor Induk",null,null,": ",{"$f":"VLOOKUP($K$12,'DATA SISWA'!$A$13:$P$72,3,0)","v":4351}]
["NISN",null,null,": ",{"$f":"IF(VLOOKUP($K$12,'DATA SISWA'!$A$13:$P$72,2,0)=0,\"-\",VLOOKUP($K$12,'DATA SISWA'!$A$13:$P$72,2,0))","v":"0076361559"}]
[]
["NO","Mata Pelajaran",null,null,null,"NILAI ","KKM","Predikat","DESKRIPSI"]
[null,null,null,null,null,"UTS"]
["1.","Pendidikan Agama",null,null,null,null,null,{"$f":"IF(F20<G20,\"C\",IF(F20>G20,\"B\",\"\"))","v":""}]
{"$rows_left_out":36}
{"sheet":"HITUNGAN UTS (ABAIKAN)","index":4,"n_rows":3,"n_cols":4,"rows_kept":3,"cut":false,"hidden":false,"merged":[]}
["ROM1",5,{"$f":"D1*B1","v":25},5]
["ROM2",10,{"$f":"D2/10*B2","v":14},14]
[null,null,null,{"$f":"SUM(C1:C2)","v":39}]

{"sheet":"HITUNGAN UTS (ABAIKAN) (2)","index":5,"n_rows":10,"n_cols":8,"rows_kept":10,"cut":false,"hidden":false,"merged":[]}
[null,"JML SOAL","JML POIN","POIN SEIMPURNA","MASUKKAN SKOR","MASUKKAN NILAINYA"]
["ROM1",15,1,{"$f":"B2*C2","v":15},5,"UNTUK ROM2"]
["ROM2",5,5,{"$f":"B3*C3","v":25},5]
["ROM3",5,10,50,5,14,1]
[null,null,null,"NILAI",{"$f":"SUM(E2:E4)/SUM(D2:D4)*100","v":16.666666666666664},1,2]
[null,null,null,null,null,7,3]
[null,null,null,null,null,3,4]
[null,null,null,null,null,{"$f":"AVERAGE(H8:H10)","v":13.333333333333334},5,14]
[null,null,null,null,null,null,null,14]
[null,null,null,null,null,null,null,12]