{"text_format":"1","workbook":"xlsx","n_sheets":11,"sheets":["DATA EDUBOX","KARTU EDUBOX","RUMUSKARTU","(nomor peserta)nama","NAMA NOMOR R.1","Daftar nama R.2","Daftar nama R.3","Daftar nama R.1","DENAH R.1","DENAH R.2","DENAH R.3"],"not_rendered":{"charts":0,"images":68,"macros":0,"external_links":1,"defined_names":24,"comments":0,"pivot_tables":0},"unopened":[],"bounds":{"document_bytes":16777216,"sheet_cells":100000,"rows_first":2000,"rows_last":500,"rows_between":2000,"halvings":0,"cell_chars":16384,"cell_head_chars":4096},"cells_cut":0,"cells_raw":0,"read":"whole","date_system":"1900"}

{"sheet":"DATA EDUBOX","index":0,"n_rows":73,"n_cols":18,"rows_kept":73,"cut":false,"hidden":false,"merged":[]}
["NAMA MADRASAH",null,null,"MIS NURUL ISLAM LABRUK KIDUL"]
["KECAMATAN",null,null,"SUMBERSUKO"]
["KABUPATEN",null,null,"LUMAJANG"]
["ALAMAT",null,null,"Jl. Raya Labruk Kidul 65"]
["DESA",null,null,"Labruk Kidul"]
["NAMA UJIAN",null,null,"USBN-BK","GENAP"]
["TAHUN PELAJARAN",null,null,"2018/2019"]
["KEPALA MADRASAH",null,null,"SAHRONI,S.Pd.I"]
["TEMPAT UJIAN",null,null,"Labruk Kidul"]
[]
[]
[1,2,3,4,5,6,7,8,9,10,11,12,13,14,15,16,17]
["NO URUT","NO ABSEN","RUANG","email","username","encrypted_password","role_id","created_at","updated_at","class_id","reset_password","display_name","image","trash","nisn","sync_status","stats_status","id_absen_solution"]
[1,1,"01","6A1@mail.id","80-0162-0001-8","$2a$08$75LT7SJuQ4rXUZ6fkhDj2uYb2/d96cRp/wp4jPYECHoTtEzLazaJO",2,"0000-00-00 00:00:00","0000-00-00 00:00:00",1,null,"ADITYA MAULA FANDY TAULANI"]
[2,2,"01","6B1@mail.id","80-0162-0002-7","$2a$08$75LT7SJuQ4rXUZ6fkhDj2uYb2/d96cRp/wp4jPYECHoTtEzLazaJO",2,"0000-00-00 00:00:00","0000-00-00 00:00:00",1,null,"AHMAD FERDIAN ALAMSYAH"]
[3,3,"01","6A2@mail.id","80-0162-0003-6","$2a$08$75LT7SJuQ4rXUZ6fkhDj2uYb2/d96cRp/wp4jPYECHoTtEzLazaJO",2,"0000-00-00 00:00:00","2018-12-06T02:52:00",1,null,"AHMAD RAMADHANI FADLULLOH","26980d544b88e435156c67cb48ab4bd9.jpg",null,null,2]
[4,4,"01","6B2@mail.id","80-0162-0004-5","$2a$08$75LT7SJuQ4rXUZ6fkhDj2uYb2/d96cRp/wp4jPYECHoTtEzLazaJO",2,"0000-00-00 00:00:00","2018-12-05T20:41:00",1,null,"ANANDA AMILIA","IMG-20181118-WA0013.jpg",null,null,2]
[5,5,"01","6A3@mail.id","80-0162-0005-4","$2a$08$75LT7SJuQ4rXUZ6fkhDj2uYb2/d96cRp/wp4jPYECHoTtEzLazaJO",2,"0000-00-00 00:00:00","2018-12-07T23:43:00",1,null,"ANDINI MAULID DWI LESTARI","Lisa-black-pink-40579158-500-552.jpg",null,null,2]
[6,6,"01","6B3@mail.id","80-0162-0006-3","$2a$08$75LT7SJuQ4rXUZ6fkhDj2uYb2/d96cRp/wp4jPYECHoTtEzLazaJO",2,"0000-00-00 00:00:00","2018-12-06T02:30:00",1,null,"ANDRIK YUSRI","blogers.jpg",null,null,2]
[7,7,"01","6A4@mail.id","80-0162-0007-2","$2a$08$75LT7SJuQ4rXUZ6fkhDj2uYb2/d96cRp/wp4jPYECHoTtEzLazaJO",2,"0000-00-00 00:00:00","2018-12-07T23:45:00",1,null,"DEWI SAKINAH ISWARA","Profil-Kartun-Muslimah-Bercadar.jpg",null,null,2]
[8,8,"01","6B4@mail.id","80-0162-0008-9","$2a$08$75LT7SJuQ4rXUZ6fkhDj2uYb2/d96cRp/wp4jPYECHoTtEzLazaJO",2,"0000-00-00 00:00:00","2018-12-07T23:32:00",1,null,"CHAKIM","alucard.jpg",null,null,2]
[9,9,"01","6A5@mail.id","80-0162-0009-8","$2a$08$75LT7SJuQ4rXUZ6fkhDj2uYb2/d96cRp/wp4jPYECHoTtEzLazaJO",2,"0000-00-00 00:00:00","0000-00-00 00:00:00",1,null,"HANIK APRILIA SARI"]
[10,10,"01","6B5@mail.id","80-0162-0010-7","$2a$08$75LT7SJuQ4rXUZ6fkhDj2uYb2/d96cRp/wp4jPYECHoTtEzLazaJO",2,"0000-00-00 00:00:00","0000-00-00 00:00:00",1,null,"DESI NATALIA SAPUTRI"]
[11,11,"01","6A6@mail.id","80-0162-0011-6","$2a$08$75LT7SJuQ4rXUZ6fkhDj2uYb2/d96cRp/wp4jPYECHoTtEzLazaJO",2,"0000-00-00 00:00:00","0000-00-00 00:00:00",1,null,"HIDAYATUL KHUMAINIA"]
[12,12,"01","6B6@mail.id","80-0162-0012-5","$2a$08$75LT7SJuQ4rXUZ6fkhDj2uYb2/d96cRp/wp4jPYECHoTtEzLazaJO",2,"0000-00-00 00:00:00","0000-00-00 00:00:00",1,null,"DWITA FITA WULANDARI"]
[13,13,"01","6A7@mail.id","80-0162-0013-4","$2a$08$75LT7SJuQ4rXUZ6fkhDj2uYb2/d96cRp/wp4jPYECHoTtEzLazaJO",2,"0000-00-00 00:00:00","0000-00-00 00:00:00",1,null,"IZZA ILMIA AZZAHRA"]
[14,14,"01","6B7@mail.id","80-0162-0014-3","$2a$08$75LT7SJuQ4rXUZ6fkhDj2uYb2/d96cRp/wp4jPYECHoTtEzLazaJO",2,"0000-00-00 00:00:00","2018-12-07T22:59:00",1,null,"FARIDATUS SAHDIAH","Snapshot_20181210_1.JPG",null,null,2]
[15,15,"01","6A8@mail.id","80-0162-0015-2","$2a$08$75LT7SJuQ4rXUZ6fkhDj2uYb2/d96cRp/wp4jPYECHoTtEzLazaJO",2,"0000-00-00 00:00:00","0000-00-00 00:00:00",1,null,"KHARISYA AZZAHRO"]
[16,16,"01","6B8@mail.id","80-0162-0016-9","$2a$08$75LT7SJuQ4rXUZ6fkhDj2uYb2/d96cRp/wp4jPYECHoTtEzLazaJO",2,"0000-00-00 00:00:00","0000-00-00 00:00:00",1,null,"KARINA FEBBY CAHYA AMILIA"]
[17,17,"01","6A9@mail.id","80-0162-0017-8","$2a$08$75LT7SJuQ4rXUZ6fkhDj2uYb2/d96cRp/wp4jPYECHoTtEzLazaJO",2,"0000-00-00 00:00:00","2018-12-06T02:51:00",1,null,"MOCHAMAD RIFKY ROSAN","Unicorn-wallpapper1.jpg",null,null,2]
[18,18,"01","6B9@mail.id","80-0162-0018-7","$2a$08$75LT7SJuQ4rXUZ6fkhDj2uYb2/d96cRp/wp4jPYECHoTtEzLazaJO",2,"0000-00-00 00:00:00","2018-12-07T23:00:00",1,null,"KHUSNI CAHYONO","index.jpg",null,null,2]
[19,19,"01","6A10@mail.id","80-0162-0019-6","$2a$08$75LT7SJuQ4rXUZ6fkhDj2uYb2/d96cRp/wp4jPYECHoTtEzLazaJO",2,"0000-00-00 00:00:00","2018-12-06T02:37:00",1,null,"MUCHAMMAD ALIEF FERDIANSYAH","blogger-image-1167405860.jpg",null,null,2]
[20,20,"01","6B10@mail.id","80-0162-0020-5","$2a$08$75LT7SJuQ4rXUZ6fkhDj2uYb2/d96cRp/wp4jPYECHoTtEzLazaJO",2,"0000-00-00 00:00:00","2018-12-07T22:43:00",1,null,"LENNY AGUSTIN NINGTYAS","index.jpg",null,null,2]
[21,1,"02","6A11@mail.id","80-0162-0021-4","$2a$08$75LT7SJuQ4rXUZ6fkhDj2uYb2/d96cRp/wp4jPYECHoTtEzLazaJO",2,"0000-00-00 00:00:00","2018-12-07T23:48:00",1,null,"MUHAMMAD AGUS ANDRIANTO","Cute Cat19.jpg",null,null,2]
[22,2,"02","6B11@mail.id","80-0162-0022-3","$2a$08$75LT7SJuQ4rXUZ6fkhDj2uYb2/d96cRp/wp4jPYECHoTtEzLazaJO",2,"0000-00-00 00:00:00","2018-12-04T15:10:00",1,null,"MAURIS HIDAYATUR ROCHMAN","kucing comel.jpg",null,null,2]
[23,3,"02","6A12@mail.id","80-0162-0023-2","$2a$08$75LT7SJuQ4rXUZ6fkhDj2uYb2/d96cRp/wp4jPYECHoTtEzLazaJO",2,"0000-00-00 00:00:00","0000-00-00 00:00:00",1,null,"MUHAMMAD BISMAR TAUFIQUROHMAN"]
[24,4,"02","6B12@mail.id","80-0162-0024-9","$2a$08$75LT7SJuQ4rXUZ6fkhDj2uYb2/d96cRp/wp4jPYECHoTtEzLazaJO",2,"0000-00-00 00:00:00","2018-12-06T02:53:00",1,null,"MAYA BUNGA ANJANI","-BLACKPINK-black-pink-40670892-1920-1080.jpg",null,null,2]
[25,5,"02","6A13@mail.id","80-0162-0025-8","$2a$08$75LT7SJuQ4rXUZ6fkhDj2uYb2/d96cRp/wp4jPYECHoTtEzLazaJO",2,"0000-00-00 00:00:00","0000-00-00 00:00:00",1,null,"MUHAMMAD SAHLAN SHODIQ"]
[26,6,"02","6B13@mail.id","80-0162-0026-7","$2a$08$75LT7SJuQ4rXUZ6fkhDj2uYb2/d96cRp/wp4jPYECHoTtEzLazaJO",2,"0000-00-00 00:00:00","2018-12-07T23:32:00",1,null,"MITA SEPTIANI ISLAMIA","images.jpg",null,null,2]
[27,7,"02","6A14@mail.id","80-0162-0027-6","$2a$08$75LT7SJuQ4rXUZ6fkhDj2uYb2/d96cRp/wp4jPYECHoTtEzLazaJO",2,"0000-00-00 00:00:00","0000-00-00 00:00:00",1,null,"MUHAMMAD SEPTYAN EKA PRATAMA"]
[28,8,"02","6B14@mail.id","80-0162-0028-5","$2a$08$75LT7SJuQ4rXUZ6fkhDj2uYb2/d96cRp/wp4jPYECHoTtEzLazaJO",2,"0000-00-00 00:00:00","2018-12-06T02:54:00",1,null,"MOCHAMAD ARIEL FRANS TITO","Fantasy-Castle.jpg",null,null,2]
[29,9,"02","6A15@mail.id","80-0162-0029-4","$2a$08$75LT7SJuQ4rXUZ6fkhDj2uYb2/d96cRp/wp4jPYECHoTtEzLazaJO",2,"0000-00-00 00:00:00","0000-00-00 00:00:00",2,null,"MUHAMMAD VERYANSYAH"]
[30,10,"02","6B15@mail.id","80-0162-0030-3","$2a$08$75LT7SJuQ4rXUZ6fkhDj2uYb2/d96cRp/wp4jPYECHoTtEzLazaJO",2,"0000-00-00 00:00:00","0000-00-00 00:00:00",2,null,"MOCHAMMAD BIMA RISFANDA"]
[31,11,"02","6A16@mail.id","80-0162-0031-2","$2a$08$75LT7SJuQ4rXUZ6fkhDj2uYb2/d96cRp/wp4jPYECHoTtEzLazaJO",2,"0000-00-00 00:00:00","0000-00-00 00:00:00",2,null,"MUHAMMAD ZIDNY NA'IM"]
[32,12,"02","6B16@mail.id","80-0162-0032-9","$2a$08$75LT7SJuQ4rXUZ6fkhDj2uYb2/d96cRp/wp4jPYECHoTtEzLazaJO",2,"0000-00-00 00:00:00","0000-00-00 00:00:00",2,null,"MUHAMMAD AGUS FERDIANSYAH"]
[33,13,"02","6A17@mail.id","80-0162-0033-8","$2a$08$75LT7SJuQ4rXUZ6fkhDj2uYb2/d96cRp/wp4jPYECHoTtEzLazaJO",2,"0000-00-00 00:00:00","0000-00-00 00:00:00",2,null,"NABILA ARISKA PUTRI"]
[34,14,"02","6B17@mail.id","80-0162-0034-7","$2a$08$75LT7SJuQ4rXUZ6fkhDj2uYb2/d96cRp/wp4jPYECHoTtEzLazaJO",2,"0000-00-00 00:00:00","0000-00-00 00:00:00",2,null,"MUHAMMAD FARDAN ABDILLAH"]
[35,15,"02","6A18@mail.id","80-0162-0035-6","$2a$08$75LT7SJuQ4rXUZ6fkhDj2uYb2/d96cRp/wp4jPYECHoTtEzLazaJO",2,"0000-00-00 00:00:00","0000-00-00 00:00:00",2,null,"NAFISA INDRIANI"]
[36,16,"02","6B18@mail.id","80-0162-0036-5","$2a$08$75LT7SJuQ4rXUZ6fkhDj2uYb2/d96cRp/wp4jPYECHoTtEzLazaJO",2,"0000-00-00 00:00:00","0000-00-00 00:00:00",2,null,"MUHAMMAD FERDINAN JAYYIDAH RIFQI"]
[37,17,"02","6A19@mail.id","80-0162-0037-4","$2a$08$75LT7SJuQ4rXUZ6fkhDj2uYb2/d96cRp/wp4jPYECHoTtEzLazaJO",2,"0000-00-00 00:00:00","0000-00-00 00:00:00",2,null,"NAJWA FARISYA BAROROH"]
[38,18,"02","6B19@mail.id","80-0162-0038-3","$2a$08$75LT7SJuQ4rXUZ6fkhDj2uYb2/d96cRp/wp4jPYECHoTtEzLazaJO",2,"0000-00-00 00:00:00","0000-00-00 00:00:00",2,null,"MUHAMMAD FIRMANSYAH",null,null,null,2]
[39,19,"02","6A20@mail.id","80-0162-0039-2","$2a$08$75LT7SJuQ4rXUZ6fkhDj2uYb2/d96cRp/wp4jPYECHoTtEzLazaJO",2,"0000-00-00 00:00:00","2018-12-05T23:11:00",2,null,"NUR FITRIYAH","181207-100832.png",null,null,2]
[40,20,"02","6B20@mail.id","80-0162-0040-9","$2a$08$75LT7SJuQ4rXUZ6fkhDj2uYb2/d96cRp/wp4jPYECHoTtEzLazaJO",2,"0000-00-00 00:00:00","0000-00-00 00:00:00",2,null,"MUHAMMAD HILDAN DWI SAPUTRA"]
[41,1,"03","6A21@mail.id","80-0162-0041-8","$2a$08$75LT7SJuQ4rXUZ6fkhDj2uYb2/d96cRp/wp4jPYECHoTtEzLazaJO",2,"0000-00-00 00:00:00","0000-00-00 00:00:00",2,null,"PUTRI NAFI'ATUS SOLIKHAH",null,null,null,2]
[42,2,"03","6B21@mail.id","80-0162-0042-7","$2a$08$75LT7SJuQ4rXUZ6fkhDj2uYb2/d96cRp/wp4jPYECHoTtEzLazaJO",2,"0000-00-00 00:00:00","0000-00-00 00:00:00",2,null,"MUHAMMAD RAYA KAFAF JAUHARI"]
[43,3,"03","6A22@mail.id","80-0162-0043-6","$2a$08$75LT7SJuQ4rXUZ6fkhDj2uYb2/d96cRp/wp4jPYECHoTtEzLazaJO",2,"0000-00-00 00:00:00","0000-00-00 00:00:00",2,null,"QORIATUN SHOLIHAH"]
[44,4,"03","6B22@mail.id","80-0162-0044-5","$2a$08$75LT7SJuQ4rXUZ6fkhDj2uYb2/d96cRp/wp4jPYECHoTtEzLazaJO",2,"0000-00-00 00:00:00","0000-00-00 00:00:00",2,null,"MUHAMMAD RUDI TANTOWIK"]
[45,5,"03","6A23@mail.id","80-0162-0045-4","$2a$08$75LT7SJuQ4rXUZ6fkhDj2uYb2/d96cRp/wp4jPYECHoTtEzLazaJO",2,"0000-00-00 00:00:00","2018-12-04T11:56:00",2,null,"RACHMAD HIDAYAT",null,null,null,2]
[46,6,"03","6B23@mail.id","80-0162-0046-3","$2a$08$75LT7SJuQ4rXUZ6fkhDj2uYb2/d96cRp/wp4jPYECHoTtEzLazaJO",2,"0000-00-00 00:00:00","0000-00-00 00:00:00",2,null,"MUHAMMAD ZULDIENUR HABIBIE"]
[47,7,"03","6A24@mail.id","80-0162-0047-2","$2a$08$75LT7SJuQ4rXUZ6fkhDj2uYb2/d96cRp/wp4jPYECHoTtEzLazaJO",2,"0000-00-00 00:00:00","2018-12-05T23:58:00",2,null,"RHEA RAYSHANADA NUGRAHA","wallpaper-mobile-legend-new-hero-gossen-gusion-wallpapers-of-wallpaper-mobile-legend-new.jpg",null,null,2]
[48,8,"03","6B24@mail.id","80-0162-0048-9","$2a$08$75LT7SJuQ4rXUZ6fkhDj2uYb2/d96cRp/wp4jPYECHoTtEzLazaJO",2,"0000-00-00 00:00:00","0000-00-00 00:00:00",2,null,"MUKHAMAD KHOIRUL AMIN"]
[49,9,"03","6A25@mail.id","80-0162-0049-8","$2a$08$75LT7SJuQ4rXUZ6fkhDj2uYb2/d96cRp/wp4jPYECHoTtEzLazaJO",2,"0000-00-00 00:00:00","0000-00-00 00:00:00",2,null,"RIYANTI APRILIA"]
[50,10,"03","6B25@mail.id","80-0162-0050-7","$2a$08$75LT7SJuQ4rXUZ6fkhDj2uYb2/d96cRp/wp4jPYECHoTtEzLazaJO",2,"0000-00-00 00:00:00","0000-00-00 00:00:00",2,null,"MUKHAMMAD YAASIIN HASAN KHASBULLOH"]
[51,11,"03","6A26@mail.id","80-0162-0051-6","$2a$08$75LT7SJuQ4rXUZ6fkhDj2uYb2/d96cRp/wp4jPYECHoTtEzLazaJO",2,"0000-00-00 00:00:00","0000-00-00 00:00:00",2,null,"SHONIA AULIA AS'AD"]
[52,12,"03","6B26@mail.id","80-0162-0052-5","$2a$08$75LT7SJuQ4rXUZ6fkhDj2uYb2/d96cRp/wp4jPYECHoTtEzLazaJO",2,"0000-00-00 00:00:00","0000-00-00 00:00:00",2,null,"RIZKA AYU WULANDARI"]
[53,13,"03","6A27@mail.id","80-0162-0053-4","$2a$08$75LT7SJuQ4rXUZ6fkhDj2uYb2/d96cRp/wp4jPYECHoTtEzLazaJO",2,"0000-00-00 00:00:00","0000-00-00 00:00:00",2,null,"VERLINA DWI MAULANI"]
[54,14,"03","6B27@mail.id","80-0162-0054-3","$2a$08$75LT7SJuQ4rXUZ6fkhDj2uYb2/d96cRp/wp4jPYECHoTtEzLazaJO",2,"0000-00-00 00:00:00","2018-12-05T23:20:00",2,null,"USWATUN KHASANAH",null,null,null,2]
[55,15,"03","6A28@mail.id","80-0162-0055-2","$2a$08$75LT7SJuQ4rXUZ6fkhDj2uYb2/d96cRp/wp4jPYECHoTtEzLazaJO",2,"0000-00-00 00:00:00","0000-00-00 00:00:00",2,null,"VIKA KUSUMA WATI"]
[56,16,"03","6B28@mail.id","80-0162-0056-9","$2a$08$75LT7SJuQ4rXUZ6fkhDj2uYb2/d96cRp/wp4jPYECHoTtEzLazaJO",2,"0000-00-00 00:00:00","0000-00-00 00:00:00",2,null,"YOHAN EGA GILANG PERMANA"]
[null,17]
[null,18]
[null,19]
[null,20]

{"sheet":"KARTU EDUBOX","index":1,"n_rows":59,"n_cols":28,"rows_kept":59,"cut":false,"hidden":false,"merged":[[1,2,1,3],[4,2,4,3],[35,2,35,3],[8,1,8,3],[9,1,9,3],[12,1,12,3],[2,2,2,3],[3,2,3,3],[13,1,13,3],[6,1,6,3],[32,2,32,3],[33,2,33,3],[34,2,34,3],[37,1,37,3],[39,1,39,3],[40,1,40,3],[43,1,43,3],[44,1,44,3],[35,9,35,10],[37,8,37,10],[39,8,39,10],[32,9,32,10],[33,9,33,10],[8,8,8,10],[9,8,9,10],[12,8,12,10],[13,8,13,10],[34,9,34,10],[35,16,35,17],[40,8,40,10],[43,8,43,10],[44,8,44,10],[1,16,1,17],[2,16,2,17],[3,16,3,17],[4,16,4,17],[6,15,6,17],[8,15,8,17],[9,15,9,17],[1,9,1,10],[2,9,2,10],[3,9,3,10],[4,9,4,10],[6,8,6,10],[12,15,12,17],[13,15,13,17],[32,16,32,17],[33,16,33,17],[34,16,34,17],[1,23,1,24],[2,23,2,24],[3,23,3,24],[4,23,4,24],[6,22,6,24],[37,15,37,17],[39,15,39,17],[40,15,40,17],[43,15,43,17],[44,15,44,17],[8,22,8,24],[9,22,9,24],[12,22,12,24],[13,22,13,24],[32,23,32,24],[44,22,44,24],[13,27,13,29],[12,27,12,29],[34,23,34,24],[35,23,35,24],[37,22,37,24],[39,22,39,24],[40,22,40,24],[43,22,43,24],[33,23,33,24]]}
[]
[null,null,"Kementerian Agama Kab. Lumajang",null,null,null,null,null,null,"Kementerian Agama Kab. Lumajang",null,null,null,null,null,null,"Kementerian Agama Kab. Lumajang",null,null,null,null,null,null,"Kementerian Agama Kab. Lumajang"]
[null,null,{"$f":"'DATA EDUBOX'!$D$1","v":"MIS NURUL ISLAM LABRUK KIDUL"},null,null,null,null,null,null,{"$f":"'DATA EDUBOX'!$D$1","v":"MIS NURUL ISLAM LABRUK KIDUL"},null,null,null,null,null,null,{"$f":"'DATA EDUBOX'!$D$1","v":"MIS NURUL ISLAM LABRUK KIDUL"},null,null,null,null,null,null,{"$f":"'DATA EDUBOX'!$D$1","v":"MIS NURUL ISLAM LABRUK KIDUL"},null,null,null,1]
[null,null,{"$f":"'DATA EDUBOX'!$D$2&\" - \"&'DATA EDUBOX'!$D$3","v":"SUMBERSUKO - LUMAJANG"},null,null,null,null,null,null,{"$f":"'DATA EDUBOX'!$D$2&\" - \"&'DATA EDUBOX'!$D$3","v":"SUMBERSUKO - LUMAJANG"},null,null,null,null,null,null,{"$f":"'DATA EDUBOX'!$D$2&\" - \"&'DATA EDUBOX'!$D$3","v":"SUMBERSUKO - LUMAJANG"},null,null,null,null,null,null,{"$f":"'DATA EDUBOX'!$D$2&\" - \"&'DATA EDUBOX'!$D$3","v":"SUMBERSUKO - LUMAJANG"},null,null,null,{"$f":"AB3+1","v":2}]
[null,null,{"$f":"'DATA EDUBOX'!$D$4&\" Desa \"&'DATA EDUBOX'!$D$5","v":"Jl. Raya Labruk Kidul 65 Desa Labruk Kidul"},null,null,null,null,null,null,{"$f":"'DATA EDUBOX'!$D$4&\" Desa \"&'DATA EDUBOX'!$D$5","v":"Jl. Raya Labruk Kidul 65 Desa Labruk Kidul"},null,null,null,null,null,null,{"$f":"'DATA EDUBOX'!$D$4&\" Desa \"&'DATA EDUBOX'!$D$5","v":"Jl. Raya Labruk Kidul 65 Desa Labruk Kidul"},null,null,null,null,null,null,{"$f":"'DATA EDUBOX'!$D$4&\" Desa \"&'DATA EDUBOX'!$D$5","v":"Jl. Raya Labruk Kidul 65 Desa Labruk Kidul"},null,null,null,{"$f":"AB4+1","v":3}]
[null,null,null,null,null,null,null,null,null,null,null,null,null,null,null,null,null,null,null,null,null,null,null,null,null,null,null,4]
[null,"KARTU PESERTA",null,null,null,null,null,null,"KARTU PESERTA",null,null,null,null,null,null,"KARTU PESERTA",null,null,null,null,null,null,"KARTU PESERTA",null,null,null,null,5]
[null,null,null,null,null,null,null,null,null,null,null,null,null,null,null,null,null,null,null,null,null,null,null,null,null,null,null,6]
[null,{"$f":"'DATA EDUBOX'!D6","v":"USBN-BK"},null,null,null,null,null,null,{"$f":"'DATA EDUBOX'!D6","v":"USBN-BK"},null,null,null,null,null,null,{"$f":"'DATA EDUBOX'!D6","v":"USBN-BK"},null,null,null,null,null,null,{"$f":"'DATA EDUBOX'!D6","v":"USBN-BK"},null,null,null,null,7]
[null,"TAHUN PELAJARAN 2018/2019",null,null,null,null,null,null,"TAHUN PELAJARAN 2018/2019",null,null,null,null,null,null,"TAHUN PELAJARAN 2018/2019",null,null,null,null,null,null,"TAHUN PELAJARAN 2018/2019",null,null,null,null,{"$f":"AB9+1","v":8}]
[]
[]
[null,"NAMA PESERTA",null,null,null,null,null,null,"NAMA PESERTA",null,null,null,null,null,null,"NAMA PESERTA",null,null,null,null,null,null,"NAMA PESERTA",null,null,null,null,"KEPALA MADRASAH"]
[null,{"$f":"VLOOKUP('KARTU EDUBOX'!$AB$3,'DATA EDUBOX'!$A$14:$T$69,12)","v":"ADITYA MAULA FANDY TAULANI"},null,null,null,null,null,null,{"$f":"VLOOKUP('KARTU EDUBOX'!$AB$4,'DATA EDUBOX'!$A$14:$T$69,12)","v":"AHMAD FERDIAN ALAMSYAH"},null,null,null,null,null,null,{"$f":"VLOOKUP('KARTU EDUBOX'!$AB$5,'DATA EDUBOX'!$A$14:$T$69,12)","v":"AHMAD RAMADHANI FADLULLOH"},null,null,null,null,null,null,{"$f":"VLOOKUP('KARTU EDUBOX'!$AB$6,'DATA EDUBOX'!$A$14:$T$69,12)","v":"ANANDA AMILIA"},null,null,null,null,"SAHRONI,S.Pd.I"]
[]
[null,"No. Peserta",":",{"$f":"VLOOKUP('KARTU EDUBOX'!$AB$3,'DATA EDUBOX'!$A$14:$T$69,5)","v":"80-0162-0001-8"},null,null,null,null,"No. Peserta",":",{"$f":"VLOOKUP('KARTU EDUBOX'!$AB$4,'DATA EDUBOX'!$A$14:$T$69,5)","v":"80-0162-0002-7"},null,null,null,null,"No. Peserta",":",{"$f":"VLOOKUP('KARTU EDUBOX'!$AB$5,'DATA EDUBOX'!$A$14:$T$69,5)","v":"80-0162-0003-6"},null,null,null,null,"No. Peserta",":",{"$f":"VLOOKUP('KARTU EDUBOX'!$AB$6,'DATA EDUBOX'!$A$14:$T$69,5)","v":"80-0162-0004-5"}]
[null,"Kelas",":",{"$f":"LEFT(VLOOKUP('KARTU EDUBOX'!$AB$3,'DATA EDUBOX'!$A$14:$T$69,4),2)","v":"6A"},null,null,null,null,"Kelas",":",{"$f":"LEFT(VLOOKUP('KARTU EDUBOX'!$AB$4,'DATA EDUBOX'!$A$14:$T$69,4),2)","v":"6B"},null,null,null,null,"Kelas",":",{"$f":"LEFT(VLOOKUP('KARTU EDUBOX'!$AB$5,'DATA EDUBOX'!$A$14:$T$69,4),2)","v":"6A"},null,null,null,null,"Kelas",":",{"$f":"LEFT(VLOOKUP('KARTU EDUBOX'!$AB$6,'DATA EDUBOX'!$A$14:$T$69,4),2)","v":"6B"}]
[null,"Username",":",{"$f":"VLOOKUP('KARTU EDUBOX'!$AB$3,'DATA EDUBOX'!$A$14:$T$69,4)","v":"6A1@mail.id"},null,null,null,null,"Username",":",{"$f":"VLOOKUP('KARTU EDUBOX'!$AB$4,'DATA EDUBOX'!$A$14:$T$69,4)","v":"6B1@mail.id"},null,null,null,null,"Username",":",{"$f":"VLOOKUP('KARTU EDUBOX'!$AB$5,'DATA EDUBOX'!$A$14:$T$69,4)","v":"6A2@mail.id"},null,null,null,null,"Username",":",{"$f":"VLOOKUP('KARTU EDUBOX'!$AB$6,'DATA EDUBOX'!$A$14:$T$69,4)","v":"6B2@mail.id"}]
[null,"Password",":",null,null,null,null,null,"Password",":",null,null,null,null,null,"Password",":",null,null,null,null,null,"Password",":"]
[null,"Ruang",":",{"$f":"\"R.\"&VLOOKUP('KARTU EDUBOX'!$AB$3,'DATA EDUBOX'!$A$14:$T$69,3)","v":"R.01"},null,null,null,null,"Ruang",":",{"$f":"\"R.\"&VLOOKUP('KARTU EDUBOX'!$AB$4,'DATA EDUBOX'!$A$14:$T$69,3)","v":"R.01"},null,null,null,null,"Ruang",":",{"$f":"\"R.\"&VLOOKUP('KARTU EDUBOX'!$AB$5,'DATA EDUBOX'!$A$14:$T$69,3)","v":"R.01"},null,null,null,null,"Ruang",":",{"$f":"\"R.\"&VLOOKUP('KARTU EDUBOX'!$AB$6,'DATA EDUBOX'!$A$14:$T$69,3)","v":"R.01"}]
[]
[]
[null,null,null,"Lumajang, 22 April 2019",null,null,null,null,null,null,{"$f":"$D$23","v":"Lumajang, 22 April 2019"},null,null,null,null,null,null,{"$f":"$D$23","v":"Lumajang, 22 April 2019"},null,null,null,null,null,null,{"$f":"$D$23","v":"Lumajang, 22 April 2019"}]
[null,null,null,"Kepala Madrasah",null,null,null,null,null,null,{"$f":"$D$24","v":"Kepala Madrasah"},null,null,null,null,null,null,{"$f":"$D$24","v":"Kepala Madrasah"},null,null,null,null,null,null,{"$f":"$D$24","v":"Kepala Madrasah"}]
[]
[]
[]
[null,null,null,{"$f":"$AB$14","v":"SAHRONI,S.Pd.I"},null,null,null,null,null,null,{"$f":"$AB$14","v":"SAHRONI,S.Pd.I"},null,null,null,null,null,null,{"$f":"$AB$14","v":"SAHRONI,S.Pd.I"},null,null,null,null,null,null,{"$f":"$AB$14","v":"SAHRONI,S.Pd.I"}]
[]
[]
[]
[]
[null,null,"Kementerian Agama Kab. Lumajang",null,null,null,null,null,null,"Kementerian Agama Kab. Lumajang",null,null,null,null,null,null,"Kementerian Agama Kab. Lumajang",null,null,null,null,null,null,"Kementerian Agama Kab. Lumajang"]
[null,null,{"$f":"'DATA EDUBOX'!$D$1","v":"MIS NURUL ISLAM LABRUK KIDUL"},null,null,null,null,null,null,{"$f":"'DATA EDUBOX'!$D$1","v":"MIS NURUL ISLAM LABRUK KIDUL"},null,null,null,null,null,null,{"$f":"'DATA EDUBOX'!$D$1","v":"MIS NURUL ISLAM LABRUK KIDUL"},null,null,null,null,null,null,{"$f":"'DATA EDUBOX'!$D$1","v":"MIS NURUL ISLAM LABRUK KIDUL"}]
[null,null,{"$f":"'DATA EDUBOX'!$D$2&\" - \"&'DATA EDUBOX'!$D$3","v":"SUMBERSUKO - LUMAJANG"},null,null,null,null,null,null,{"$f":"'DATA EDUBOX'!$D$2&\" - \"&'DATA EDUBOX'!$D$3","v":"SUMBERSUKO - LUMAJANG"},null,null,null,null,null,null,{"$f":"'DATA EDUBOX'!$D$2&\" - \"&'DATA EDUBOX'!$D$3","v":"SUMBERSUKO - LUMAJANG"},null,null,null,null,null,null,{"$f":"'DATA EDUBOX'!$D$2&\" - \"&'DATA EDUBOX'!$D$3","v":"SUMBERSUKO - LUMAJANG"}]
[null,null,{"$f":"'DATA EDUBOX'!$D$4&\" Desa \"&'DATA EDUBOX'!$D$5","v":"Jl. Raya Labruk Kidul 65 Desa Labruk Kidul"},null,null,null,null,null,null,{"$f":"'DATA EDUBOX'!$D$4&\" Desa \"&'DATA EDUBOX'!$D$5","v":"Jl. Raya Labruk Kidul 65 Desa Labruk Kidul"},null,null,null,null,null,null,{"$f":"'DATA EDUBOX'!$D$4&\" Desa \"&'DATA EDUBOX'!$D$5","v":"Jl. Raya Labruk Kidul 65 Desa Labruk Kidul"},null,null,null,null,null,null,{"$f":"'DATA EDUBOX'!$D$4&\" Desa \"&'DATA EDUBOX'!$D$5","v":"Jl. Raya Labruk Kidul 65 Desa Labruk Kidul"}]
[]
[null,"KARTU PESERTA",null,null,null,null,null,null,"KARTU PESERTA",null,null,null,null,null,null,"KARTU PESERTA",null,null,null,null,null,null,"KARTU PESERTA"]
[]
[null,{"$f":"'DATA EDUBOX'!D6","v":"USBN-BK"},null,null,null,null,null,null,{"$f":"'DATA EDUBOX'!D6","v":"USBN-BK"},null,null,null,null,null,null,{"$f":"'DATA EDUBOX'!D6","v":"USBN-BK"},null,null,null,null,null,null,{"$f":"'DATA EDUBOX'!D6","v":"USBN-BK"}]
[null,"TAHUN PELAJARAN 2018/2019",null,null,null,null,null,null,"TAHUN PELAJARAN 2018/2019",null,null,null,null,null,null,"TAHUN PELAJARAN 2018/2019",null,null,null,null,null,null,"TAHUN PELAJARAN 2018/2019"]
[]
[]
[null,"NAMA PESERTA",null,null,null,null,null,null,"NAMA PESERTA",null,null,null,null,null,null,"NAMA PESERTA",null,null,null,null,null,null,"NAMA PESERTA"]
[null,{"$f":"VLOOKUP('KARTU EDUBOX'!$AB$7,'DATA EDUBOX'!$A$14:$T$69,12)","v":"ANDINI MAULID DWI LESTARI"},null,null,null,null,null,null,{"$f":"VLOOKUP('KARTU EDUBOX'!$AB$8,'DATA EDUBOX'!$A$14:$T$69,12)","v":"ANDRIK YUSRI"},null,null,null,null,null,null,{"$f":"VLOOKUP('KARTU EDUBOX'!$AB$9,'DATA EDUBOX'!$A$14:$T$69,12)","v":"DEWI SAKINAH ISWARA"},null,null,null,null,null,null,{"$f":"VLOOKUP('KARTU EDUBOX'!$AB$10,'DATA EDUBOX'!$A$14:$T$69,12)","v":"CHAKIM"}]
[]
[null,"No. Peserta",":",{"$f":"VLOOKUP('KARTU EDUBOX'!$AB$7,'DATA EDUBOX'!$A$14:$T$69,5)","v":"80-0162-0005-4"},null,null,null,null,"No. Peserta",":",{"$f":"VLOOKUP('KARTU EDUBOX'!$AB$8,'DATA EDUBOX'!$A$14:$T$69,5)","v":"80-0162-0006-3"},null,null,null,null,"No. Peserta",":",{"$f":"VLOOKUP('KARTU EDUBOX'!$AB$9,'DATA EDUBOX'!$A$14:$T$69,5)","v":"80-0162-0007-2"},null,null,null,null,"No. Peserta",":",{"$f":"VLOOKUP('KARTU EDUBOX'!$AB$10,'DATA EDUBOX'!$A$14:$T$69,5)","v":"80-0162-0008-9"}]
[null,"Kelas",":",{"$f":"LEFT(VLOOKUP('KARTU EDUBOX'!$AB$7,'DATA EDUBOX'!$A$14:$T$69,4),2)","v":"6A"},null,null,null,null,"Kelas",":",{"$f":"LEFT(VLOOKUP('KARTU EDUBOX'!$AB$8,'DATA EDUBOX'!$A$14:$T$69,4),2)","v":"6B"},null,null,null,null,"Kelas",":",{"$f":"LEFT(VLOOKUP('KARTU EDUBOX'!$AB$9,'DATA EDUBOX'!$A$14:$T$69,4),2)","v":"6A"},null,null,null,null,"Kelas",":",{"$f":"LEFT(VLOOKUP('KARTU EDUBOX'!$AB$10,'DATA EDUBOX'!$A$14:$T$69,4),2)","v":"6B"}]
[null,"Username",":",{"$f":"VLOOKUP('KARTU EDUBOX'!$AB$7,'DATA EDUBOX'!$A$14:$T$69,4)","v":"6A3@mail.id"},null,null,null,null,"Username",":",{"$f":"VLOOKUP('KARTU EDUBOX'!$AB$8,'DATA EDUBOX'!$A$14:$T$69,4)","v":"6B3@mail.id"},null,null,null,null,"Username",":",{"$f":"VLOOKUP('KARTU EDUBOX'!$AB$9,'DATA EDUBOX'!$A$14:$T$69,4)","v":"6A4@mail.id"},null,null,null,null,"Username",":",{"$f":"VLOOKUP('KARTU EDUBOX'!$AB$10,'DATA EDUBOX'!$A$14:$T$69,4)","v":"6B4@mail.id"}]
[null,"Password",":",null,null,null,null,null,"Password",":",null,null,null,null,null,"Password",":",null,null,null,null,null,"Password",":"]
[null,"Ruang",":",{"$f":"\"R.\"&VLOOKUP('KARTU EDUBOX'!$AB$7,'DATA EDUBOX'!$A$14:$T$69,3)","v":"R.01"},null,null,null,null,"Ruang",":",{"$f":"\"R.\"&VLOOKUP('KARTU EDUBOX'!$AB$8,'DATA EDUBOX'!$A$14:$T$69,3)","v":"R.01"},null,null,null,null,"Ruang",":",{"$f":"\"R.\"&VLOOKUP('KARTU EDUBOX'!$AB$9,'DATA EDUBOX'!$A$14:$T$69,3)","v":"R.01"},null,null,null,null,"Ruang",":",{"$f":"\"R.\"&VLOOKUP('KARTU EDUBOX'!$AB$10,'DATA EDUBOX'!$A$14:$T$69,3)","v":"R.01"}]
[]
[]
[null,null,null,"Lumajang, 22 April 2019",null,null,null,null,null,null,{"$f":"D54","v":"Lumajang, 22 April 2019"},null,null,null,null,null,null,{"$f":"D54","v":"Lumajang, 22 April 2019"},null,null,null,null,null,null,{"$f":"D54","v":"Lumajang, 22 April 2019"}]
[null,null,null,"Kepala Madrasah",null,null,null,null,null,null,"Kepala Madrasah",null,null,null,null,null,null,"Kepala Madrasah",null,null,null,null,null,null,"Kepala Madrasah"]
[]
[]
[]
[null,null,null,{"$f":"$AB$14","v":"SAHRONI,S.Pd.I"},null,null,null,null,null,null,{"$f":"$AB$14","v":"SAHRONI,S.Pd.I"},null,null,null,null,null,null,{"$f":"$AB$14","v":"SAHRONI,S.Pd.I"},null,null,null,null,null,null,{"$f":"$AB$14","v":"SAHRONI,S.Pd.I"}]

{"sheet":"RUMUSKARTU","index":2,"n_rows":6,"n_cols":4,"rows_kept":6,"cut":false,"hidden":false,"merged":[]}
["PTS","2017/2018",1,"GANJIL"]
["US","2018/2019",2,"GENAP"]
["UM","2019/2020",3]
["UAMNU","2020/2021",4]
["USMT1","2021/2022",5]
["USMT2",null,6]

{"sheet":"(nomor peserta)nama","index":3,"n_rows":56,"n_cols":3,"rows_kept":56,"cut":false,"hidden":false,"merged":[]}
["80-0162-0001-8","ADITYA MAULA FANDY TAULANI",{"$f":"\"(\"&A1&\") \"&B1","v":"(80-0162-0001-8) ADITYA MAULA FANDY TAULANI"}]
["80-0162-0029-4","AHMAD FERDIAN ALAMSYAH",{"$f":"\"(\"&A2&\") \"&B2","v":"(80-0162-0029-4) AHMAD FERDIAN ALAMSYAH"}]
["80-0162-0002-7","AHMAD RAMADHANI FADLULLOH","(80-0162-0002-7) AHMAD RAMADHANI FADLULLOH"]
["80-0162-0030-3","ANANDA AMILIA","(80-0162-0030-3) ANANDA AMILIA"]
["80-0162-0003-6","ANDINI MAULID DWI LESTARI","(80-0162-0003-6) ANDINI MAULID DWI LESTARI"]
["80-0162-0031-2","ANDRIK YUSRI","(80-0162-0031-2) ANDRIK YUSRI"]
["80-0162-0004-5","DEWI SAKINAH ISWARA","(80-0162-0004-5) DEWI SAKINAH ISWARA"]
["80-0162-0032-9","CHAKIM","(80-0162-0032-9) CHAKIM"]
["80-0162-0005-4","HANIK APRILIA SARI","(80-0162-0005-4) HANIK APRILIA SARI"]
["80-0162-0033-8","DESI NATALIA SAPUTRI","(80-0162-0033-8) DESI NATALIA SAPUTRI"]
["80-0162-0006-3","HIDAYATUL KHUMAINIA","(80-0162-0006-3) HIDAYATUL KHUMAINIA"]
["80-0162-0034-7","DWITA FITA WULANDARI","(80-0162-0034-7) DWITA FITA WULANDARI"]
["80-0162-0007-2","IZZA ILMIA AZZAHRA","(80-0162-0007-2) IZZA ILMIA AZZAHRA"]
["80-0162-0035-6","FARIDATUS SAHDIAH","(80-0162-0035-6) FARIDATUS SAHDIAH"]
["80-0162-0008-9","KHARISYA AZZAHRO","(80-0162-0008-9) KHARISYA AZZAHRO"]
["80-0162-0036-5","KARINA FEBBY CAHYA AMILIA","(80-0162-0036-5) KARINA FEBBY CAHYA AMILIA"]
["80-0162-0009-8","MOCHAMAD RIFKY ROSAN","(80-0162-0009-8) MOCHAMAD RIFKY ROSAN"]
["80-0162-0037-4","KHUSNI CAHYONO","(80-0162-0037-4) KHUSNI CAHYONO"]
["80-0162-0010-7","MUCHAMMAD ALIEF FERDIANSYAH","(80-0162-0010-7) MUCHAMMAD ALIEF FERDIANSYAH"]
["80-0162-0038-3","LENNY AGUSTIN NINGTYAS","(80-0162-0038-3) LENNY AGUSTIN NINGTYAS"]
["80-0162-0011-6","MUHAMMAD AGUS ANDRIANTO","(80-0162-0011-6) MUHAMMAD AGUS ANDRIANTO"]
["80-0162-0039-2","MAURIS HIDAYATUR ROCHMAN","(80-0162-0039-2) MAURIS HIDAYATUR ROCHMAN"]
["80-0162-0012-5","MUHAMMAD BISMAR TAUFIQUROHMAN","(80-0162-0012-5) MUHAMMAD BISMAR TAUFIQUROHMAN"]
["80-0162-0040-9","MAYA BUNGA ANJANI","(80-0162-0040-9) MAYA BUNGA ANJANI"]
["80-0162-0013-4","MUHAMMAD SAHLAN SHODIQ","(80-0162-0013-4) MUHAMMAD SAHLAN SHODIQ"]
["80-0162-0041-8","MITA SEPTIANI ISLAMIA","(80-0162-0041-8) MITA SEPTIANI ISLAMIA"]
["80-0162-0014-3","MUHAMMAD SEPTYAN EKA PRATAMA","(80-0162-0014-3) MUHAMMAD SEPTYAN EKA PRATAMA"]
["80-0162-0042-7","MOCHAMAD ARIEL FRANS TITO","(80-0162-0042-7) MOCHAMAD ARIEL FRANS TITO"]
["80-0162-0015-2","MUHAMMAD VERYANSYAH","(80-0162-0015-2) MUHAMMAD VERYANSYAH"]
["80-0162-0043-6","MOCHAMMAD BIMA RISFANDA","(80-0162-0043-6) MOCHAMMAD BIMA RISFANDA"]
["80-0162-0016-9","MUHAMMAD ZIDNY NA'IM","(80-0162-0016-9) MUHAMMAD ZIDNY NA'IM"]
["80-0162-0044-5","MUHAMMAD AGUS FERDIANSYAH","(80-0162-0044-5) MUHAMMAD AGUS FERDIANSYAH"]
["80-0162-0017-8","NABILA ARISKA PUTRI","(80-0162-0017-8) NABILA ARISKA PUTRI"]
["80-0162-0045-4","MUHAMMAD FARDAN ABDILLAH","(80-0162-0045-4) MUHAMMAD FARDAN ABDILLAH"]
["80-0162-0018-7","NAFISA INDRIANI","(80-0162-0018-7) NAFISA INDRIANI"]
["80-0162-0046-3","MUHAMMAD FERDINAN JAYYIDAH RIFQI","(80-0162-0046-3) MUHAMMAD FERDINAN JAYYIDAH RIFQI"]
["80-0162-0019-6","NAJWA FARISYA BAROROH","(80-0162-0019-6) NAJWA FARISYA BAROROH"]
["80-0162-0047-2","MUHAMMAD FIRMANSYAH","(80-0162-0047-2) MUHAMMAD FIRMANSYAH"]
["80-0162-0020-5","NUR FITRIYAH","(80-0162-0020-5) NUR FITRIYAH"]
["80-0162-0048-9","MUHAMMAD HILDAN DWI SAPUTRA","(80-0162-0048-9) MUHAMMAD HILDAN DWI SAPUTRA"]
["80-0162-0021-4","PUTRI NAFI'ATUS SOLIKHAH","(80-0162-0021-4) PUTRI NAFI'ATUS SOLIKHAH"]
["80-0162-0049-8","MUHAMMAD RAYA KAFAF JAUHARI","(80-0162-0049-8) MUHAMMAD RAYA KAFAF JAUHARI"]
["80-0162-0022-3","QORIATUN SHOLIHAH","(80-0162-0022-3) QORIATUN SHOLIHAH"]
["80-0162-0050-7","MUHAMMAD RUDI TANTOWIK","(80-0162-0050-7) MUHAMMAD RUDI TANTOWIK"]
["80-0162-0023-2","RACHMAD HIDAYAT","(80-0162-0023-2) RACHMAD HIDAYAT"]
["80-0162-0051-6","MUHAMMAD ZULDIENUR HABIBIE","(80-0162-0051-6) MUHAMMAD ZULDIENUR HABIBIE"]
["80-0162-0024-9","RHEA RAYSHANADA NUGRAHA","(80-0162-0024-9) RHEA RAYSHANADA NUGRAHA"]
["80-0162-0052-5","MUKHAMAD KHOIRUL AMIN","(80-0162-0052-5) MUKHAMAD KHOIRUL AMIN"]
["80-0162-0025-8","RIYANTI APRILIA","(80-0162-0025-8) RIYANTI APRILIA"]
["80-0162-0053-4","MUKHAMMAD YAASIIN HASAN KHASBULLOH","(80-0162-0053-4) MUKHAMMAD YAASIIN HASAN KHASBULLOH"]
["80-0162-0026-7","SHONIA AULIA AS'AD","(80-0162-0026-7) SHONIA AULIA AS'AD"]
["80-0162-0054-3","RIZKA AYU WULANDARI","(80-0162-0054-3) RIZKA AYU WULANDARI"]
["80-0162-0027-6","VERLINA DWI MAULANI","(80-0162-0027-6) VERLINA DWI MAULANI"]
["80-0162-0055-2","USWATUN KHASANAH","(80-0162-0055-2) USWATUN KHASANAH"]
["80-0162-0028-5","VIKA KUSUMA WATI","(80-0162-0028-5) VIKA KUSUMA WATI"]
["80-0162-0056-9","YOHAN EGA GILANG PERMANA","(80-0162-0056-9) YOHAN EGA GILANG PERMANA"]

{"sheet":"NAMA NOMOR R.1","index":4,"n_rows":56,"n_cols":2,"rows_kept":56,"cut":false,"hidden":false,"merged":[]}
["80-0162-0001-8","ADITYA MAULA FANDY TAULANI"]
["80-0162-0002-7","AHMAD FERDIAN ALAMSYAH"]
["80-0162-0003-6","AHMAD RAMADHANI FADLULLOH"]
["80-0162-0004-5","ANANDA AMILIA"]
["80-0162-0005-4","ANDINI MAULID DWI LESTARI"]
["80-0162-0006-3","ANDRIK YUSRI"]
["80-0162-0007-2","DEWI SAKINAH ISWARA"]
["80-0162-0008-9","CHAKIM"]
["80-0162-0009-8","HANIK APRILIA SARI"]
["80-0162-0010-7","DESI NATALIA SAPUTRI"]
["80-0162-0011-6","HIDAYATUL KHUMAINIA"]
["80-0162-0012-5","DWITA FITA WULANDARI"]
["80-0162-0013-4","IZZA ILMIA AZZAHRA"]
["80-0162-0014-3","FARIDATUS SAHDIAH"]
["80-0162-0015-2","KHARISYA AZZAHRO"]
["80-0162-0016-9","KARINA FEBBY CAHYA AMILIA"]
["80-0162-0017-8","MOCHAMAD RIFKY ROSAN"]
["80-0162-0018-7","KHUSNI CAHYONO"]
["80-0162-0019-6","MUCHAMMAD ALIEF FERDIANSYAH"]
["80-0162-0020-5","LENNY AGUSTIN NINGTYAS"]
["80-0162-0021-4","MUHAMMAD AGUS ANDRIANTO"]
["80-0162-0022-3","MAURIS HIDAYATUR ROCHMAN"]
["80-0162-0023-2","MUHAMMAD BISMAR TAUFIQUROHMAN"]
["80-0162-0024-9","MAYA BUNGA ANJANI"]
["80-0162-0025-8","MUHAMMAD SAHLAN SHODIQ"]
["80-0162-0026-7","MITA SEPTIANI ISLAMIA"]
["80-0162-0027-6","MUHAMMAD SEPTYAN EKA PRATAMA"]
["80-0162-0028-5","MOCHAMAD ARIEL FRANS TITO"]
["80-0162-0029-4","MUHAMMAD VERYANSYAH"]
["80-0162-0030-3","MOCHAMMAD BIMA RISFANDA"]
["80-0162-0031-2","MUHAMMAD ZIDNY NA'IM"]
["80-0162-0032-9","MUHAMMAD AGUS FERDIANSYAH"]
["80-0162-0033-8","NABILA ARISKA PUTRI"]
["80-0162-0034-7","MUHAMMAD FARDAN ABDILLAH"]
["80-0162-0035-6","NAFISA INDRIANI"]
["80-0162-0036-5","MUHAMMAD FERDINAN JAYYIDAH RIFQI"]
["80-0162-0037-4","NAJWA FARISYA BAROROH"]
["80-0162-0038-3","MUHAMMAD FIRMANSYAH"]
["80-0162-0039-2","NUR FITRIYAH"]
["80-0162-0040-9","MUHAMMAD HILDAN DWI SAPUTRA"]
["80-0162-0041-8","PUTRI NAFI'ATUS SOLIKHAH"]
["80-0162-0042-7","MUHAMMAD RAYA KAFAF JAUHARI"]
["80-0162-0043-6","QORIATUN SHOLIHAH"]
["80-0162-0044-5","MUHAMMAD RUDI TANTOWIK"]
["80-0162-0045-4","RACHMAD HIDAYAT"]
["80-0162-0046-3","MUHAMMAD ZULDIENUR HABIBIE"]
["80-0162-0047-2","RHEA RAYSHANADA NUGRAHA"]
["80-0162-0048-9","MUKHAMAD KHOIRUL AMIN"]
["80-0162-0049-8","RIYANTI APRILIA"]
["80-0162-0050-7","MUKHAMMAD YAASIIN HASAN KHASBULLOH"]
["80-0162-0051-6","SHONIA AULIA AS'AD"]
["80-0162-0052-5","RIZKA AYU WULANDARI"]
["80-0162-0053-4","VERLINA DWI MAULANI"]
["80-0162-0054-3","USWATUN KHASANAH"]
["80-0162-0055-2","VIKA KUSUMA WATI"]
["80-0162-0056-9","YOHAN EGA GILANG PERMANA"]

{"sheet":"Daftar nama R.2","index":5,"n_rows":26,"n_cols":3,"rows_kept":26,"cut":false,"hidden":false,"merged":[[0,0,0,2],[1,0,1,2],[2,0,2,2]]}
["DAFTAR PESERTA USBN-BK"]
["MIS NURUL ISLAM LABRUK KIDUL "]
["TAHUN PELAJARAN 2018/2019"]
[]
["RUANG 248"]
["NO","NAMA","NOMOR PESERTA"]
["1","MUHAMMAD AGUS ANDRIANTO","80-0162-0021-4"]
["2","MAURIS HIDAYATUR ROCHMAN","80-0162-0022-3"]
["3","MUHAMMAD BISMAR TAUFIQUROHMAN","80-0162-0023-2"]
["4","MAYA BUNGA ANJANI","80-0162-0024-9"]
["5","MUHAMMAD SAHLAN SHODIQ","80-0162-0025-8"]
["6","MITA SEPTIANI ISLAMIA","80-0162-0026-7"]
["7","MUHAMMAD SEPTYAN EKA PRATAMA","80-0162-0027-6"]
["8","MOCHAMAD ARIEL FRANS TITO","80-0162-0028-5"]
["9","MUHAMMAD VERYANSYAH","80-0162-0029-4"]
["10","MOCHAMMAD BIMA RISFANDA","80-0162-0030-3"]
["11","MUHAMMAD ZIDNY NA'IM","80-0162-0031-2"]
["12","MUHAMMAD AGUS FERDIANSYAH","80-0162-0032-9"]
["13","NABILA ARISKA PUTRI","80-0162-0033-8"]
["14","MUHAMMAD FARDAN ABDILLAH","80-0162-0034-7"]
["15","NAFISA INDRIANI","80-0162-0035-6"]
["16","MUHAMMAD FERDINAN JAYYIDAH RIFQI","80-0162-0036-5"]
["17","NAJWA FARISYA BAROROH","80-0162-0037-4"]
["18","MUHAMMAD FIRMANSYAH","80-0162-0038-3"]
["19","NUR FITRIYAH","80-0162-0039-2"]
["20","MUHAMMAD HILDAN DWI SAPUTRA","80-0162-0040-9"]

{"sheet":"Daftar nama R.3","index":6,"n_rows":26,"n_cols":3,"rows_kept":26,"cut":false,"hidden":false,"merged":[[0,0,0,2],[1,0,1,2],[2,0,2,2]]}
["DAFTAR PESERTA USBN-BK"]
["MIS NURUL ISLAM LABRUK KIDUL "]
["TAHUN PELAJARAN 2018/2019"]
[]
["RUANG 249"]
["NO","NAMA","NOMOR PESERTA"]
["1","PUTRI NAFI'ATUS SOLIKHAH","80-0162-0041-8"]
["2","MUHAMMAD RAYA KAFAF JAUHARI","80-0162-0042-7"]
["3","QORIATUN SHOLIHAH","80-0162-0043-6"]
["4","MUHAMMAD RUDI TANTOWIK","80-0162-0044-5"]
["5","RACHMAD HIDAYAT","80-0162-0045-4"]
["6","MUHAMMAD ZULDIENUR HABIBIE","80-0162-0046-3"]
["7","RHEA RAYSHANADA NUGRAHA","80-0162-0047-2"]
["8","MUKHAMAD KHOIRUL AMIN","80-0162-0048-9"]
["9","RIYANTI APRILIA","80-0162-0049-8"]
["10","MUKHAMMAD YAASIIN HASAN KHASBULLOH","80-0162-0050-7"]
["11","SHONIA AULIA AS'AD","80-0162-0051-6"]
["12","RIZKA AYU WULANDARI","80-0162-0052-5"]
["13","VERLINA DWI MAULANI","80-0162-0053-4"]
["14","USWATUN KHASANAH","80-0162-0054-3"]
["15","VIKA KUSUMA WATI","80-0162-0055-2"]
["16","YOHAN EGA GILANG PERMANA","80-0162-0056-9"]
["17"]
["18"]
["19"]
["20"]

{"sheet":"Daftar nama R.1","index":7,"n_rows":26,"n_cols":3,"rows_kept":26,"cut":false,"hidden":false,"merged":[[0,0,0,2],[1,0,1,2],[2,0,2,2]]}
["DAFTAR PESERTA USBN-BK"]
["MIS NURUL ISLAM LABRUK KIDUL "]
["TAHUN PELAJARAN 2018/2019"]
[]
["RUANG 247"]
["NO","NAMA","NOMOR PESERTA"]
["1","ADITYA MAULA FANDY TAULANI","80-0162-0001-8"]
["2","AHMAD FERDIAN ALAMSYAH","80-0162-0002-7"]
["3","AHMAD RAMADHANI FADLULLOH","80-0162-0003-6"]
["4","ANANDA AMILIA","80-0162-0004-5"]
["5","ANDINI MAULID DWI LESTARI","80-0162-0005-4"]
["6","ANDRIK YUSRI","80-0162-0006-3"]
["7","DEWI SAKINAH ISWARA","80-0162-0007-2"]
["8","CHAKIM","80-0162-0008-9"]
["9","HANIK APRILIA SARI","80-0162-0009-8"]
["10","DESI NATALIA SAPUTRI","80-0162-0010-7"]
["11","HIDAYATUL KHUMAINIA","80-0162-0011-6"]
["12","DWITA FITA WULANDARI","80-0162-0012-5"]
["13","IZZA ILMIA AZZAHRA","80-0162-0013-4"]
["14","FARIDATUS SAHDIAH","80-0162-0014-3"]
["15","KHARISYA AZZAHRO","80-0162-0015-2"]
["16","KARINA FEBBY CAHYA AMILIA","80-0162-0016-9"]
["17","MOCHAMAD RIFKY ROSAN","80-0162-0017-8"]
["18","KHUSNI CAHYONO","80-0162-0018-7"]
["19","MUCHAMMAD ALIEF FERDIANSYAH","80-0162-0019-6"]
["20","LENNY AGUSTIN NINGTYAS","80-0162-0020-5"]

{"sheet":"DENAH R.1","index":8,"n_rows":23,"n_cols":11,"rows_kept":23,"cut":false,"hidden":false,"merged":[[6,5,6,7],[5,9,5,10],[0,1,0,10],[1,1,1,10],[2,1,2,10]]}
[null,"DENAH RUANG USBN-BK"]
[null,"UJIAN MADRASAH (UM) MI NURUL ISLAM LABRUK KIDUL"]
[null,{"$f":"[1]DATALENGKAP!D2&\" \"&[1]DATALENGKAP!F2","v":"TAHUN PELAJARAN 2018/2019"}]
[]
[]
[null,null,null,null,null,null,null,null,null,"RUANG 247"]
[null,null,null,null,null,"MEJA PENGAWAS"]
[]
[]
[null,null,{"$f":"'NAMA NOMOR R.1'!B1","v":"ADITYA MAULA FANDY TAULANI"},null,{"$f":"'NAMA NOMOR R.1'!B2","v":"AHMAD FERDIAN ALAMSYAH"},null,{"$f":"'NAMA NOMOR R.1'!B3","v":"AHMAD RAMADHANI FADLULLOH"},null,{"$f":"'NAMA NOMOR R.1'!B4","v":"ANANDA AMILIA"},null,{"$f":"'NAMA NOMOR R.1'!B5","v":"ANDINI MAULID DWI LESTARI"}]
[null,null,{"$f":"'NAMA NOMOR R.1'!A1","v":"80-0162-0001-8"},null,{"$f":"'NAMA NOMOR R.1'!A2","v":"80-0162-0002-7"},null,{"$f":"'NAMA NOMOR R.1'!A3","v":"80-0162-0003-6"},null,{"$f":"'NAMA NOMOR R.1'!A4","v":"80-0162-0004-5"},null,{"$f":"'NAMA NOMOR R.1'!A5","v":"80-0162-0005-4"}]
[]
[]
[null,null,{"$f":"'NAMA NOMOR R.1'!B10","v":"DESI NATALIA SAPUTRI"},null,{"$f":"'NAMA NOMOR R.1'!B9","v":"HANIK APRILIA SARI"},null,{"$f":"'NAMA NOMOR R.1'!B8","v":"CHAKIM"},null,{"$f":"'NAMA NOMOR R.1'!B7","v":"DEWI SAKINAH ISWARA"},null,{"$f":"'NAMA NOMOR R.1'!B6","v":"ANDRIK YUSRI"}]
[null,null,{"$f":"'NAMA NOMOR R.1'!A10","v":"80-0162-0010-7"},null,{"$f":"'NAMA NOMOR R.1'!A9","v":"80-0162-0009-8"},null,{"$f":"'NAMA NOMOR R.1'!A8","v":"80-0162-0008-9"},null,{"$f":"'NAMA NOMOR R.1'!A7","v":"80-0162-0007-2"},null,{"$f":"'NAMA NOMOR R.1'!A6","v":"80-0162-0006-3"}]
[]
[]
[null,null,{"$f":"'NAMA NOMOR R.1'!B11","v":"HIDAYATUL KHUMAINIA"},null,{"$f":"'NAMA NOMOR R.1'!B12","v":"DWITA FITA WULANDARI"},null,{"$f":"'NAMA NOMOR R.1'!B13","v":"IZZA ILMIA AZZAHRA"},null,{"$f":"'NAMA NOMOR R.1'!B14","v":"FARIDATUS SAHDIAH"},null,{"$f":"'NAMA NOMOR R.1'!B15","v":"KHARISYA AZZAHRO"}]
[null,null,{"$f":"'NAMA NOMOR R.1'!A11","v":"80-0162-0011-6"},null,{"$f":"'NAMA NOMOR R.1'!A12","v":"80-0162-0012-5"},null,{"$f":"'NAMA NOMOR R.1'!A13","v":"80-0162-0013-4"},null,{"$f":"'NAMA NOMOR R.1'!A14","v":"80-0162-0014-3"},null,{"$f":"'NAMA NOMOR R.1'!A15","v":"80-0162-0015-2"}]
[]
[]
[null,null,{"$f":"'NAMA NOMOR R.1'!B20","v":"LENNY AGUSTIN NINGTYAS"},null,{"$f":"'NAMA NOMOR R.1'!B19","v":"MUCHAMMAD ALIEF FERDIANSYAH"},null,{"$f":"'NAMA NOMOR R.1'!B18","v":"KHUSNI CAHYONO"},null,{"$f":"'NAMA NOMOR R.1'!B17","v":"MOCHAMAD RIFKY ROSAN"},null,{"$f":"'NAMA NOMOR R.1'!B16","v":"KARINA FEBBY CAHYA AMILIA"}]
[null,null,{"$f":"'NAMA NOMOR R.1'!A20","v":"80-0162-0020-5"},null,{"$f":"'NAMA NOMOR R.1'!A19","v":"80-0162-0019-6"},null,{"$f":"'NAMA NOMOR R.1'!A18","v":"80-0162-0018-7"},null,{"$f":"'NAMA NOMOR R.1'!A17","v":"80-0162-0017-8"},null,{"$f":"'NAMA NOMOR R.1'!A16","v":"80-0162-0016-9"}]

{"sheet":"DENAH R.2","index":9,"n_rows":23,"n_cols":11,"rows_kept":23,"cut":false,"hidden":false,"merged":[[0,1,0,10],[1,1,1,10],[2,1,2,10],[5,9,5,10],[6,5,6,7]]}
[null,"DENAH RUANG USBN-BK"]
[null,"UJIAN MADRASAH (UM) MI NURUL ISLAM LABRUK KIDUL"]
[null,{"$f":"[1]DATALENGKAP!D2&\" \"&[1]DATALENGKAP!F2","v":"TAHUN PELAJARAN 2018/2019"}]
[]
[]
[null,null,null,null,null,null,null,null,null,"RUANG 248"]
[null,null,null,null,null,"MEJA PENGAWAS"]
[]
[]
[null,null,{"$f":"'NAMA NOMOR R.1'!B21","v":"MUHAMMAD AGUS ANDRIANTO"},null,{"$f":"'NAMA NOMOR R.1'!B22","v":"MAURIS HIDAYATUR ROCHMAN"},null,{"$f":"'NAMA NOMOR R.1'!B23","v":"MUHAMMAD BISMAR TAUFIQUROHMAN"},null,{"$f":"'NAMA NOMOR R.1'!B24","v":"MAYA BUNGA ANJANI"},null,{"$f":"'NAMA NOMOR R.1'!B25","v":"MUHAMMAD SAHLAN SHODIQ"}]
[null,null,{"$f":"'NAMA NOMOR R.1'!A21","v":"80-0162-0021-4"},null,{"$f":"'NAMA NOMOR R.1'!A22","v":"80-0162-0022-3"},null,{"$f":"'NAMA NOMOR R.1'!A23","v":"80-0162-0023-2"},null,{"$f":"'NAMA NOMOR R.1'!A24","v":"80-0162-0024-9"},null,{"$f":"'NAMA NOMOR R.1'!A25","v":"80-0162-0025-8"}]
[]
[]
[null,null,{"$f":"'NAMA NOMOR R.1'!B30","v":"MOCHAMMAD BIMA RISFANDA"},null,{"$f":"'NAMA NOMOR R.1'!B29","v":"MUHAMMAD VERYANSYAH"},null,{"$f":"'NAMA NOMOR R.1'!B28","v":"MOCHAMAD ARIEL FRANS TITO"},null,{"$f":"'NAMA NOMOR R.1'!B27","v":"MUHAMMAD SEPTYAN EKA PRATAMA"},null,{"$f":"'NAMA NOMOR R.1'!B26","v":"MITA SEPTIANI ISLAMIA"}]
[null,null,{"$f":"'NAMA NOMOR R.1'!A30","v":"80-0162-0030-3"},null,{"$f":"'NAMA NOMOR R.1'!A29","v":"80-0162-0029-4"},null,{"$f":"'NAMA NOMOR R.1'!A28","v":"80-0162-0028-5"},null,{"$f":"'NAMA NOMOR R.1'!A27","v":"80-0162-0027-6"},null,{"$f":"'NAMA NOMOR R.1'!A26","v":"80-0162-0026-7"}]
[]
[]
[null,null,{"$f":"'NAMA NOMOR R.1'!B31","v":"MUHAMMAD ZIDNY NA'IM"},null,{"$f":"'NAMA NOMOR R.1'!B32","v":"MUHAMMAD AGUS FERDIANSYAH"},null,{"$f":"'NAMA NOMOR R.1'!B33","v":"NABILA ARISKA PUTRI"},null,{"$f":"'NAMA NOMOR R.1'!B34","v":"MUHAMMAD FARDAN ABDILLAH"},null,{"$f":"'NAMA NOMOR R.1'!B35","v":"NAFISA INDRIANI"}]
[null,null,{"$f":"'NAMA NOMOR R.1'!A31","v":"80-0162-0031-2"},null,{"$f":"'NAMA NOMOR R.1'!A32","v":"80-0162-0032-9"},null,{"$f":"'NAMA NOMOR R.1'!A33","v":"80-0162-0033-8"},null,{"$f":"'NAMA NOMOR R.1'!A34","v":"80-0162-0034-7"},null,{"$f":"'NAMA NOMOR R.1'!A35","v":"80-0162-0035-6"}]
[]
[]
[null,null,{"$f":"'NAMA NOMOR R.1'!B40","v":"MUHAMMAD HILDAN DWI SAPUTRA"},null,{"$f":"'NAMA NOMOR R.1'!B39","v":"NUR FITRIYAH"},null,{"$f":"'NAMA NOMOR R.1'!B38","v":"MUHAMMAD FIRMANSYAH"},null,{"$f":"'NAMA NOMOR R.1'!B37","v":"NAJWA FARISYA BAROROH"},null,{"$f":"'NAMA NOMOR R.1'!B36","v":"MUHAMMAD FERDINAN JAYYIDAH RIFQI"}]
[null,null,{"$f":"'NAMA NOMOR R.1'!A40","v":"80-0162-0040-9"},null,{"$f":"'NAMA NOMOR R.1'!A39","v":"80-0162-0039-2"},null,{"$f":"'NAMA NOMOR R.1'!A38","v":"80-0162-0038-3"},null,{"$f":"'NAMA NOMOR R.1'!A37","v":"80-0162-0037-4"},null,{"$f":"'NAMA NOMOR R.1'!A36","v":"80-0162-0036-5"}]

{"sheet":"DENAH R.3","index":10,"n_rows":23,"n_cols":11,"rows_kept":23,"cut":false,"hidden":false,"merged":[[0,1,0,10],[1,1,1,10],[2,1,2,10],[5,9,5,10],[6,5,6,7]]}
[null,"DENAH RUANG USBN-BK"]
[null,"UJIAN MADRASAH (UM) MI NURUL ISLAM LABRUK KIDUL"]
[null,{"$f":"[1]DATALENGKAP!D2&\" \"&[1]DATALENGKAP!F2","v":"TAHUN PELAJARAN 2018/2019"}]
[]
[]
[null,null,null,null,null,null,null,null,null,"RUANG 249"]
[null,null,null,null,null,"MEJA PENGAWAS"]
[]
[]
[null,null,{"$f":"'NAMA NOMOR R.1'!B41","v":"PUTRI NAFI'ATUS SOLIKHAH"},null,{"$f":"'NAMA NOMOR R.1'!B42","v":"MUHAMMAD RAYA KAFAF JAUHARI"},null,{"$f":"'NAMA NOMOR R.1'!B43","v":"QORIATUN SHOLIHAH"},null,{"$f":"'NAMA NOMOR R.1'!B44","v":"MUHAMMAD RUDI TANTOWIK"},null,{"$f":"'NAMA NOMOR R.1'!B45","v":"RACHMAD HIDAYAT"}]
[null,null,{"$f":"'NAMA NOMOR R.1'!A41","v":"80-0162-0041-8"},null,{"$f":"'NAMA NOMOR R.1'!A42","v":"80-0162-0042-7"},null,{"$f":"'NAMA NOMOR R.1'!A43","v":"80-0162-0043-6"},null,{"$f":"'NAMA NOMOR R.1'!A44","v":"80-0162-0044-5"},null,{"$f":"'NAMA NOMOR R.1'!A45","v":"80-0162-0045-4"}]
[]
[]
[null,null,{"$f":"'NAMA NOMOR R.1'!B50","v":"MUKHAMMAD YAASIIN HASAN KHASBULLOH"},null,{"$f":"'NAMA NOMOR R.1'!B49","v":"RIYANTI APRILIA"},null,{"$f":"'NAMA NOMOR R.1'!B48","v":"MUKHAMAD KHOIRUL AMIN"},null,{"$f":"'NAMA NOMOR R.1'!B47","v":"RHEA RAYSHANADA NUGRAHA"},null,{"$f":"'NAMA NOMOR R.1'!B46","v":"MUHAMMAD ZULDIENUR HABIBIE"}]
[null,null,{"$f":"'NAMA NOMOR R.1'!A50","v":"80-0162-0050-7"},null,{"$f":"'NAMA NOMOR R.1'!A49","v":"80-0162-0049-8"},null,{"$f":"'NAMA NOMOR R.1'!A48","v":"80-0162-0048-9"},null,{"$f":"'NAMA NOMOR R.1'!A47","v":"80-0162-0047-2"},null,{"$f":"'NAMA NOMOR R.1'!A46","v":"80-0162-0046-3"}]
[]
[]
[null,null,{"$f":"'NAMA NOMOR R.1'!B51","v":"SHONIA AULIA AS'AD"},null,{"$f":"'NAMA NOMOR R.1'!B52","v":"RIZKA AYU WULANDARI"},null,{"$f":"'NAMA NOMOR R.1'!B53","v":"VERLINA DWI MAULANI"},null,{"$f":"'NAMA NOMOR R.1'!B54","v":"USWATUN KHASANAH"},null,{"$f":"'NAMA NOMOR R.1'!B55","v":"VIKA KUSUMA WATI"}]
[null,null,{"$f":"'NAMA NOMOR R.1'!A51","v":"80-0162-0051-6"},null,{"$f":"'NAMA NOMOR R.1'!A52","v":"80-0162-0052-5"},null,{"$f":"'NAMA NOMOR R.1'!A53","v":"80-0162-0053-4"},null,{"$f":"'NAMA NOMOR R.1'!A54","v":"80-0162-0054-3"},null,{"$f":"'NAMA NOMOR R.1'!A55","v":"80-0162-0055-2"}]
[]
[]
[null,null,null,null,null,null,null,null,null,null,{"$f":"'NAMA NOMOR R.1'!B56","v":"YOHAN EGA GILANG PERMANA"}]
[null,null,null,null,null,null,null,null,null,null,{"$f":"'NAMA NOMOR R.1'!A56","v":"80-0162-0056-9"}]