{"text_format":"1","workbook":"xlsx","n_sheets":11,"sheets":["DATA EDUBOX","KARTU EDUBOX","RUMUSKARTU","(nomor peserta)nama","NAMA NOMOR R.1","Daftar nama R.2","Daftar nama R.3","Daftar nama R.1","DENAH R.1","DENAH R.2","DENAH R.3"],"not_rendered":{"charts":0,"images":68,"macros":0,"external_links":1,"defined_names":24,"comments":0,"pivot_tables":0},"unopened":[],"bounds":{"document_bytes":16777216,"sheet_cells":100000,"rows_first":2000,"rows_last":500,"rows_between":2000,"halvings":0,"cell_chars":16384,"cell_head_chars":4096},"cells_cut":0,"cells_raw":0,"read":"whole","date_system":"1900"}

{"sheet":"DATA EDUBOX","index":0,"n_rows":73,"n_cols":18,"rows_kept":73,"cut":false,"hidden":false,"merged":[]}
["NAMA MADRASAH",null,null,"MIS NURUL ISLAM LABRUK KIDUL"]
["KECAMATAN",null,null,"SUMBERSUKO"]
["KABUPATEN",null,null,"LUMAJANG"]
["ALAMAT",null,null,"Jl. Raya Labruk Kidul 65"]
["DESA",null,null,"Labruk Kidul"]
["NAMA UJIAN",null,null,"USBN-BK","GENAP"]
["TAHUN PELAJARAN",null,null,"2018/2019"]
["KEPALA MADRASAH",null,null,"SAHRONI,S.Pd.I"]
["TEMPAT UJIAN",null,null,"Labruk Kidul"]
[]
[]
[1,2,3,4,5,6,7,8,9,10,11,12,13,14,15,16,17]
["NO URUT","NO ABSEN","RUANG","email","username","encrypted_password","role_id","created_at","updated_at","class_id","reset_password","display_name","image","trash","nisn","sync_status","stats_status","id_absen_solution"]
[1,1,"01","6A1@mail.id","80-0162-0001-8","$2a$08$75LT7SJuQ4rXUZ6fkhDj2uYb2/d96cRp/wp4jPYECHoTtEzLazaJO",2,"0000-00-00 00:00:00","0000-00-00 00:00:00",1,null,"ADITYA MAULA FANDY TAULANI"]
[2,2,"01","6B1@mail.id","80-0162-0002-7","$2a$08$75LT7SJuQ4rXUZ6fkhDj2uYb2/d96cRp/wp4jPYECHoTtEzLazaJO",2,"0000-00-00 00:00:00","0000-00-00 00:00:00",1,null,"AHMAD FERDIAN ALAMSYAH"]
[3,3,"01","6A2@mail.id","80-0162-0003-6","$2a$08$75LT7SJuQ4rXUZ6fkhDj2uYb2/d96cRp/wp4jPYECHoTtEzLazaJO",2,"0000-00-00 00:00:00","2018-12-06T02:52:00",1,null,"AHMAD RAMADHANI FADLULLOH","26980d544b88e435156c67cb48ab4bd9.jpg",null,null,2]
[4,4,"01","6B2@mail.id","80-0162-0004-5","$2a$08$75LT7SJuQ4rXUZ6fkhDj2uYb2/d96cRp/wp4jPYECHoTtEzLazaJO",2,"0000-00-00 00:00:00","2018-12-05T20:41:00",1,null,"ANANDA AMILIA","IMG-20181118-WA0013.jpg",null,null,2]
[5,5,"01","6A3@mail.id","80-0162-0005-4","$2a$08$75LT7SJuQ4rXUZ6fkhDj2uYb2/d96cRp/wp4jPYECHoTtEzLazaJO",2,"0000-00-00 00:00:00","2018-12-07T23:43:00",1,null,"ANDINI MAULID DWI LESTARI","Lisa-black-pink-40579158-500-552.jpg",null,null,2]
[6,6,"01","6B3@mail.id","80-0162-0006-3","$2a$08$75LT7SJuQ4rXUZ6fkhDj2uYb2/d96cRp/wp4jPYECHoTtEzLazaJO",2,"0000-00-00 00:00:00","2018-12-06T02:30:00",1,null,"ANDRIK YUSRI","blogers.jpg",null,null,2]
[7,7,"01","6A4@mail.id","80-0162-0007-2","$2a$08$75LT7SJuQ4rXUZ6fkhDj2uYb2/d96cRp/wp4jPYECHoTtEzLazaJO",2,"0000-00-00 00:00:00","2018-12-07T23:45:00",1,null,"DEWI SAKINAH ISWARA","Profil-Kartun-Muslimah-Bercadar.jpg",null,null,2]
{"$rows_left_out":54}
{"sheet":"KARTU EDUBOX","index":1,"n_rows":59,"n_cols":28,"rows_kept":59,"cut":false,"hidden":false,"merged":[[1,2,1,3],[4,2,4,3],[35,2,35,3],[8,1,8,3],[9,1,9,3],[12,1,12,3],[2,2,2,3],[3,2,3,3],[13,1,13,3],[6,1,6,3],[32,2,32,3],[33,2,33,3],[34,2,34,3],[37,1,37,3],[39,1,39,3],[40,1,40,3],[43,1,43,3],[44,1,44,3],[35,9,35,10],[37,8,37,10],[39,8,39,10],[32,9,32,10],[33,9,33,10],[8,8,8,10],[9,8,9,10],[12,8,12,10],[13,8,13,10],[34,9,34,10],[35,16,35,17],[40,8,40,10],[43,8,43,10],[44,8,44,10],[1,16,1,17],[2,16,2,17],[3,16,3,17],[4,16,4,17],[6,15,6,17],[8,15,8,17],[9,15,9,17],[1,9,1,10],[2,9,2,10],[3,9,3,10],[4,9,4,10],[6,8,6,10],[12,15,12,17],[13,15,13,17],[32,16,32,17],[33,16,33,17],[34,16,34,17],[1,23,1,24],[2,23,2,24],[3,23,3,24],[4,23,4,24],[6,22,6,24],[37,15,37,17],[39,15,39,17],[40,15,40,17],[43,15,43,17],[44,15,44,17],[8,22,8,24],[9,22,9,24],[12,22,12,24],[13,22,13,24],[32,23,32,24],[44,22,44,24],[13,27,13,29],[12,27,12,29],[34,23,34,24],[35,23,35,24],[37,22,37,24],[39,22,39,24],[40,22,40,24],[43,22,43,24],[33,23,33,24]]}
[]
[null,null,"Kementerian Agama Kab. Lumajang",null,null,null,null,null,null,"Kementerian Agama Kab. Lumajang",null,null,null,null,null,null,"Kementerian Agama Kab. Lumajang",null,null,null,null,null,null,"Kementerian Agama Kab. Lumajang"]
[null,null,{"$f":"'DATA EDUBOX'!$D$1","v":"MIS NURUL ISLAM LABRUK KIDUL"},null,null,null,null,null,null,{"$f":"'DATA EDUBOX'!$D$1","v":"MIS NURUL ISLAM LABRUK KIDUL"},null,null,null,null,null,null,{"$f":"'DATA EDUBOX'!$D$1","v":"MIS NURUL ISLAM LABRUK KIDUL"},null,null,null,null,null,null,{"$f":"'DATA EDUBOX'!$D$1","v":"MIS NURUL ISLAM LABRUK KIDUL"},null,null,null,1]
[null,null,{"$f":"'DATA EDUBOX'!$D$2&\" - \"&'DATA EDUBOX'!$D$3","v":"SUMBERSUKO - LUMAJANG"},null,null,null,null,null,null,{"$f":"'DATA EDUBOX'!$D$2&\" - \"&'DATA EDUBOX'!$D$3","v":"SUMBERSUKO - LUMAJANG"},null,null,null,null,null,null,{"$f":"'DATA EDUBOX'!$D$2&\" - \"&'DATA EDUBOX'!$D$3","v":"SUMBERSUKO - LUMAJANG"},null,null,null,null,null,null,{"$f":"'DATA EDUBOX'!$D$2&\" - \"&'DATA EDUBOX'!$D$3","v":"SUMBERSUKO - LUMAJANG"},null,null,null,{"$f":"AB3+1","v":2}]
[null,null,{"$f":"'DATA EDUBOX'!$D$4&\" Desa \"&'DATA EDUBOX'!$D$5","v":"Jl. Raya Labruk Kidul 65 Desa Labruk Kidul"},null,null,null,null,null,null,{"$f":"'DATA EDUBOX'!$D$4&\" Desa \"&'DATA EDUBOX'!$D$5","v":"Jl. Raya Labruk Kidul 65 Desa Labruk Kidul"},null,null,null,null,null,null,{"$f":"'DATA EDUBOX'!$D$4&\" Desa \"&'DATA EDUBOX'!$D$5","v":"Jl. Raya Labruk Kidul 65 Desa Labruk Kidul"},null,null,null,null,null,null,{"$f":"'DATA EDUBOX'!$D$4&\" Desa \"&'DATA EDUBOX'!$D$5","v":"Jl. Raya Labruk Kidul 65 Desa Labruk Kidul"},null,null,null,{"$f":"AB4+1","v":3}]
[null,null,null,null,null,null,null,null,null,null,null,null,null,null,null,null,null,null,null,null,null,null,null,null,null,null,null,4]
[null,"KARTU PESERTA",null,null,null,null,null,null,"KARTU PESERTA",null,null,null,null,null,null,"KARTU PESERTA",null,null,null,null,null,null,"KARTU PESERTA",null,null,null,null,5]
[null,null,null,null,null,null,null,null,null,null,null,null,null,null,null,null,null,null,null,null,null,null,null,null,null,null,null,6]
[null,{"$f":"'DATA EDUBOX'!D6","v":"USBN-BK"},null,null,null,null,null,null,{"$f":"'DATA EDUBOX'!D6","v":"USBN-BK"},null,null,null,null,null,null,{"$f":"'DATA EDUBOX'!D6","v":"USBN-BK"},null,null,null,null,null,null,{"$f":"'DATA EDUBOX'!D6","v":"USBN-BK"},null,null,null,null,7]
[null,"TAHUN PELAJARAN 2018/2019",null,null,null,null,null,null,"TAHUN PELAJARAN 2018/2019",null,null,null,null,null,null,"TAHUN PELAJARAN 2018/2019",null,null,null,null,null,null,"TAHUN PELAJARAN 2018/2019",null,null,null,null,{"$f":"AB9+1","v":8}]
[]
[]
[null,"NAMA PESERTA",null,null,null,null,null,null,"NAMA PESERTA",null,null,null,null,null,null,"NAMA PESERTA",null,null,null,null,null,null,"NAMA PESERTA",null,null,null,null,"KEPALA MADRASAH"]
[null,{"$f":"VLOOKUP('KARTU EDUBOX'!$AB$3,'DATA EDUBOX'!$A$14:$T$69,12)","v":"ADITYA MAULA FANDY TAULANI"},null,null,null,null,null,null,{"$f":"VLOOKUP('KARTU EDUBOX'!$AB$4,'DATA EDUBOX'!$A$14:$T$69,12)","v":"AHMAD FERDIAN ALAMSYAH"},null,null,null,null,null,null,{"$f":"VLOOKUP('KARTU EDUBOX'!$AB$5,'DATA EDUBOX'!$A$14:$T$69,12)","v":"AHMAD RAMADHANI FADLULLOH"},null,null,null,null,null,null,{"$f":"VLOOKUP('KARTU EDUBOX'!$AB$6,'DATA EDUBOX'!$A$14:$T$69,12)","v":"ANANDA AMILIA"},null,null,null,null,"SAHRONI,S.Pd.I"]
[]
[null,"No. Peserta",":",{"$f":"VLOOKUP('KARTU EDUBOX'!$AB$3,'DATA EDUBOX'!$A$14:$T$69,5)","v":"80-0162-0001-8"},null,null,null,null,"No. Peserta",":",{"$f":"VLOOKUP('KARTU EDUBOX'!$AB$4,'DATA EDUBOX'!$A$14:$T$69,5)","v":"80-0162-0002-7"},null,null,null,null,"No. Peserta",":",{"$f":"VLOOKUP('KARTU EDUBOX'!$AB$5,'DATA EDUBOX'!$A$14:$T$69,5)","v":"80-0162-0003-6"},null,null,null,null,"No. Peserta",":",{"$f":"VLOOKUP('KARTU EDUBOX'!$AB$6,'DATA EDUBOX'!$A$14:$T$69,5)","v":"80-0162-0004-5"}]
[null,"Kelas",":",{"$f":"LEFT(VLOOKUP('KARTU EDUBOX'!$AB$3,'DATA EDUBOX'!$A$14:$T$69,4),2)","v":"6A"},null,null,null,null,"Kelas",":",{"$f":"LEFT(VLOOKUP('KARTU EDUBOX'!$AB$4,'DATA EDUBOX'!$A$14:$T$69,4),2)","v":"6B"},null,null,null,null,"Kelas",":",{"$f":"LEFT(VLOOKUP('KARTU EDUBOX'!$AB$5,'DATA EDUBOX'!$A$14:$T$69,4),2)","v":"6A"},null,null,null,null,"Kelas",":",{"$f":"LEFT(VLOOKUP('KARTU EDUBOX'!$AB$6,'DATA EDUBOX'!$A$14:$T$69,4),2)","v":"6B"}]
[null,"Username",":",{"$f":"VLOOKUP('KARTU EDUBOX'!$AB$3,'DATA EDUBOX'!$A$14:$T$69,4)","v":"6A1@mail.id"},null,null,null,null,"Username",":",{"$f":"VLOOKUP('KARTU EDUBOX'!$AB$4,'DATA EDUBOX'!$A$14:$T$69,4)","v":"6B1@mail.id"},null,null,null,null,"Username",":",{"$f":"VLOOKUP('KARTU EDUBOX'!$AB$5,'DATA EDUBOX'!$A$14:$T$69,4)","v":"6A2@mail.id"},null,null,null,null,"Username",":",{"$f":"VLOOKUP('KARTU EDUBOX'!$AB$6,'DATA EDUBOX'!$A$14:$T$69,4)","v":"6B2@mail.id"}]
[null,"Password",":",null,null,null,null,null,"Password",":",null,null,null,null,null,"Password",":",null,null,null,null,null,"Password",":"]
[null,"Ruang",":",{"$f":"\"R.\"&VLOOKUP('KARTU EDUBOX'!$AB$3,'DATA EDUBOX'!$A$14:$T$69,3)","v":"R.01"},null,null,null,null,"Ruang",":",{"$f":"\"R.\"&VLOOKUP('KARTU EDUBOX'!$AB$4,'DATA EDUBOX'!$A$14:$T$69,3)","v":"R.01"},null,null,null,null,"Ruang",":",{"$f":"\"R.\"&VLOOKUP('KARTU EDUBOX'!$AB$5,'DATA EDUBOX'!$A$14:$T$69,3)","v":"R.01"},null,null,null,null,"Ruang",":",{"$f":"\"R.\"&VLOOKUP('KARTU EDUBOX'!$AB$6,'DATA EDUBOX'!$A$14:$T$69,3)","v":"R.01"}]
{"$rows_left_out":40}
{"sheet":"RUMUSKARTU","index":2,"n_rows":6,"n_cols":4,"rows_kept":6,"cut":false,"hidden":false,"merged":[]}
["PTS","2017/2018",1,"GANJIL"]
["US","2018/2019",2,"GENAP"]
["UM","2019/2020",3]
["UAMNU","2020/2021",4]
["USMT1","2021/2022",5]
["USMT2",null,6]

{"sheet":"(nomor peserta)nama","index":3,"n_rows":56,"n_cols":3,"rows_kept":56,"cut":false,"hidden":false,"merged":[]}
["80-0162-0001-8","ADITYA MAULA FANDY TAULANI",{"$f":"\"(\"&A1&\") \"&B1","v":"(80-0162-0001-8) ADITYA MAULA FANDY TAULANI"}]
["80-0162-0029-4","AHMAD FERDIAN ALAMSYAH",{"$f":"\"(\"&A2&\") \"&B2","v":"(80-0162-0029-4) AHMAD FERDIAN ALAMSYAH"}]
["80-0162-0002-7","AHMAD RAMADHANI FADLULLOH","(80-0162-0002-7) AHMAD RAMADHANI FADLULLOH"]
["80-0162-0030-3","ANANDA AMILIA","(80-0162-0030-3) ANANDA AMILIA"]
["80-0162-0003-6","ANDINI MAULID DWI LESTARI","(80-0162-0003-6) ANDINI MAULID DWI LESTARI"]
["80-0162-0031-2","ANDRIK YUSRI","(80-0162-0031-2) ANDRIK YUSRI"]
["80-0162-0004-5","DEWI SAKINAH ISWARA","(80-0162-0004-5) DEWI SAKINAH ISWARA"]
["80-0162-0032-9","CHAKIM","(80-0162-0032-9) CHAKIM"]
["80-0162-0005-4","HANIK APRILIA SARI","(80-0162-0005-4) HANIK APRILIA SARI"]
["80-0162-0033-8","DESI NATALIA SAPUTRI","(80-0162-0033-8) DESI NATALIA SAPUTRI"]
["80-0162-0006-3","HIDAYATUL KHUMAINIA","(80-0162-0006-3) HIDAYATUL KHUMAINIA"]
["80-0162-0034-7","DWITA FITA WULANDARI","(80-0162-0034-7) DWITA FITA WULANDARI"]
["80-0162-0007-2","IZZA ILMIA AZZAHRA","(80-0162-0007-2) IZZA ILMIA AZZAHRA"]
["80-0162-0035-6","FARIDATUS SAHDIAH","(80-0162-0035-6) FARIDATUS SAHDIAH"]
["80-0162-0008-9","KHARISYA AZZAHRO","(80-0162-0008-9) KHARISYA AZZAHRO"]
["80-0162-0036-5","KARINA FEBBY CAHYA AMILIA","(80-0162-0036-5) KARINA FEBBY CAHYA AMILIA"]
["80-0162-0009-8","MOCHAMAD RIFKY ROSAN","(80-0162-0009-8) MOCHAMAD RIFKY ROSAN"]
["80-0162-0037-4","KHUSNI CAHYONO","(80-0162-0037-4) KHUSNI CAHYONO"]
["80-0162-0010-7","MUCHAMMAD ALIEF FERDIANSYAH","(80-0162-0010-7) MUCHAMMAD ALIEF FERDIANSYAH"]
["80-0162-0038-3","LENNY AGUSTIN NINGTYAS","(80-0162-0038-3) LENNY AGUSTIN NINGTYAS"]
{"$rows_left_out":37}
{"sheet":"NAMA NOMOR R.1","index":4,"n_rows":56,"n_cols":2,"rows_kept":56,"cut":false,"hidden":false,"merged":[]}
["80-0162-0001-8","ADITYA MAULA FANDY TAULANI"]
["80-0162-0002-7","AHMAD FERDIAN ALAMSYAH"]
["80-0162-0003-6","AHMAD RAMADHANI FADLULLOH"]
["80-0162-0004-5","ANANDA AMILIA"]
["80-0162-0005-4","ANDINI MAULID DWI LESTARI"]
["80-0162-0006-3","ANDRIK YUSRI"]
["80-0162-0007-2","DEWI SAKINAH ISWARA"]
["80-0162-0008-9","CHAKIM"]
["80-0162-0009-8","HANIK APRILIA SARI"]
["80-0162-0010-7","DESI NATALIA SAPUTRI"]
["80-0162-0011-6","HIDAYATUL KHUMAINIA"]
["80-0162-0012-5","DWITA FITA WULANDARI"]
["80-0162-0013-4","IZZA ILMIA AZZAHRA"]
["80-0162-0014-3","FARIDATUS SAHDIAH"]
["80-0162-0015-2","KHARISYA AZZAHRO"]
["80-0162-0016-9","KARINA FEBBY CAHYA AMILIA"]
["80-0162-0017-8","MOCHAMAD RIFKY ROSAN"]
["80-0162-0018-7","KHUSNI CAHYONO"]
["80-0162-0019-6","MUCHAMMAD ALIEF FERDIANSYAH"]
["80-0162-0020-5","LENNY AGUSTIN NINGTYAS"]
{"$rows_left_out":37}
{"sheet":"Daftar nama R.2","index":5,"n_rows":26,"n_cols":3,"rows_kept":26,"cut":false,"hidden":false,"merged":[[0,0,0,2],[1,0,1,2],[2,0,2,2]]}
["DAFTAR PESERTA USBN-BK"]
["MIS NURUL ISLAM LABRUK KIDUL "]
["TAHUN PELAJARAN 2018/2019"]
[]
["RUANG 248"]
["NO","NAMA","NOMOR PESERTA"]
["1","MUHAMMAD AGUS ANDRIANTO","80-0162-0021-4"]
["2","MAURIS HIDAYATUR ROCHMAN","80-0162-0022-3"]
["3","MUHAMMAD BISMAR TAUFIQUROHMAN","80-0162-0023-2"]
["4","MAYA BUNGA ANJANI","80-0162-0024-9"]
["5","MUHAMMAD SAHLAN SHODIQ","80-0162-0025-8"]
["6","MITA SEPTIANI ISLAMIA","80-0162-0026-7"]
["7","MUHAMMAD SEPTYAN EKA PRATAMA","80-0162-0027-6"]
["8","MOCHAMAD ARIEL FRANS TITO","80-0162-0028-5"]
["9","MUHAMMAD VERYANSYAH","80-0162-0029-4"]
["10","MOCHAMMAD BIMA RISFANDA","80-0162-0030-3"]
["11","MUHAMMAD ZIDNY NA'IM","80-0162-0031-2"]
["12","MUHAMMAD AGUS FERDIANSYAH","80-0162-0032-9"]
["13","NABILA ARISKA PUTRI","80-0162-0033-8"]
["14","MUHAMMAD FARDAN ABDILLAH","80-0162-0034-7"]
{"$rows_left_out":7}
{"sheet":"Daftar nama R.3","index":6,"n_rows":26,"n_cols":3,"rows_kept":26,"cut":false,"hidden":false,"merged":[[0,0,0,2],[1,0,1,2],[2,0,2,2]]}
["DAFTAR PESERTA USBN-BK"]
["MIS NURUL ISLAM LABRUK KIDUL "]
["TAHUN PELAJARAN 2018/2019"]
[]
["RUANG 249"]
["NO","NAMA","NOMOR PESERTA"]
["1","PUTRI NAFI'ATUS SOLIKHAH","80-0162-0041-8"]
["2","MUHAMMAD RAYA KAFAF JAUHARI","80-0162-0042-7"]
["3","QORIATUN SHOLIHAH","80-0162-0043-6"]
["4","MUHAMMAD RUDI TANTOWIK","80-0162-0044-5"]
["5","RACHMAD HIDAYAT","80-0162-0045-4"]
["6","MUHAMMAD ZULDIENUR HABIBIE","80-0162-0046-3"]
["7","RHEA RAYSHANADA NUGRAHA","80-0162-0047-2"]
["8","MUKHAMAD KHOIRUL AMIN","80-0162-0048-9"]
["9","RIYANTI APRILIA","80-0162-0049-8"]
["10","MUKHAMMAD YAASIIN HASAN KHASBULLOH","80-0162-0050-7"]
["11","SHONIA AULIA AS'AD","80-0162-0051-6"]
["12","RIZKA AYU WULANDARI","80-0162-0052-5"]
["13","VERLINA DWI MAULANI","80-0162-0053-4"]
["14","USWATUN KHASANAH","80-0162-0054-3"]
{"$rows_left_out":7}
{"sheet":"Daftar nama R.1","index":7,"n_rows":26,"n_cols":3,"rows_kept":26,"cut":false,"hidden":false,"merged":[[0,0,0,2],[1,0,1,2],[2,0,2,2]]}
["DAFTAR PESERTA USBN-BK"]
["MIS NURUL ISLAM LABRUK KIDUL "]
["TAHUN PELAJARAN 2018/2019"]
[]
["RUANG 247"]
["NO","NAMA","NOMOR PESERTA"]
["1","ADITYA MAULA FANDY TAULANI","80-0162-0001-8"]
["2","AHMAD FERDIAN ALAMSYAH","80-0162-0002-7"]
["3","AHMAD RAMADHANI FADLULLOH","80-0162-0003-6"]
["4","ANANDA AMILIA","80-0162-0004-5"]
["5","ANDINI MAULID DWI LESTARI","80-0162-0005-4"]
["6","ANDRIK YUSRI","80-0162-0006-3"]
["7","DEWI SAKINAH ISWARA","80-0162-0007-2"]
["8","CHAKIM","80-0162-0008-9"]
["9","HANIK APRILIA SARI","80-0162-0009-8"]
["10","DESI NATALIA SAPUTRI","80-0162-0010-7"]
["11","HIDAYATUL KHUMAINIA","80-0162-0011-6"]
["12","DWITA FITA WULANDARI","80-0162-0012-5"]
["13","IZZA ILMIA AZZAHRA","80-0162-0013-4"]
["14","FARIDATUS SAHDIAH","80-0162-0014-3"]
{"$rows_left_out":7}
{"sheet":"DENAH R.1","index":8,"n_rows":23,"n_cols":11,"rows_kept":23,"cut":false,"hidden":false,"merged":[[6,5,6,7],[5,9,5,10],[0,1,0,10],[1,1,1,10],[2,1,2,10]]}
[null,"DENAH RUANG USBN-BK"]
[null,"UJIAN MADRASAH (UM) MI NURUL ISLAM LABRUK KIDUL"]
[null,{"$f":"[1]DATALENGKAP!D2&\" \"&[1]DATALENGKAP!F2","v":"TAHUN PELAJARAN 2018/2019"}]
[]
[]
[null,null,null,null,null,null,null,null,null,"RUANG 247"]
[null,null,null,null,null,"MEJA PENGAWAS"]
[]
[]
[null,null,{"$f":"'NAMA NOMOR R.1'!B1","v":"ADITYA MAULA FANDY TAULANI"},null,{"$f":"'NAMA NOMOR R.1'!B2","v":"AHMAD FERDIAN ALAMSYAH"},null,{"$f":"'NAMA NOMOR R.1'!B3","v":"AHMAD RAMADHANI FADLULLOH"},null,{"$f":"'NAMA NOMOR R.1'!B4","v":"ANANDA AMILIA"},null,{"$f":"'NAMA NOMOR R.1'!B5","v":"ANDINI MAULID DWI LESTARI"}]
[null,null,{"$f":"'NAMA NOMOR R.1'!A1","v":"80-0162-0001-8"},null,{"$f":"'NAMA NOMOR R.1'!A2","v":"80-0162-0002-7"},null,{"$f":"'NAMA NOMOR R.1'!A3","v":"80-0162-0003-6"},null,{"$f":"'NAMA NOMOR R.1'!A4","v":"80-0162-0004-5"},null,{"$f":"'NAMA NOMOR R.1'!A5","v":"80-0162-0005-4"}]
[]
[]
[null,null,{"$f":"'NAMA NOMOR R.1'!B10","v":"DESI NATALIA SAPUTRI"},null,{"$f":"'NAMA NOMOR R.1'!B9","v":"HANIK APRILIA SARI"},null,{"$f":"'NAMA NOMOR R.1'!B8","v":"CHAKIM"},null,{"$f":"'NAMA NOMOR R.1'!B7","v":"DEWI SAKINAH ISWARA"},null,{"$f":"'NAMA NOMOR R.1'!B6","v":"ANDRIK YUSRI"}]
[null,null,{"$f":"'NAMA NOMOR R.1'!A10","v":"80-0162-0010-7"},null,{"$f":"'NAMA NOMOR R.1'!A9","v":"80-0162-0009-8"},null,{"$f":"'NAMA NOMOR R.1'!A8","v":"80-0162-0008-9"},null,{"$f":"'NAMA NOMOR R.1'!A7","v":"80-0162-0007-2"},null,{"$f":"'NAMA NOMOR R.1'!A6","v":"80-0162-0006-3"}]
[]
[]
[null,null,{"$f":"'NAMA NOMOR R.1'!B11","v":"HIDAYATUL KHUMAINIA"},null,{"$f":"'NAMA NOMOR R.1'!B12","v":"DWITA FITA WULANDARI"},null,{"$f":"'NAMA NOMOR R.1'!B13","v":"IZZA ILMIA AZZAHRA"},null,{"$f":"'NAMA NOMOR R.1'!B14","v":"FARIDATUS SAHDIAH"},null,{"$f":"'NAMA NOMOR R.1'!B15","v":"KHARISYA AZZAHRO"}]
[null,null,{"$f":"'NAMA NOMOR R.1'!A11","v":"80-0162-0011-6"},null,{"$f":"'NAMA NOMOR R.1'!A12","v":"80-0162-0012-5"},null,{"$f":"'NAMA NOMOR R.1'!A13","v":"80-0162-0013-4"},null,{"$f":"'NAMA NOMOR R.1'!A14","v":"80-0162-0014-3"},null,{"$f":"'NAMA NOMOR R.1'!A15","v":"80-0162-0015-2"}]
[]
{"$rows_left_out":4}
{"sheet":"DENAH R.2","index":9,"n_rows":23,"n_cols":11,"rows_kept":23,"cut":false,"hidden":false,"merged":[[0,1,0,10],[1,1,1,10],[2,1,2,10],[5,9,5,10],[6,5,6,7]]}
[null,"DENAH RUANG USBN-BK"]
[null,"UJIAN MADRASAH (UM) MI NURUL ISLAM LABRUK KIDUL"]
[null,{"$f":"[1]DATALENGKAP!D2&\" \"&[1]DATALENGKAP!F2","v":"TAHUN PELAJARAN 2018/2019"}]
[]
[]
[null,null,null,null,null,null,null,null,null,"RUANG 248"]
[null,null,null,null,null,"MEJA PENGAWAS"]
[]
[]
[null,null,{"$f":"'NAMA NOMOR R.1'!B21","v":"MUHAMMAD AGUS ANDRIANTO"},null,{"$f":"'NAMA NOMOR R.1'!B22","v":"MAURIS HIDAYATUR ROCHMAN"},null,{"$f":"'NAMA NOMOR R.1'!B23","v":"MUHAMMAD BISMAR TAUFIQUROHMAN"},null,{"$f":"'NAMA NOMOR R.1'!B24","v":"MAYA BUNGA ANJANI"},null,{"$f":"'NAMA NOMOR R.1'!B25","v":"MUHAMMAD SAHLAN SHODIQ"}]
[null,null,{"$f":"'NAMA NOMOR R.1'!A21","v":"80-0162-0021-4"},null,{"$f":"'NAMA NOMOR R.1'!A22","v":"80-0162-0022-3"},null,{"$f":"'NAMA NOMOR R.1'!A23","v":"80-0162-0023-2"},null,{"$f":"'NAMA NOMOR R.1'!A24","v":"80-0162-0024-9"},null,{"$f":"'NAMA NOMOR R.1'!A25","v":"80-0162-0025-8"}]
[]
[]
[null,null,{"$f":"'NAMA NOMOR R.1'!B30","v":"MOCHAMMAD BIMA RISFANDA"},null,{"$f":"'NAMA NOMOR R.1'!B29","v":"MUHAMMAD VERYANSYAH"},null,{"$f":"'NAMA NOMOR R.1'!B28","v":"MOCHAMAD ARIEL FRANS TITO"},null,{"$f":"'NAMA NOMOR R.1'!B27","v":"MUHAMMAD SEPTYAN EKA PRATAMA"},null,{"$f":"'NAMA NOMOR R.1'!B26","v":"MITA SEPTIANI ISLAMIA"}]
[null,null,{"$f":"'NAMA NOMOR R.1'!A30","v":"80-0162-0030-3"},null,{"$f":"'NAMA NOMOR R.1'!A29","v":"80-0162-0029-4"},null,{"$f":"'NAMA NOMOR R.1'!A28","v":"80-0162-0028-5"},null,{"$f":"'NAMA NOMOR R.1'!A27","v":"80-0162-0027-6"},null,{"$f":"'NAMA NOMOR R.1'!A26","v":"80-0162-0026-7"}]
[]
[]
[null,null,{"$f":"'NAMA NOMOR R.1'!B31","v":"MUHAMMAD ZIDNY NA'IM"},null,{"$f":"'NAMA NOMOR R.1'!B32","v":"MUHAMMAD AGUS FERDIANSYAH"},null,{"$f":"'NAMA NOMOR R.1'!B33","v":"NABILA ARISKA PUTRI"},null,{"$f":"'NAMA NOMOR R.1'!B34","v":"MUHAMMAD FARDAN ABDILLAH"},null,{"$f":"'NAMA NOMOR R.1'!B35","v":"NAFISA INDRIANI"}]
[null,null,{"$f":"'NAMA NOMOR R.1'!A31","v":"80-0162-0031-2"},null,{"$f":"'NAMA NOMOR R.1'!A32","v":"80-0162-0032-9"},null,{"$f":"'NAMA NOMOR R.1'!A33","v":"80-0162-0033-8"},null,{"$f":"'NAMA NOMOR R.1'!A34","v":"80-0162-0034-7"},null,{"$f":"'NAMA NOMOR R.1'!A35","v":"80-0162-0035-6"}]
[]
{"$rows_left_out":4}
{"sheet":"DENAH R.3","index":10,"n_rows":23,"n_cols":11,"rows_kept":23,"cut":false,"hidden":false,"merged":[[0,1,0,10],[1,1,1,10],[2,1,2,10],[5,9,5,10],[6,5,6,7]]}
[null,"DENAH RUANG USBN-BK"]
[null,"UJIAN MADRASAH (UM) MI NURUL ISLAM LABRUK KIDUL"]
[null,{"$f":"[1]DATALENGKAP!D2&\" \"&[1]DATALENGKAP!F2","v":"TAHUN PELAJARAN 2018/2019"}]
[]
[]
[null,null,null,null,null,null,null,null,null,"RUANG 249"]
[null,null,null,null,null,"MEJA PENGAWAS"]
[]
[]
[null,null,{"$f":"'NAMA NOMOR R.1'!B41","v":"PUTRI NAFI'ATUS SOLIKHAH"},null,{"$f":"'NAMA NOMOR R.1'!B42","v":"MUHAMMAD RAYA KAFAF JAUHARI"},null,{"$f":"'NAMA NOMOR R.1'!B43","v":"QORIATUN SHOLIHAH"},null,{"$f":"'NAMA NOMOR R.1'!B44","v":"MUHAMMAD RUDI TANTOWIK"},null,{"$f":"'NAMA NOMOR R.1'!B45","v":"RACHMAD HIDAYAT"}]
[null,null,{"$f":"'NAMA NOMOR R.1'!A41","v":"80-0162-0041-8"},null,{"$f":"'NAMA NOMOR R.1'!A42","v":"80-0162-0042-7"},null,{"$f":"'NAMA NOMOR R.1'!A43","v":"80-0162-0043-6"},null,{"$f":"'NAMA NOMOR R.1'!A44","v":"80-0162-0044-5"},null,{"$f":"'NAMA NOMOR R.1'!A45","v":"80-0162-0045-4"}]
[]
[]
[null,null,{"$f":"'NAMA NOMOR R.1'!B50","v":"MUKHAMMAD YAASIIN HASAN KHASBULLOH"},null,{"$f":"'NAMA NOMOR R.1'!B49","v":"RIYANTI APRILIA"},null,{"$f":"'NAMA NOMOR R.1'!B48","v":"MUKHAMAD KHOIRUL AMIN"},null,{"$f":"'NAMA NOMOR R.1'!B47","v":"RHEA RAYSHANADA NUGRAHA"},null,{"$f":"'NAMA NOMOR R.1'!B46","v":"MUHAMMAD ZULDIENUR HABIBIE"}]
[null,null,{"$f":"'NAMA NOMOR R.1'!A50","v":"80-0162-0050-7"},null,{"$f":"'NAMA NOMOR R.1'!A49","v":"80-0162-0049-8"},null,{"$f":"'NAMA NOMOR R.1'!A48","v":"80-0162-0048-9"},null,{"$f":"'NAMA NOMOR R.1'!A47","v":"80-0162-0047-2"},null,{"$f":"'NAMA NOMOR R.1'!A46","v":"80-0162-0046-3"}]
[]
[]
[null,null,{"$f":"'NAMA NOMOR R.1'!B51","v":"SHONIA AULIA AS'AD"},null,{"$f":"'NAMA NOMOR R.1'!B52","v":"RIZKA AYU WULANDARI"},null,{"$f":"'NAMA NOMOR R.1'!B53","v":"VERLINA DWI MAULANI"},null,{"$f":"'NAMA NOMOR R.1'!B54","v":"USWATUN KHASANAH"},null,{"$f":"'NAMA NOMOR R.1'!B55","v":"VIKA KUSUMA WATI"}]
[null,null,{"$f":"'NAMA NOMOR R.1'!A51","v":"80-0162-0051-6"},null,{"$f":"'NAMA NOMOR R.1'!A52","v":"80-0162-0052-5"},null,{"$f":"'NAMA NOMOR R.1'!A53","v":"80-0162-0053-4"},null,{"$f":"'NAMA NOMOR R.1'!A54","v":"80-0162-0054-3"},null,{"$f":"'NAMA NOMOR R.1'!A55","v":"80-0162-0055-2"}]
[]
{"$rows_left_out":3}