{"text_format":"1","workbook":"xlsx","n_sheets":4,"sheets":["DATA EDUBOX","KARTU EDUBOX","RUMUSKARTU","(nomor peserta)nama"],"not_rendered":{"charts":0,"images":11,"macros":0,"external_links":0,"defined_names":4,"comments":0,"pivot_tables":0},"unopened":[],"bounds":{"document_bytes":16777216,"sheet_cells":100000,"rows_first":2000,"rows_last":500,"rows_between":2000,"halvings":0,"cell_chars":16384,"cell_head_chars":4096},"cells_cut":0,"cells_raw":0,"read":"whole","date_system":"1900"}

{"sheet":"DATA EDUBOX","index":0,"n_rows":73,"n_cols":18,"rows_kept":73,"cut":false,"hidden":false,"merged":[]}
["NAMA MADRASAH",null,null,"MIS NURUL ISLAM LABRUK KIDUL"]
["KECAMATAN",null,null,"SUMBERSUKO"]
["KABUPATEN",null,null,"LUMAJANG"]
["ALAMAT",null,null,"Jl. Raya Labruk Kidul 65"]
["DESA",null,null,"Labruk Kidul"]
["NAMA UJIAN",null,null,"USBN-BK","GENAP"]
["TAHUN PELAJARAN",null,null,"2018/2019"]
["KEPALA MADRASAH",null,null,"SAHRONI,S.Pd.I"]
["TEMPAT UJIAN",null,null,"Labruk Kidul"]
[]
[]
[1,2,3,4,5,6,7,8,9,10,11,12,13,14,15,16,17]
["NO URUT","NO ABSEN","RUANG","email","username","encrypted_password","role_id","created_at","updated_at","class_id","reset_password","display_name","image","trash","nisn","sync_status","stats_status","id_absen_solution"]
[1,1,"01","6A1@mail.id","80-0162-0001-8","$2a$08$75LT7SJuQ4rXUZ6fkhDj2uYb2/d96cRp/wp4jPYECHoTtEzLazaJO",2,"0000-00-00 00:00:00","0000-00-00 00:00:00",1,null,"ADITYA MAULA FANDY TAULANI"]
[2,2,"01","6B1@mail.id","80-0162-0002-7","$2a$08$75LT7SJuQ4rXUZ6fkhDj2uYb2/d96cRp/wp4jPYECHoTtEzLazaJO",2,"0000-00-00 00:00:00","0000-00-00 00:00:00",1,null,"AHMAD FERDIAN ALAMSYAH"]
[3,3,"01","6A2@mail.id","80-0162-0003-6","$2a$08$75LT7SJuQ4rXUZ6fkhDj2uYb2/d96cRp/wp4jPYECHoTtEzLazaJO",2,"0000-00-00 00:00:00","2018-12-06T02:52:00",1,null,"AHMAD RAMADHANI FADLULLOH","26980d544b88e435156c67cb48ab4bd9.jpg",null,null,2]
[4,4,"01","6B2@mail.id","80-0162-0004-5","$2a$08$75LT7SJuQ4rXUZ6fkhDj2uYb2/d96cRp/wp4jPYECHoTtEzLazaJO",2,"0000-00-00 00:00:00","2018-12-05T20:41:00",1,null,"ANANDA AMILIA","IMG-20181118-WA0013.jpg",null,null,2]
[5,5,"01","6A3@mail.id","80-0162-0005-4","$2a$08$75LT7SJuQ4rXUZ6fkhDj2uYb2/d96cRp/wp4jPYECHoTtEzLazaJO",2,"0000-00-00 00:00:00","2018-12-07T23:43:00",1,null,"ANDINI MAULID DWI LESTARI","Lisa-black-pink-40579158-500-552.jpg",null,null,2]
[6,6,"01","6B3@mail.id","80-0162-0006-3","$2a$08$75LT7SJuQ4rXUZ6fkhDj2uYb2/d96cRp/wp4jPYECHoTtEzLazaJO",2,"0000-00-00 00:00:00","2018-12-06T02:30:00",1,null,"ANDRIK YUSRI","blogers.jpg",null,null,2]
[7,7,"01","6A4@mail.id","80-0162-0007-2","$2a$08$75LT7SJuQ4rXUZ6fkhDj2uYb2/d96cRp/wp4jPYECHoTtEzLazaJO",2,"0000-00-00 00:00:00","2018-12-07T23:45:00",1,null,"DEWI SAKINAH ISWARA","Profil-Kartun-Muslimah-Bercadar.jpg",null,null,2]
[8,8,"01","6B4@mail.id","80-0162-0008-9","$2a$08$75LT7SJuQ4rXUZ6fkhDj2uYb2/d96cRp/wp4jPYECHoTtEzLazaJO",2,"0000-00-00 00:00:00","2018-12-07T23:32:00",1,null,"CHAKIM","alucard.jpg",null,null,2]
[9,9,"01","6A5@mail.id","80-0162-0009-8","$2a$08$75LT7SJuQ4rXUZ6fkhDj2uYb2/d96cRp/wp4jPYECHoTtEzLazaJO",2,"0000-00-00 00:00:00","0000-00-00 00:00:00",1,null,"HANIK APRILIA SARI"]
[10,10,"01","6B5@mail.id","80-0162-0010-7","$2a$08$75LT7SJuQ4rXUZ6fkhDj2uYb2/d96cRp/wp4jPYECHoTtEzLazaJO",2,"0000-00-00 00:00:00","0000-00-00 00:00:00",1,null,"DESI NATALIA SAPUTRI"]
[11,11,"01","6A6@mail.id","80-0162-0011-6","$2a$08$75LT7SJuQ4rXUZ6fkhDj2uYb2/d96cRp/wp4jPYECHoTtEzLazaJO",2,"0000-00-00 00:00:00","0000-00-00 00:00:00",1,null,"HIDAYATUL KHUMAINIA"]
[12,12,"01","6B6@mail.id","80-0162-0012-5","$2a$08$75LT7SJuQ4rXUZ6fkhDj2uYb2/d96cRp/wp4jPYECHoTtEzLazaJO",2,"0000-00-00 00:00:00","0000-00-00 00:00:00",1,null,"DWITA FITA WULANDARI"]
[13,13,"01","6A7@mail.id","80-0162-0013-4","$2a$08$75LT7SJuQ4rXUZ6fkhDj2uYb2/d96cRp/wp4jPYECHoTtEzLazaJO",2,"0000-00-00 00:00:00","0000-00-00 00:00:00",1,null,"IZZA ILMIA AZZAHRA"]
[14,14,"01","6B7@mail.id","80-0162-0014-3","$2a$08$75LT7SJuQ4rXUZ6fkhDj2uYb2/d96cRp/wp4jPYECHoTtEzLazaJO",2,"0000-00-00 00:00:00","2018-12-07T22:59:00",1,null,"FARIDATUS SAHDIAH","Snapshot_20181210_1.JPG",null,null,2]
[15,15,"01","6A8@mail.id","80-0162-0015-2","$2a$08$75LT7SJuQ4rXUZ6fkhDj2uYb2/d96cRp/wp4jPYECHoTtEzLazaJO",2,"0000-00-00 00:00:00","0000-00-00 00:00:00",1,null,"KHARISYA AZZAHRO"]
[16,16,"01","6B8@mail.id","80-0162-0016-9","$2a$08$75LT7SJuQ4rXUZ6fkhDj2uYb2/d96cRp/wp4jPYECHoTtEzLazaJO",2,"0000-00-00 00:00:00","0000-00-00 00:00:00",1,null,"KARINA FEBBY CAHYA AMILIA"]
[17,17,"01","6A9@mail.id","80-0162-0017-8","$2a$08$75LT7SJuQ4rXUZ6fkhDj2uYb2/d96cRp/wp4jPYECHoTtEzLazaJO",2,"0000-00-00 00:00:00","2018-12-06T02:51:00",1,null,"MOCHAMAD RIFKY ROSAN","Unicorn-wallpapper1.jpg",null,null,2]
[18,18,"01","6B9@mail.id","80-0162-0018-7","$2a$08$75LT7SJuQ4rXUZ6fkhDj2uYb2/d96cRp/wp4jPYECHoTtEzLazaJO",2,"0000-00-00 00:00:00","2018-12-07T23:00:00",1,null,"KHUSNI CAHYONO","index.jpg",null,null,2]
[19,19,"01","6A10@mail.id","80-0162-0019-6","$2a$08$75LT7SJuQ4rXUZ6fkhDj2uYb2/d96cRp/wp4jPYECHoTtEzLazaJO",2,"0000-00-00 00:00:00","2018-12-06T02:37:00",1,null,"MUCHAMMAD ALIEF FERDIANSYAH","blogger-image-1167405860.jpg",null,null,2]
[20,20,"01","6B10@mail.id","80-0162-0020-5","$2a$08$75LT7SJuQ4rXUZ6fkhDj2uYb2/d96cRp/wp4jPYECHoTtEzLazaJO",2,"0000-00-00 00:00:00","2018-12-07T22:43:00",1,null,"LENNY AGUSTIN NINGTYAS","index.jpg",null,null,2]
[21,1,"02","6A11@mail.id","80-0162-0021-4","$2a$08$75LT7SJuQ4rXUZ6fkhDj2uYb2/d96cRp/wp4jPYECHoTtEzLazaJO",2,"0000-00-00 00:00:00","2018-12-07T23:48:00",1,null,"MUHAMMAD AGUS ANDRIANTO","Cute Cat19.jpg",null,null,2]
[22,2,"02","6B11@mail.id","80-0162-0022-3","$2a$08$75LT7SJuQ4rXUZ6fkhDj2uYb2/d96cRp/wp4jPYECHoTtEzLazaJO",2,"0000-00-00 00:00:00","2018-12-04T15:10:00",1,null,"MAURIS HIDAYATUR ROCHMAN","kucing comel.jpg",null,null,2]
[23,3,"02","6A12@mail.id","80-0162-0023-2","$2a$08$75LT7SJuQ4rXUZ6fkhDj2uYb2/d96cRp/wp4jPYECHoTtEzLazaJO",2,"0000-00-00 00:00:00","0000-00-00 00:00:00",1,null,"MUHAMMAD BISMAR TAUFIQUROHMAN"]
[24,4,"02","6B12@mail.id","80-0162-0024-9","$2a$08$75LT7SJuQ4rXUZ6fkhDj2uYb2/d96cRp/wp4jPYECHoTtEzLazaJO",2,"0000-00-00 00:00:00","2018-12-06T02:53:00",1,null,"MAYA BUNGA ANJANI","-BLACKPINK-black-pink-40670892-1920-1080.jpg",null,null,2]
[25,5,"02","6A13@mail.id","80-0162-0025-8","$2a$08$75LT7SJuQ4rXUZ6fkhDj2uYb2/d96cRp/wp4jPYECHoTtEzLazaJO",2,"0000-00-00 00:00:00","0000-00-00 00:00:00",1,null,"MUHAMMAD SAHLAN SHODIQ"]
[26,6,"02","6B13@mail.id","80-0162-0026-7","$2a$08$75LT7SJuQ4rXUZ6fkhDj2uYb2/d96cRp/wp4jPYECHoTtEzLazaJO",2,"0000-00-00 00:00:00","2018-12-07T23:32:00",1,null,"MITA SEPTIANI ISLAMIA","images.jpg",null,null,2]
[27,7,"02","6A14@mail.id","80-0162-0027-6","$2a$08$75LT7SJuQ4rXUZ6fkhDj2uYb2/d96cRp/wp4jPYECHoTtEzLazaJO",2,"0000-00-00 00:00:00","0000-00-00 00:00:00",1,null,"MUHAMMAD SEPTYAN EKA PRATAMA"]
{"$rows_left_out":34}
{"sheet":"KARTU EDUBOX","index":1,"n_rows":59,"n_cols":25,"rows_kept":59,"cut":false,"hidden":false,"merged":[[44,19,44,21],[13,24,13,26],[12,24,12,26],[34,20,34,21],[35,20,35,21],[37,19,37,21],[39,19,39,21],[40,19,40,21],[43,19,43,21],[33,20,33,21],[8,19,8,21],[9,19,9,21],[12,19,12,21],[13,19,13,21],[32,20,32,21],[37,13,37,15],[39,13,39,15],[40,13,40,15],[43,13,43,15],[44,13,44,15],[1,20,1,21],[2,20,2,21],[3,20,3,21],[4,20,4,21],[6,19,6,21],[12,13,12,15],[13,13,13,15],[32,14,32,15],[33,14,33,15],[34,14,34,15],[35,14,35,15],[40,7,40,9],[43,7,43,9],[44,7,44,9],[1,14,1,15],[2,14,2,15],[3,14,3,15],[4,14,4,15],[6,13,6,15],[8,13,8,15],[9,13,9,15],[1,8,1,9],[2,8,2,9],[3,8,3,9],[4,8,4,9],[6,7,6,9],[8,7,8,9],[9,7,9,9],[12,7,12,9],[13,7,13,9],[34,8,34,9],[35,8,35,9],[37,7,37,9],[39,7,39,9],[32,8,32,9],[33,8,33,9],[37,1,37,3],[39,1,39,3],[40,1,40,3],[43,1,43,3],[44,1,44,3],[1,2,1,3],[4,2,4,3],[35,2,35,3],[8,1,8,3],[9,1,9,3],[12,1,12,3],[2,2,2,3],[3,2,3,3],[13,1,13,3],[6,1,6,3],[32,2,32,3],[33,2,33,3],[34,2,34,3]]}
[]
[null,null,"Kementerian Agama Kab. Lumajang",null,null,null,null,null,"Kementerian Agama Kab. Lumajang",null,null,null,null,null,"Kementerian Agama Kab. Lumajang",null,null,null,null,null,"Kementerian Agama Kab. Lumajang"]
[null,null,{"$f":"'DATA EDUBOX'!$D$1","v":"MIS NURUL ISLAM LABRUK KIDUL"},null,null,null,null,null,{"$f":"'DATA EDUBOX'!$D$1","v":"MIS NURUL ISLAM LABRUK KIDUL"},null,null,null,null,null,{"$f":"'DATA EDUBOX'!$D$1","v":"MIS NURUL ISLAM LABRUK KIDUL"},null,null,null,null,null,{"$f":"'DATA EDUBOX'!$D$1","v":"MIS NURUL ISLAM LABRUK KIDUL"},null,null,null,33]
[null,null,{"$f":"'DATA EDUBOX'!$D$2&\" - \"&'DATA EDUBOX'!$D$3","v":"SUMBERSUKO - LUMAJANG"},null,null,null,null,null,{"$f":"'DATA EDUBOX'!$D$2&\" - \"&'DATA EDUBOX'!$D$3","v":"SUMBERSUKO - LUMAJANG"},null,null,null,null,null,{"$f":"'DATA EDUBOX'!$D$2&\" - \"&'DATA EDUBOX'!$D$3","v":"SUMBERSUKO - LUMAJANG"},null,null,null,null,null,{"$f":"'DATA EDUBOX'!$D$2&\" - \"&'DATA EDUBOX'!$D$3","v":"SUMBERSUKO - LUMAJANG"},null,null,null,{"$f":"Y3+1","v":34}]
[null,null,{"$f":"'DATA EDUBOX'!$D$4&\" Desa \"&'DATA EDUBOX'!$D$5","v":"Jl. Raya Labruk Kidul 65 Desa Labruk Kidul"},null,null,null,null,null,{"$f":"'DATA EDUBOX'!$D$4&\" Desa \"&'DATA EDUBOX'!$D$5","v":"Jl. Raya Labruk Kidul 65 Desa Labruk Kidul"},null,null,null,null,null,{"$f":"'DATA EDUBOX'!$D$4&\" Desa \"&'DATA EDUBOX'!$D$5","v":"Jl. Raya Labruk Kidul 65 Desa Labruk Kidul"},null,null,null,null,null,{"$f":"'DATA EDUBOX'!$D$4&\" Desa \"&'DATA EDUBOX'!$D$5","v":"Jl. Raya Labruk Kidul 65 Desa Labruk Kidul"},null,null,null,{"$f":"Y4+1","v":35}]
[null,null,null,null,null,null,null,null,null,null,null,null,null,null,null,null,null,null,null,null,null,null,null,null,36]
[null,"KARTU PESERTA",null,null,null,null,null,"KARTU PESERTA",null,null,null,null,null,"KARTU PESERTA",null,null,null,null,null,"KARTU PESERTA",null,null,null,null,37]
[null,null,null,null,null,null,null,null,null,null,null,null,null,null,null,null,null,null,null,null,null,null,null,null,38]
[null,{"$f":"'DATA EDUBOX'!D6","v":"USBN-BK"},null,null,null,null,null,{"$f":"'DATA EDUBOX'!D6","v":"USBN-BK"},null,null,null,null,null,{"$f":"'DATA EDUBOX'!D6","v":"USBN-BK"},null,null,null,null,null,{"$f":"'DATA EDUBOX'!D6","v":"USBN-BK"},null,null,null,null,39]
[null,"TAHUN PELAJARAN 2018/2019",null,null,null,null,null,"TAHUN PELAJARAN 2018/2019",null,null,null,null,null,"TAHUN PELAJARAN 2018/2019",null,null,null,null,null,"TAHUN PELAJARAN 2018/2019",null,null,null,null,{"$f":"Y9+1","v":40}]
[]
[]
[null,"NAMA PESERTA",null,null,null,null,null,"NAMA PESERTA",null,null,null,null,null,"NAMA PESERTA",null,null,null,null,null,"NAMA PESERTA",null,null,null,null,"KEPALA MADRASAH"]
[null,{"$f":"VLOOKUP('KARTU EDUBOX'!$Y$3,'DATA EDUBOX'!$A$14:$T$69,12)","v":"NABILA ARISKA PUTRI"},null,null,null,null,null,{"$f":"VLOOKUP('KARTU EDUBOX'!$Y$4,'DATA EDUBOX'!$A$14:$T$69,12)","v":"MUHAMMAD FARDAN ABDILLAH"},null,null,null,null,null,{"$f":"VLOOKUP('KARTU EDUBOX'!$Y$5,'DATA EDUBOX'!$A$14:$T$69,12)","v":"NAFISA INDRIANI"},null,null,null,null,null,{"$f":"VLOOKUP('KARTU EDUBOX'!$Y$6,'DATA EDUBOX'!$A$14:$T$69,12)","v":"MUHAMMAD FERDINAN JAYYIDAH RIFQI"},null,null,null,null,"SAHRONI,S.Pd.I"]
[]
[null,"No. Peserta",":",{"$f":"VLOOKUP('KARTU EDUBOX'!$Y$3,'DATA EDUBOX'!$A$14:$T$69,5)","v":"80-0162-0033-8"},null,null,null,"No. Peserta",":",{"$f":"VLOOKUP('KARTU EDUBOX'!$Y$4,'DATA EDUBOX'!$A$14:$T$69,5)","v":"80-0162-0034-7"},null,null,null,"No. Peserta",":",{"$f":"VLOOKUP('KARTU EDUBOX'!$Y$5,'DATA EDUBOX'!$A$14:$T$69,5)","v":"80-0162-0035-6"},null,null,null,"No. Peserta",":",{"$f":"VLOOKUP('KARTU EDUBOX'!$Y$6,'DATA EDUBOX'!$A$14:$T$69,5)","v":"80-0162-0036-5"}]
[null,"Kelas",":",{"$f":"LEFT(VLOOKUP('KARTU EDUBOX'!$Y$3,'DATA EDUBOX'!$A$14:$T$69,4),2)","v":"6A"},null,null,null,"Kelas",":",{"$f":"LEFT(VLOOKUP('KARTU EDUBOX'!$Y$4,'DATA EDUBOX'!$A$14:$T$69,4),2)","v":"6B"},null,null,null,"Kelas",":",{"$f":"LEFT(VLOOKUP('KARTU EDUBOX'!$Y$5,'DATA EDUBOX'!$A$14:$T$69,4),2)","v":"6A"},null,null,null,"Kelas",":",{"$f":"LEFT(VLOOKUP('KARTU EDUBOX'!$Y$6,'DATA EDUBOX'!$A$14:$T$69,4),2)","v":"6B"}]
[null,"Username",":",{"$f":"VLOOKUP('KARTU EDUBOX'!$Y$3,'DATA EDUBOX'!$A$14:$T$69,4)","v":"6A17@mail.id"},null,null,null,"Username",":",{"$f":"VLOOKUP('KARTU EDUBOX'!$Y$4,'DATA EDUBOX'!$A$14:$T$69,4)","v":"6B17@mail.id"},null,null,null,"Username",":",{"$f":"VLOOKUP('KARTU EDUBOX'!$Y$5,'DATA EDUBOX'!$A$14:$T$69,4)","v":"6A18@mail.id"},null,null,null,"Username",":",{"$f":"VLOOKUP('KARTU EDUBOX'!$Y$6,'DATA EDUBOX'!$A$14:$T$69,4)","v":"6B18@mail.id"}]
[null,"Password",":",null,null,null,null,"Password",":",null,null,null,null,"Password",":",null,null,null,null,"Password",":"]
[null,"Ruang",":",{"$f":"\"R.\"&VLOOKUP('KARTU EDUBOX'!$Y$3,'DATA EDUBOX'!$A$14:$T$69,3)","v":"R.02"},null,null,null,"Ruang",":",{"$f":"\"R.\"&VLOOKUP('KARTU EDUBOX'!$Y$4,'DATA EDUBOX'!$A$14:$T$69,3)","v":"R.02"},null,null,null,"Ruang",":",{"$f":"\"R.\"&VLOOKUP('KARTU EDUBOX'!$Y$5,'DATA EDUBOX'!$A$14:$T$69,3)","v":"R.02"},null,null,null,"Ruang",":",{"$f":"\"R.\"&VLOOKUP('KARTU EDUBOX'!$Y$6,'DATA EDUBOX'!$A$14:$T$69,3)","v":"R.02"}]
[]
[]
[null,null,null,"Lumajang, 22 April 2019",null,null,null,null,null,{"$f":"D23","v":"Lumajang, 22 April 2019"},null,null,null,null,null,{"$f":"D23","v":"Lumajang, 22 April 2019"},null,null,null,null,null,{"$f":"D23","v":"Lumajang, 22 April 2019"}]
[null,null,null,"Kepala Madrasah",null,null,null,null,null,{"$f":"$D$24","v":"Kepala Madrasah"},null,null,null,null,null,{"$f":"$D$24","v":"Kepala Madrasah"},null,null,null,null,null,{"$f":"$D$24","v":"Kepala Madrasah"}]
[]
[]
[]
[null,null,null,{"$f":"$Y$14","v":"SAHRONI,S.Pd.I"},null,null,null,null,null,{"$f":"$Y$14","v":"SAHRONI,S.Pd.I"},null,null,null,null,null,{"$f":"$Y$14","v":"SAHRONI,S.Pd.I"},null,null,null,null,null,{"$f":"$Y$14","v":"SAHRONI,S.Pd.I"}]
[]
[]
[]
[]
[null,null,"Kementerian Agama Kab. Lumajang",null,null,null,null,null,"Kementerian Agama Kab. Lumajang",null,null,null,null,null,"Kementerian Agama Kab. Lumajang",null,null,null,null,null,"Kementerian Agama Kab. Lumajang"]
[null,null,{"$f":"'DATA EDUBOX'!$D$1","v":"MIS NURUL ISLAM LABRUK KIDUL"},null,null,null,null,null,{"$f":"'DATA EDUBOX'!$D$1","v":"MIS NURUL ISLAM LABRUK KIDUL"},null,null,null,null,null,{"$f":"'DATA EDUBOX'!$D$1","v":"MIS NURUL ISLAM LABRUK KIDUL"},null,null,null,null,null,{"$f":"'DATA EDUBOX'!$D$1","v":"MIS NURUL ISLAM LABRUK KIDUL"}]
[null,null,{"$f":"'DATA EDUBOX'!$D$2&\" - \"&'DATA EDUBOX'!$D$3","v":"SUMBERSUKO - LUMAJANG"},null,null,null,null,null,{"$f":"'DATA EDUBOX'!$D$2&\" - \"&'DATA EDUBOX'!$D$3","v":"SUMBERSUKO - LUMAJANG"},null,null,null,null,null,{"$f":"'DATA EDUBOX'!$D$2&\" - \"&'DATA EDUBOX'!$D$3","v":"SUMBERSUKO - LUMAJANG"},null,null,null,null,null,{"$f":"'DATA EDUBOX'!$D$2&\" - \"&'DATA EDUBOX'!$D$3","v":"SUMBERSUKO - LUMAJANG"}]
[null,null,{"$f":"'DATA EDUBOX'!$D$4&\" Desa \"&'DATA EDUBOX'!$D$5","v":"Jl. Raya Labruk Kidul 65 Desa Labruk Kidul"},null,null,null,null,null,{"$f":"'DATA EDUBOX'!$D$4&\" Desa \"&'DATA EDUBOX'!$D$5","v":"Jl. Raya Labruk Kidul 65 Desa Labruk Kidul"},null,null,null,null,null,{"$f":"'DATA EDUBOX'!$D$4&\" Desa \"&'DATA EDUBOX'!$D$5","v":"Jl. Raya Labruk Kidul 65 Desa Labruk Kidul"},null,null,null,null,null,{"$f":"'DATA EDUBOX'!$D$4&\" Desa \"&'DATA EDUBOX'!$D$5","v":"Jl. Raya Labruk Kidul 65 Desa Labruk Kidul"}]
[]
[null,"KARTU PESERTA",null,null,null,null,null,"KARTU PESERTA",null,null,null,null,null,"KARTU PESERTA",null,null,null,null,null,"KARTU PESERTA"]
[]
[null,{"$f":"'DATA EDUBOX'!D6","v":"USBN-BK"},null,null,null,null,null,{"$f":"'DATA EDUBOX'!D6","v":"USBN-BK"},null,null,null,null,null,{"$f":"'DATA EDUBOX'!D6","v":"USBN-BK"},null,null,null,null,null,{"$f":"'DATA EDUBOX'!D6","v":"USBN-BK"}]
{"$rows_left_out":20}
{"sheet":"RUMUSKARTU","index":2,"n_rows":6,"n_cols":4,"rows_kept":6,"cut":false,"hidden":false,"merged":[]}
["PTS","2017/2018",1,"GANJIL"]
["US","2018/2019",2,"GENAP"]
["UM","2019/2020",3]
["UAMNU","2020/2021",4]
["USMT1","2021/2022",5]
["USMT2",null,6]

{"sheet":"(nomor peserta)nama","index":3,"n_rows":56,"n_cols":3,"rows_kept":56,"cut":false,"hidden":false,"merged":[]}
["80-162-001-8","ADITYA MAULA FANDY TAULANI",{"$f":"\"(\"&A1&\") \"&B1","v":"(80-162-001-8) ADITYA MAULA FANDY TAULANI"}]
["80-162-002-7","AHMAD RAMADHANI FADLULLOH",{"$f":"\"(\"&A2&\") \"&B2","v":"(80-162-002-7) AHMAD RAMADHANI FADLULLOH"}]
["80-162-003-6","ANDINI MAULID DWI LESTARI","(80-162-003-6) ANDINI MAULID DWI LESTARI"]
["80-162-004-5","DEWI SAKINAH ISWARA","(80-162-004-5) DEWI SAKINAH ISWARA"]
["80-162-005-4","HANIK APRILIA SARI","(80-162-005-4) HANIK APRILIA SARI"]
["80-162-006-3","HIDAYATUL KHUMAINIA","(80-162-006-3) HIDAYATUL KHUMAINIA"]
["80-162-007-2","IZZA ILMIA AZZAHRA","(80-162-007-2) IZZA ILMIA AZZAHRA"]
["80-162-008-9","KHARISYA AZZAHRO","(80-162-008-9) KHARISYA AZZAHRO"]
["80-162-009-8","MOCHAMAD RIFKY ROSAN","(80-162-009-8) MOCHAMAD RIFKY ROSAN"]
["80-162-010-7","MUCHAMMAD ALIEF FERDIANSYAH","(80-162-010-7) MUCHAMMAD ALIEF FERDIANSYAH"]
["80-162-011-6","MUHAMMAD AGUS ANDRIANTO","(80-162-011-6) MUHAMMAD AGUS ANDRIANTO"]
["80-162-012-5","MUHAMMAD BISMAR TAUFIQUROHMAN","(80-162-012-5) MUHAMMAD BISMAR TAUFIQUROHMAN"]
["80-162-013-4","MUHAMMAD SAHLAN SHODIQ","(80-162-013-4) MUHAMMAD SAHLAN SHODIQ"]
["80-162-014-3","MUHAMMAD SEPTYAN EKA PRATAMA","(80-162-014-3) MUHAMMAD SEPTYAN EKA PRATAMA"]
["80-162-015-2","MUHAMMAD VERYANSYAH","(80-162-015-2) MUHAMMAD VERYANSYAH"]
["80-162-016-9","MUHAMMAD ZIDNY NA'IM","(80-162-016-9) MUHAMMAD ZIDNY NA'IM"]
["80-162-017-8","NABILA ARISKA PUTRI","(80-162-017-8) NABILA ARISKA PUTRI"]
["80-162-018-7","NAFISA INDRIANI","(80-162-018-7) NAFISA INDRIANI"]
["80-162-019-6","NAJWA FARISYA BAROROH","(80-162-019-6) NAJWA FARISYA BAROROH"]
["80-162-020-5","NUR FITRIYAH","(80-162-020-5) NUR FITRIYAH"]
["80-162-021-4","PUTRI NAFI'ATUS SOLIKHAH","(80-162-021-4) PUTRI NAFI'ATUS SOLIKHAH"]
["80-162-022-3","QORIATUN SHOLIHAH","(80-162-022-3) QORIATUN SHOLIHAH"]
["80-162-023-2","RACHMAD HIDAYAT","(80-162-023-2) RACHMAD HIDAYAT"]
["80-162-024-9","RHEA RAYSHANADA NUGRAHA","(80-162-024-9) RHEA RAYSHANADA NUGRAHA"]
["80-162-025-8","RIYANTI APRILIA","(80-162-025-8) RIYANTI APRILIA"]
["80-162-026-7","SHONIA AULIA AS'AD","(80-162-026-7) SHONIA AULIA AS'AD"]
["80-162-027-6","VERLINA DWI MAULANI","(80-162-027-6) VERLINA DWI MAULANI"]
["80-162-028-5","VIKA KUSUMA WATI","(80-162-028-5) VIKA KUSUMA WATI"]
["80-162-029-4","AHMAD FERDIAN ALAMSYAH","(80-162-029-4) AHMAD FERDIAN ALAMSYAH"]
["80-162-030-3","ANANDA AMILIA","(80-162-030-3) ANANDA AMILIA"]
["80-162-031-2","ANDRIK YUSRI","(80-162-031-2) ANDRIK YUSRI"]
["80-162-032-9","CHAKIM","(80-162-032-9) CHAKIM"]
["80-162-033-8","DESI NATALIA SAPUTRI","(80-162-033-8) DESI NATALIA SAPUTRI"]
["80-162-034-7","DWITA FITA WULANDARI","(80-162-034-7) DWITA FITA WULANDARI"]
["80-162-035-6","FARIDATUS SAHDIAH","(80-162-035-6) FARIDATUS SAHDIAH"]
["80-162-036-5","KARINA FEBBY CAHYA AMILIA","(80-162-036-5) KARINA FEBBY CAHYA AMILIA"]
["80-162-037-4","KHUSNI CAHYONO","(80-162-037-4) KHUSNI CAHYONO"]
["80-162-038-3","LENNY AGUSTIN NINGTYAS","(80-162-038-3) LENNY AGUSTIN NINGTYAS"]
["80-162-039-2","MAURIS HIDAYATUR ROCHMAN","(80-162-039-2) MAURIS HIDAYATUR ROCHMAN"]
["80-162-040-9","MAYA BUNGA ANJANI","(80-162-040-9) MAYA BUNGA ANJANI"]
{"$rows_left_out":16}