{"text_format":"1","workbook":"xlsx","n_sheets":6,"sheets":["INDUK30014000","INDUK30014000HAL1","INDUK30014000HAL2","INDUK40015000","INDUK40015000HAL1","INDUK40015000HAL2"],"not_rendered":{"charts":0,"images":0,"macros":1,"external_links":1,"defined_names":8,"comments":0,"pivot_tables":0},"unopened":[],"bounds":{"document_bytes":16777216,"sheet_cells":100000,"rows_first":2000,"rows_last":500,"rows_between":2000,"halvings":0,"cell_chars":16384,"cell_head_chars":4096},"cells_cut":0,"cells_raw":0,"read":"whole","date_system":"1900"}

{"sheet":"INDUK30014000","index":0,"n_rows":1005,"n_cols":480,"rows_kept":1005,"cut":false,"hidden":false,"merged":[[1,0,2,0],[1,1,2,1],[1,2,2,2],[1,3,2,3],[1,4,2,4],[1,5,2,5],[1,12,1,14],[1,15,2,15],[1,16,1,19],[1,20,2,20],[1,21,2,21],[1,22,2,22],[1,6,2,6],[1,7,2,7],[1,8,2,8],[1,9,2,9],[1,10,2,10],[1,11,2,11],[1,40,1,42],[1,43,2,43],[1,44,2,44],[1,45,1,48],[1,49,2,49],[1,50,1,53],[1,23,2,23],[1,25,1,26],[1,27,1,28],[1,29,1,30],[1,31,1,34],[1,36,1,39],[1,69,2,69],[1,70,1,73],[1,74,2,74],[1,75,1,78],[1,79,2,79],[1,80,1,81],[1,54,2,54],[1,55,1,58],[1,59,2,59],[1,60,1,63],[1,64,2,64],[1,65,1,68],[1,82,2,82],[1,83,1,86],[1,91,1,146],[1,148,1,203],[1,205,1,260],[1,262,1,317],[2,107,2,108],[2,109,2,110],[2,111,2,112],[2,113,2,114],[2,119,2,120],[2,121,2,122],[2,123,2,124],[2,125,2,126],[2,154,2,155],[2,156,2,157],[2,158,2,159],[2,160,2,161],[2,162,2,163],[2,164,2,165],[2,139,2,140],[2,141,2,142],[2,143,2,144],[2,148,2,149],[1,446,1,448],[1,450,1,479],[2,91,2,92],[2,93,2,94],[2,95,2,96],[2,97,2,98],[2,99,2,100],[2,101,2,102],[2,103,2,104],[2,105,2,106],[1,319,1,374],[1,376,1,431],[1,433,1,435],[1,436,1,438],[1,439,1,441],[1,442,1,444],[2,127,2,128],[2,129,2,130],[2,131,2,132],[2,133,2,134],[2,135,2,136],[2,137,2,138],[2,115,2,116],[2,117,2,118],[2,150,2,151],[2,152,2,153],[2,178,2,179],[2,180,2,181],[2,182,2,183],[2,184,2,185],[2,186,2,187],[2,188,2,189],[2,166,2,167],[2,168,2,169],[2,170,2,171],[2,172,2,173],[2,174,2,175],[2,176,2,177],[2,205,2,206],[2,207,2,208],[2,209,2,210],[2,211,2,212],[2,213,2,214],[2,215,2,216],[2,190,2,191],[2,192,2,193],[2,194,2,195],[2,196,2,197],[2,198,2,199],[2,200,2,201],[2,229,2,230],[2,231,2,232],[2,233,2,234],[2,235,2,236],[2,237,2,238],[2,239,2,240],[2,217,2,218],[2,219,2,220],[2,221,2,222],[2,223,2,224],[2,225,2,226],[2,227,2,228],[2,253,2,254],[2,255,2,256],[2,257,2,258],[2,262,2,263],[2,264,2,265],[2,266,2,267],[2,241,2,242],[2,243,2,244],[2,245,2,246],[2,247,2,248],[2,249,2,250],[2,251,2,252],[2,280,2,281],[2,282,2,283],[2,284,2,285],[2,286,2,287],[2,288,2,289],[2,290,2,291],[2,268,2,269],[2,270,2,271],[2,272,2,273],[2,274,2,275],[2,276,2,277],[2,278,2,279],[2,304,2,305],[2,306,2,307],[2,308,2,309],[2,310,2,311],[2,312,2,313],[2,314,2,315],[2,292,2,293],[2,294,2,295],[2,296,2,297],[2,298,2,299],[2,300,2,301],[2,302,2,303],[2,331,2,332],[2,333,2,334],[2,335,2,336],[2,337,2,338],[2,339,2,340],[2,341,2,342],[2,319,2,320],[2,321,2,322],[2,323,2,324],[2,325,2,326],[2,327,2,328],[2,329,2,330],[2,355,2,356],[2,357,2,358],[2,359,2,360],[2,361,2,362],[2,363,2,364],[2,365,2,366],[2,343,2,344],[2,345,2,346],[2,347,2,348],[2,349,2,350],[2,351,2,352],[2,353,2,354],[2,382,2,383],[2,384,2,385],[2,386,2,387],[2,388,2,389],[2,390,2,391],[2,392,2,393],[2,367,2,368],[2,369,2,370],[2,371,2,372],[2,376,2,377],[2,378,2,379],[2,380,2,381],[2,406,2,407],[2,408,2,409],[2,410,2,411],[2,412,2,413],[2,414,2,415],[2,416,2,417],[2,394,2,395],[2,396,2,397],[2,398,2,399],[2,400,2,401],[2,402,2,403],[2,404,2,405],[2,450,2,451],[2,452,2,453],[2,454,2,455],[2,456,2,457],[2,458,2,459],[2,460,2,461],[2,418,2,419],[2,420,2,421],[2,422,2,423],[2,424,2,425],[2,426,2,427],[2,428,2,429],[2,474,2,475],[2,476,2,477],[2,478,2,479],[2,462,2,463],[2,464,2,465],[2,466,2,467],[2,468,2,469],[2,470,2,471],[2,472,2,473]]}
[1,2,3,4,5,6,7,8,9,10,11,12,13,14,15,16,17,18,19,20,21,22,23,24,25,26,27,28,29,30,31,32,33,34,35,36,37,38,39,40,41,42,43,44,45,46,47,48,49,50,51,52,53,54,55,56,57,58,59,60,61,62,63,64,65,66,67,68,69,70,71,72,73,74,75,76,77,78,79,80,81,82,83,84,85,86,87,88,89,90,91,92,93,94,95,96,97,98,99,100,101,102,103,104,105,106,107,108,109,110,111,112,113,114,115,116,117,118,119,120,121,122,123,124,125,126,127,128,129,130,131,132,133,134,135,136,137,138,139,140,141,142,143,144,145,146,147,148,149,150,151,152,153,154,155,156,157,158,159,160,161,162,163,164,165,166,167,168,169,170,171,172,173,174,175,176,177,178,179,180,181,182,183,184,185,186,187,188,189,190,191,192,193,194,195,196,197,198,199,200,201,202,203,204,205,206,207,208,209,210,211,212,213,214,215,216,217,218,219,220,221,222,223,224,225,226,227,228,229,230,231,232,233,234,235,236,237,238,239,240,241,242,243,244,245,246,247,248,249,250,251,252,253,254,255,256,257,258,259,260,261,262,263,264,265,266,267,268,269,270,271,272,273,274,275,276,277,278,279,280,281,282,283,284,285,286,287,288,289,290,291,292,293,294,295,296,297,298,299,300,301,302,303,304,305,306,307,308,309,310,311,312,313,314,315,316,317,318,319,320,321,322,323,324,325,326,327,328,329,330,331,332,333,334,335,336,337,338,339,340,341,342,343,344,345,346,347,348,349,350,351,352,353,354,355,356,357,358,359,360,361,362,363,364,365,366,367,368,369,370,371,372,373,374,375,376,377,378,379,380,381,382,383,384,385,386,387,388,389,390,391,392,393,394,395,396,397,398,399,400,401,402,403,404,405,406,407,408,409,410,411,412,413,414,415,416,417,418,419,420,421,422,423,424,425,426,427,428,429,430,431,432,433,434,435,436,437,438,439,440,441,442,443,444,445,446,447,448,449,450,451,452,453,454,455,456,457,458,459,460,461,462,463,464,465,466,467,468,469,470,471,472,473,474,475,476,477,478,479,480]
["Induk","Nama Murid","Nama Orang Tua","Kls.","Tgl Masuk","Tgl Keluar","Nama Panggilan",{"$f":"\"L/P\"","v":"L/P"},"Tanggal Lahir","Tempat Lahir","Agama","Kewarganegaraan","Jumlah saudara",null,null,"Bahasa Sehari-hari keluarga","Keadaan Jasmani",null,null,null,"alamat dan no. telp","tempat tinggal pada (ortu/numpang/asramah)","Jarak Tempat Tinggal","tahun masuk sekolah ini",null,"Nama Orang tua",null,"pendidikan Tertinggi",null,"Pekerjaan",null,"Wali (jika ada)",null,null,null,null,"Masuk menjadi murid tingkat 1",null,null,null,"pindahan jika dari sekolah lain",null,null,"Prestasi Belajar","MASUKKAN TAHUN",null,null,null,null,2018,null,null,null,null,2019,null,null,null,null,2020,null,null,null,null,2021,null,null,null,null,2022,null,null,null,null,2023,null,null,null,null,"Beasiswa","Tahun Tamat",null,"Melanjutkan Ke","Mutasi Masuk Madrasah",null,null,null,"Mutasi Keluar Madrasah",null,null,null,"KELAS 1",null,null,null,null,null,null,null,null,null,null,null,null,null,null,null,null,null,null,null,null,null,null,null,null,null,null,null,null,null,null,null,null,null,null,null,null,null,null,null,null,null,null,null,null,null,null,null,null,null,null,null,null,null,null,null,null,"KELAS 2",null,null,null,null,null,null,null,null,null,null,null,null,null,null,null,null,null,null,null,null,null,null,null,null,null,null,null,null,null,null,null,null,null,null,null,null,null,null,null,null,null,null,null,null,null,null,null,null,null,null,null,null,null,null,null,null,"KELAS 3",null,null,null,null,null,null,null,null,null,null,null,null,null,null,null,null,null,null,null,null,null,null,null,null,null,null,null,null,null,null,null,null,null,null,null,null,null,null,null,null,null,null,null,null,null,null,null,null,null,null,null,null,null,null,null,null,"KELAS 4",null,null,null,null,null,null,null,null,null,null,null,null,null,null,null,null,null,null,null,null,null,null,null,null,null,null,null,null,null,null,null,null,null,null,null,null,null,null,null,null,null,null,null,null,null,null,null,null,null,null,null,null,null,null,null,null,"KELAS 5",null,null,null,null,null,null,null,null,null,null,null,null,null,null,null,null,null,null,null,null,null,null,null,null,null,null,null,null,null,null,null,null,null,null,null,null,null,null,null,null,null,null,null,null,null,null,null,null,null,null,null,null,null,null,null,null,"KELAS 6",null,null,null,null,null,null,null,null,null,null,null,null,null,null,null,null,null,null,null,null,null,null,null,null,null,null,null,null,null,null,null,null,null,null,null,null,null,null,null,null,null,null,null,null,null,null,null,null,null,null,null,null,null,null,null,null,"LULUSAN",null,null,"PENGHARGAAN 1",null,null,"PENGHARGAAN 2",null,null,"KETERANGAN",null,null,null,"KETERANGAN",null,null,null,"NILAI IJAZAH"]
[null,null,null,null,null,null,null,null,null,null,null,null,"Kandung","Tiri","Angkat",null,"Berat badan","tinggi badan","gol.darah","penyakit berat",null,null,null,null,null,"Ayah","Ibu","Ayah","Ibu","Ayah","Ibu","Nama","hub.keluarga","Pendidikan","Pekerjaan",null,"asal TK/RA","nama RA/TK","Alamat","Tanggal dan No.STTB","Nama Sekolah","dari Tingkat","diterima Tanggal",null,null,"Kg","Cm","Penyakit","Kelainan",null,"Kg","Cm","Penyakit","Kelainan",null,"Kg","Cm","Penyakit","Kelainan",null,"Kg","Cm","Penyakit","Kelainan",null,"Kg","Cm","Penyakit","Kelainan",null,"Kg","Cm","Penyakit","Kelainan",null,"Kg","Cm","Penyakit","Kelainan",null,"Tahun","No. STTB",null,"Dari Tingkat","Ke Sekolah","Ke Tingkat","Tanggal","Tanggal","Alasan",null,null,"QH 1",null,"AA 1",null,"FQ 1",null,"SKI 1",null,"AWJ 1",null,"BA1",null,"PKN 1",null,"BID 1",null,"MTK 1",null,"IPA 1",null,"IPS 1",null,"SBK 1",null,"PJO 1",null,"BD 1",null,"BIG 1",null,"JML NILAI",null,"RATA - RATA",null,"PE RINGKAT",null,"SAKIT",null,"IJIN",null,"ALPA",null,"EKSKUL PRAMUKA",null,"EKSKUL 1",null,"EKSKUL 2",null,"KE-LAKU-AN",null,"KE-RAJINAN",null,"KE-BERSIHAN",null,"NAIK/ TIDAK NAIK","TAHUN PLJARAN",null,"QH 2",null,"AA 2",null,"FQ 2",null,"SKI 2",null,"AWJ 2",null,"BA2",null,"PKN 2",null,"BID 2",null,"MTK 2",null,"IPA 2",null,"IPS 2",null,"SBK 2",null,"PJO 2",null,"BD 2",null,"BIG 2",null,"JML NILAI",null,"RATA - RATA",null,"PE RINGKAT",null,"SAKIT",null,"IJIN",null,"ALPA",null,"EKSKUL PRAMUKA",null,"EKSKUL 1",null,"EKSKUL 2",null,"KE-LAKU-AN",null,"KE-RAJINAN",null,"KE-BERSIHAN",null,"NAIK/ TIDAK NAIK","TAHUN PLJARAN",null,"QH 3",null,"AA 3",null,"FQ 3",null,"SKI 3",null,"AWJ 3",null,"BA3",null,"PKN 3",null,"BID 3",null,"MTK 3",null,"IPA 3",null,"IPS 3",null,"SBK 3",null,"PJO 3",null,"BD 3",null,"BIG 3",null,"JML NILAI",null,"RATA - RATA",null,"PE RINGKAT",null,"SAKIT",null,"IJIN",null,"ALPA",null,"EKSKUL PRAMUKA",null,"EKSKUL 1",null,"EKSKUL 2",null,"KE-LAKU-AN",null,"KE-RAJINAN",null,"KE-BERSIHAN",null,"NAIK/ TIDAK NAIK","TAHUN PLJARAN",null,"QH 4",null,"AA 4",null,"FQ 4",null,"SKI 4",null,"AWJ 4",null,"BA4",null,"PKN 4",null,"BID 4",null,"MTK 4",null,"IPA 4",null,"IPS 4",null,"SBK 4",null,"PJO 4",null,"BD 4",null,"BIG 4",null,"JML NILAI",null,"RATA - RATA",null,"PE RINGKAT",null,"SAKIT",null,"IJIN",null,"ALPA",null,"EKSKUL PRAMUKA",null,"EKSKUL 1",null,"EKSKUL 2",null,"KE-LAKU-AN",null,"KE-RAJINAN",null,"KE-BERSIHAN",null,"NAIK/ TIDAK NAIK","TAHUN PLJARAN",null,"QH 5",null,"AA 5",null,"FQ 5",null,"SKI 5",null,"AWJ 5",null,"BA5",null,"PKN 5",null,"BID 5",null,"MTK 5",null,"IPA 5",null,"IPS 5",null,"SBK 5",null,"PJO 5",null,"BD 5",null,"BIG 5",null,"JML NILAI",null,"RATA - RATA",null,"PE RINGKAT",null,"SAKIT",null,"IJIN",null,"ALPA",null,"EKSKUL PRAMUKA",null,"EKSKUL 1",null,"EKSKUL 2",null,"KE-LAKU-AN",null,"KE-RAJINAN",null,"KE-BERSIHAN",null,"NAIK/ TIDAK NAIK","TAHUN PLJARAN",null,"QH 6",null,"AA 6",null,"FQ 6",null,"SKI 6",null,"AWJ 6",null,"BA6",null,"PKN 6",null,"BID 6",null,"MTK 6",null,"IPA 6",null,"IPS 6",null,"SBK 6",null,"PJO 6",null,"BD 6",null,"BIG 6",null,"JML NILAI",null,"RATA - RATA",null,"PE RINGKAT",null,"SAKIT",null,"IJIN",null,"ALPA",null,"EKSKUL PRAMUKA",null,"EKSKUL 1",null,"EKSKUL 2",null,"KE-LAKU-AN",null,"KE-RAJINAN",null,"KE-BERSIHAN",null,"NAIK/ TIDAK NAIK","TAHUN PLJARAN",null,"NOMOR IJAZAH","Tempat IJAZAH","TANGGALIJAZAH","BIDANG","NOMOR","TANGGAL","NOMOR IJAZAH","NOMOR IJAZAH","NOMOR IJAZAH","TENTANG","NOMOR SRT KET","TANGGAL SRT KET","NOMOR IJAZAH","TENTANG","NOMOR SRT KET","TANGGAL SRT KET",null,"QH (NILAI AKHIR)",null,"AA (NILAI AKHIR)",null,"FQ (NILAI AKHIR)",null,"SKI (NILAI AKHIR)",null,"AWJ (NILAI AKHIR)",null,"BA(NILAI AKHIR)",null,"PKN (NILAI AKHIR)",null,"BID (NILAI AKHIR)",null,"MTK (NILAI AKHIR)",null,"IPA (NILAI AKHIR)",null,"IPS (NILAI AKHIR)",null,"SBK (NILAI AKHIR)",null,"PJO (NILAI AKHIR)",null,"BD (NILAI AKHIR)",null,"BIG (NILAI AKHIR)"]
[null,null,null,null,null,null,null,null,null,null,null,null,null,null,null,null,null,null,null,null,null,null,null,null,null,null,null,null,null,null,null,null,null,null,null,null,null,null,null,null,null,null,null,null,null,null,null,null,null,null,null,null,null,null,null,null,null,null,null,null,null,null,null,null,null,null,null,null,null,null,null,null,null,null,null,null,null,null,null,null,null,null,null,null,null,null,null,null,null,null,null,"SMT1","SMT2","SMT1","SMT2","SMT1","SMT2","SMT1","SMT2","SMT1","SMT2","SMT1","SMT2","SMT1","SMT2","SMT1","SMT2","SMT1","SMT2","SMT1","SMT2","SMT1","SMT2","SMT1","SMT2","SMT1","SMT2","SMT1","SMT2","SMT1","SMT2","SMT1","SMT2","SMT1","SMT2","SMT1","SMT2","SMT1","SMT2","SMT1","SMT2","SMT1","SMT2","SMT1","SMT2","SMT1","SMT2","SMT1","SMT2","SMT1","SMT2","SMT1","SMT2","SMT1","SMT2",null,null,null,"SMT1","SMT2","SMT1","SMT2","SMT1","SMT2","SMT1","SMT2","SMT1","SMT2","SMT1","SMT2","SMT1","SMT2","SMT1","SMT2","SMT1","SMT2","SMT1","SMT2","SMT1","SMT2","SMT1","SMT2","SMT1","SMT2","SMT1","SMT2","SMT1","SMT2","SMT1","SMT2","SMT1","SMT2","SMT1","SMT2","SMT1","SMT2","SMT1","SMT2","SMT1","SMT2","SMT1","SMT2","SMT1","SMT2","SMT1","SMT2","SMT1","SMT2","SMT1","SMT2","SMT1","SMT2",null,null,null,"SMT1","SMT2","SMT1","SMT2","SMT1","SMT2","SMT1","SMT2","SMT1","SMT2","SMT1","SMT2","SMT1","SMT2","SMT1","SMT2","SMT1","SMT2","SMT1","SMT2","SMT1","SMT2","SMT1","SMT2","SMT1","SMT2","SMT1","SMT2","SMT1","SMT2","SMT1","SMT2","SMT1","SMT2","SMT1","SMT2","SMT1","SMT2","SMT1","SMT2","SMT1","SMT2","SMT1","SMT2","SMT1","SMT2","SMT1","SMT2","SMT1","SMT2","SMT1","SMT2","SMT1","SMT2",null,null,null,"SMT1","SMT2","SMT1","SMT2","SMT1","SMT2","SMT1","SMT2","SMT1","SMT2","SMT1","SMT2","SMT1","SMT2","SMT1","SMT2","SMT1","SMT2","SMT1","SMT2","SMT1","SMT2","SMT1","SMT2","SMT1","SMT2","SMT1","SMT2","SMT1","SMT2","SMT1","SMT2","SMT1","SMT2","SMT1","SMT2","SMT1","SMT2","SMT1","SMT2","SMT1","SMT2","SMT1","SMT2","SMT1","SMT2","SMT1","SMT2","SMT1","SMT2","SMT1","SMT2","SMT1","SMT2",null,null,null,"SMT1","SMT2","SMT1","SMT2","SMT1","SMT2","SMT1","SMT2","SMT1","SMT2","SMT1","SMT2","SMT1","SMT2","SMT1","SMT2","SMT1","SMT2","SMT1","SMT2","SMT1","SMT2","SMT1","SMT2","SMT1","SMT2","SMT1","SMT2","SMT1","SMT2","SMT1","SMT2","SMT1","SMT2","SMT1","SMT2","SMT1","SMT2","SMT1","SMT2","SMT1","SMT2","SMT1","SMT2","SMT1","SMT2","SMT1","SMT2","SMT1","SMT2","SMT1","SMT2","SMT1","SMT2",null,null,null,"SMT1","SMT2","SMT1","SMT2","SMT1","SMT2","SMT1","SMT2","SMT1","SMT2","SMT1","SMT2","SMT1","SMT2","SMT1","SMT2","SMT1","SMT2","SMT1","SMT2","SMT1","SMT2","SMT1","SMT2","SMT1","SMT2","SMT1","SMT2","SMT1","SMT2","SMT1","SMT2","SMT1","SMT2","SMT1","SMT2","SMT1","SMT2","SMT1","SMT2","SMT1","SMT2","SMT1","SMT2","SMT1","SMT2","SMT1","SMT2","SMT1","SMT2","SMT1","SMT2","SMT1","SMT2",null,null,null,null,null,null,null,null,null,null,null,null,null,null,null,null,null,null,null,null,"IJAZAH","SKHU","IJAZAH","SKHU","IJAZAH","SKHU","IJAZAH","SKHU","IJAZAH","SKHU","IJAZAH","SKHU","IJAZAH","SKHU","IJAZAH","SKHU","IJAZAH","SKHU","IJAZAH","SKHU","IJAZAH","SKHU","IJAZAH","SKHU","IJAZAH","SKHU","IJAZAH","SKHU","IJAZAH","SKHU"]
[]
[3001,"Nama Murid","Nama Orang Tua","Kls.","Tgl Masuk","Tgl Keluar","Nama Panggilan","L","Tanggal Lahir","Tempat Lahir","Agama","WNI",21,22,23,"Bahasa Sehari-hari keluarga","Berat badan","tinggi badan","gol.darah","penyakit berat","alamat dan no. telp","tempat tinggal pada (ortu/numpang/asramah)","Jarak Tempat Tinggal","tahun masuk sekolah ini",null,"no1","no2","pt1","pt2","pk1","pk2","Nama","hub.keluarga","Pendidikan","Pekerjaan",null,"Langsung Orang Tua","nama RA/TK","Alamat","Tanggal dan No.STTB","Nama Sekolah","dari Tingkat","diterima Tanggal","Prestasi Belajar",2017,20171,20172,20173,20174,2018,20181,20182,20183,20184,2019,20191,20192,20193,20194,2020,20201,20202,20203,20204,2021,20211,20212,20213,20214,2022,20221,20222,20223,20224,2023,20231,20232,20233,20234,"KIP","Tahun","No. STTB","Melanjutkan Ke","Dari Tingkat","Ke Sekolah","Ke Tingkat","Tanggal","Tanggal","Alasan",null,null,"A1","A2","A3","A4","A5","A6","A7","A8","A9","A10","A11","A12","A13","A14","A15","A16","A17","A18","A19","A20","A21","A22","A23","A24","A25","A26","A27","A28","A29","A30","A31","A32","A33","A34","A35","A36","A37","A38","A39","A40","A41","A42","A43","A44","A45","A46","A47","A48","A49","A50","A51","A52","A53","A54","A55","A56",null,"A56","A57","A58","A59","A60","A61","A62","A63","A64","A65","A66","A67","A68","A69","A70","A71","A72","A73","A74","A75","A76","A77","A78","A79","A80","A81","A82","A83","A84","A85","A86","A87","A88","A89","A90","A91","A92","A93","A94","A95","A96","A97","A98","A99","A100","A101","A102","A103","A104","A105","A106","A107","A108","A109","A110","A111",null,"A112","A113","A114","A115","A116","A117","A118","A119","A120","A121","A122","A123","A124","A125","A126","A127","A128","A129","A130","A131","A132","A133","A134","A135","A136","A137","A138","A139","A140","A141","A142","A143","A144","A145","A146","A147","A148","A149","A150","A151","A152","A153","A154","A155","A156","A157","A158","A159","A160","A161","A162","A163","A164","A165","A166","A167",null,"A168","A169","A170","A171","A172","A173","A174","A175","A176","A177","A178","A179","A180","A181","A182","A183","A184","A185","A186","A187","A188","A189","A190","A191","A192","A193","A194","A195","A196","A197","A198","A199","A200","A201","A202","A203","A204","A205","A206","A207","A208","A209","A210","A211","A212","A213","A214","A215","A216","A217","A218","A219","A220","A221","A222","A223",null,"A224","A225","A226","A227","A228","A229","A230","A231","A232","A233","A234","A235","A236","A237","A238","A239","A240","A241","A242","A243","A244","A245","A246","A247","A248","A249","A250","A251","A252","A253","A254","A255","A256","A257","A258","A259","A260","A261","A262","A263","A264","A265","A266","A267","A268","A269","A270","A271","A272","A273","A274","A275","A276","A277","A278","A279",null,"A280","A281","A282","A283","A284","A285","A286","A287","A288","A289","A290","A291","A292","A293","A294","A295","A296","A297","A298","A299","A300","A301","A302","A303","A304","A305","A306","A307","A308","A309","A310","A311","A312","A313","A314","A315","A316","A317","A318","A319","A320","A321","A322","A323","A324","A325","A326","A327","A328","A329","A330","A331","A332","A333","LULUS","A335",null,"A336","A337","A338","A339","A340","A341","A342","A343","A344","A345","A346","A347","A348","A349","A350","A351",null,"A352","A353","A354","A355","A356","A357","A358","A359","A360","A361","A362","A363","A364","A365","A366","A367","A368","A369","A370","A371","A372","A373","A374","A375","A376","A377","A378","A379","A380","A381"]
[3002,"Nama Murid","Nama Orang Tua","Kls.","Tgl Masuk","Tgl Keluar","Nama Panggilan","L","Tanggal Lahir","Tempat Lahir","Agama","WNI",21,22,23,"Bahasa Sehari-hari keluarga","Berat badan","tinggi badan","gol.darah","penyakit berat","alamat dan no. telp","tempat tinggal pada (ortu/numpang/asramah)","Jarak Tempat Tinggal","tahun masuk sekolah ini",null,"no1","no2","pt1","pt2","pk1","pk2","Nama","hub.keluarga","Pendidikan","Pekerjaan",null,"Langsung Orang Tua","nama RA/TK","Alamat","Tanggal dan No.STTB","Nama Sekolah","dari Tingkat","diterima Tanggal","Prestasi Belajar",2017,20171,20172,20173,20174,2018,20181,20182,20183,20184,2019,20191,20192,20193,20194,2020,20201,20202,20203,20204,2021,20211,20212,20213,20214,2022,20221,20222,20223,20224,2023,20231,20232,20233,20234,"KIP","Tahun","No. STTB","Melanjutkan Ke","Dari Tingkat","Ke Sekolah","Ke Tingkat","Tanggal","Tanggal","Alasan",null,null,"B1","B2","B3","B4","B5","B6","B7","B8","B9","B10","B11","B12","B13","B14","B15","B16","B17","B18","B19","B20","B21","B22","B23","B24","B25","B26","B27","B28","B29","B30","B31","B32","B33","B34","B35","B36","B37","B38","B39","B40","B41","B42","B43","B44","B45","B46","B47","B48","B49","B50","B51","B52","B53","B54","B55","B56",null,"B56","B57","B58","B59","B60","B61","B62","B63","B64","B65","B66","B67","B68","B69","B70","B71","B72","B73","B74","B75","B76","B77","B78","B79","B80","B81","B82","B83","B84","B85","B86","B87","B88","B89","B90","B91","B92","B93","B94","B95","B96","B97","B98","B99","B100","B101","B102","B103","B104","B105","B106","B107","B108","B109","B110","B111",null,"B112","B113","B114","B115","B116","B117","B118","B119","B120","B121","B122","B123","B124","B125","B126","B127","B128","B129","B130","B131","B132","B133","B134","B135","B136","B137","B138","B139","B140","B141","B142","B143","B144","B145","B146","B147","B148","B149","B150","B151","B152","B153","B154","B155","B156","B157","B158","B159","B160","B161","B162","B163","B164","B165","B166","B167",null,"B168","B169","B170","B171","B172","B173","B174","B175","B176","B177","B178","B179","B180","B181","B182","B183","B184","B185","B186","B187","B188","B189","B190","B191","B192","B193","B194","B195","B196","B197","B198","B199","B200","B201","B202","B203","B204","B205","B206","B207","B208","B209","B210","B211","B212","B213","B214","B215","B216","B217","B218","B219","B220","B221","B222","B223",null,"B224","B225","B226","B227","B228","B229","B230","B231","B232","B233","B234","B235","B236","B237","B238","B239","B240","B241","B242","B243","B244","B245","B246","B247","B248","B249","B250","B251","B252","B253","B254","B255","B256","B257","B258","B259","B260","B261","B262","B263","B264","B265","B266","B267","B268","B269","B270","B271","B272","B273","B274","B275","B276","B277","B278","B279",null,"B280","B281","B282","B283","B284","B285","B286","B287","B288","B289","B290","B291","B292","B293","B294","B295","B296","B297","B298","B299","B300","B301","B302","B303","B304","B305","B306","B307","B308","B309","B310","B311","B312","B313","B314","B315","B316","B317","B318","B319","B320","B321","B322","B323","B324","B325","B326","B327","B328","B329","B330","B331","B332","B333","LOELOES","LOELOES",null,"B336","B337","B338","B339","B340","B341","B342","B343","B344","B345","B346","B347","B348","B349","B350","B351",null,"B352","B353","B354","B355","B356","B357","B358","B359","B360","B361","B362","B363","B364","B365","B366","B367","B368","B369","B370","B371","B372","B373","B374","B375","B376","B377","B378","B379","B380","B381"]
[3003]
[3004]
[3005]
[3006]
[3007]
[3008]
[3009]
[3010]
[3011]
[3012]
[3013]
[3014]
[3015]
[3016]
[3017]
[3018]
[3019]
[3020]
[3021]
[3022]
[3023]
[3024]
[3025]
[3026]
[3027]
[3028]
[3029]
[3030]
[3031]
[3032]
[3033]
[3034]
[3035]
[3036]
[3037]
[3038]
[3039]
[3040]
[3041]
[3042]
[3043]
[3044]
[3045]
[3046]
[3047]
[3048]
[3049]
[3050]
[3051]
[3052]
[3053]
[3054]
[3055]
[3056]
[3057]
[3058]
[3059]
[3060]
[3061]
[3062]
[3063]
[3064]
[3065]
[3066]
[3067]
[3068]
[3069]
[3070]
[3071]
[3072]
[3073]
[3074]
[3075]
[3076]
[3077]
[3078]
[3079]
[3080]
[3081]
[3082]
[3083]
[3084]
[3085]
[3086]
[3087]
[3088]
[3089]
[3090]
[3091]
[3092]
[3093]
[3094]
[3095]
[3096]
[3097]
[3098]
[3099]
[3100]
[3101]
[3102]
[3103]
[3104]
[3105]
[3106]
[3107]
[3108]
[3109]
[3110]
[3111]
[3112]
[3113]
[3114]
[3115]
[3116]
[3117]
[3118]
[3119]
[3120]
[3121]
[3122]
[3123]
[3124]
[3125]
[3126]
[3127]
[3128]
[3129]
[3130]
[3131]
[3132]
[3133]
[3134]
[3135]
[3136]
[3137]
[3138]
[3139]
[3140]
[3141]
[3142]
[3143]
[3144]
[3145]
[3146]
[3147]
[3148]
[3149]
[3150]
[3151]
[3152]
[3153]
[3154]
[3155]
[3156]
[3157]
[3158]
[3159]
[3160]
[3161]
[3162]
[3163]
[3164]
[3165]
[3166]
[3167]
[3168]
[3169]
[3170]
[3171]
[3172]
[3173]
[3174]
[3175]
[3176]
[3177]
[3178]
[3179]
[3180]
[3181]
[3182]
[3183]
[3184]
[3185]
[3186]
[3187]
[3188]
[3189]
[3190]
[3191]
[3192]
[3193]
[3194]
[3195]
[3196]
[3197]
[3198]
[3199]
[3200]
[3201]
[3202]
[3203]
[3204]
[3205]
[3206]
[3207]
[3208]
[3209]
[3210]
[3211]
[3212]
[3213]
[3214]
[3215]
[3216]
[3217]
[3218]
[3219]
[3220]
[3221]
[3222]
[3223]
[3224]
[3225]
[3226]
[3227]
[3228]
[3229]
[3230]
[3231]
[3232]
[3233]
[3234]
[3235]
[3236]
[3237]
[3238]
[3239]
[3240]
[3241]
[3242]
[3243]
[3244]
[3245]
[3246]
[3247]
[3248]
[3249]
[3250]
[3251]
[3252]
[3253]
[3254]
[3255]
[3256]
[3257]
[3258]
[3259]
[3260]
[3261]
[3262]
[3263]
[3264]
[3265]
[3266]
[3267]
[3268]
[3269]
[3270]
[3271]
[3272]
[3273]
[3274]
[3275]
[3276]
[3277]
[3278]
[3279]
[3280]
[3281]
[3282]
[3283]
[3284]
[3285]
[3286]
[3287]
[3288]
[3289]
[3290]
[3291]
[3292]
[3293]
[3294]
[3295]
[3296]
[3297]
[3298]
[3299]
[3300]
[3301]
[3302]
[3303]
[3304]
[3305]
[3306]
[3307]
[3308]
[3309]
[3310]
[3311]
[3312]
[3313]
[3314]
[3315]
[3316]
[3317]
[3318]
[3319]
[3320]
[3321]
[3322]
[3323]
[3324]
[3325]
[3326]
[3327]
[3328]
[3329]
[3330]
[3331]
[3332]
[3333]
[3334]
[3335]
[3336]
[3337]
[3338]
[3339]
[3340]
[3341]
[3342]
[3343]
[3344]
[3345]
[3346]
[3347]
[3348]
[3349]
[3350]
[3351]
[3352]
[3353]
[3354]
[3355]
[3356]
[3357]
[3358]
[3359]
[3360]
[3361]
[3362]
[3363]
[3364]
[3365]
[3366]
[3367]
[3368]
[3369]
[3370]
[3371]
[3372]
[3373]
[3374]
[3375]
[3376]
[3377]
[3378]
[3379]
[3380]
[3381]
[3382]
[3383]
[3384]
[3385]
[3386]
[3387]
[3388]
[3389]
[3390]
[3391]
[3392]
[3393]
[3394]
[3395]
[3396]
[3397]
[3398]
[3399]
[3400]
[3401]
[3402]
[3403]
[3404]
[3405]
[3406]
[3407]
[3408]
[3409]
[3410]
[3411]
[3412]
[3413]
[3414]
[3415]
[3416]
[3417]
[3418]
[3419]
[3420]
[3421]
[3422]
[3423]
[3424]
[3425]
[3426]
[3427]
[3428]
[3429]
[3430]
[3431]
[3432]
[3433]
[3434]
[3435]
[3436]
[3437]
[3438]
[3439]
[3440]
[3441]
[3442]
[3443]
[3444]
[3445]
[3446]
[3447]
[3448]
[3449]
[3450]
[3451]
[3452]
[3453]
[3454]
[3455]
[3456]
[3457]
[3458]
[3459]
[3460]
[3461]
[3462]
[3463]
[3464]
[3465]
[3466]
[3467]
[3468]
[3469]
[3470]
[3471]
[3472]
[3473]
[3474]
[3475]
[3476]
[3477]
[3478]
[3479]
[3480]
[3481]
[3482]
[3483]
[3484]
[3485]
[3486]
[3487]
[3488]
[3489]
[3490]
[3491]
[3492]
[3493]
[3494]
[3495]
[3496]
[3497]
[3498]
[3499]
[3500]
[3501]
[3502]
[3503]
[3504]
[3505]
[3506]
[3507]
[3508]
[3509]
[3510]
[3511]
[3512]
[3513]
[3514]
[3515]
[3516]
[3517]
[3518]
[3519]
[3520]
[3521]
[3522]
[3523]
[3524]
[3525]
[3526]
[3527]
[3528]
[3529]
[3530]
[3531]
[3532]
[3533]
[3534]
[3535]
[3536]
[3537]
[3538]
[3539]
[3540]
[3541]
[3542]
[3543]
[3544]
[3545]
[3546]
[3547]
[3548]
[3549]
[3550]
[3551]
[3552]
[3553]
[3554]
[3555]
[3556]
[3557]
[3558]
[3559]
[3560]
[3561]
[3562]
[3563]
[3564]
[3565]
[3566]
[3567]
[3568]
[3569]
[3570]
[3571]
[3572]
[3573]
[3574]
[3575]
[3576]
[3577]
[3578]
[3579]
[3580]
[3581]
[3582]
[3583]
[3584]
[3585]
[3586]
[3587]
[3588]
[3589]
[3590]
[3591]
[3592]
[3593]
[3594]
[3595]
[3596]
[3597]
[3598]
[3599]
[3600]
[3601]
[3602]
[3603]
[3604]
[3605]
[3606]
[3607]
[3608]
[3609]
[3610]
[3611]
[3612]
[3613]
[3614]
[3615]
[3616]
[3617]
[3618]
[3619]
[3620]
[3621]
[3622]
[3623]
[3624]
[3625]
[3626]
[3627]
[3628]
[3629]
[3630]
[3631]
[3632]
[3633]
[3634]
[3635]
[3636]
[3637]
[3638]
[3639]
[3640]
[3641]
[3642]
[3643]
[3644]
[3645]
[3646]
[3647]
[3648]
[3649]
[3650]
[3651]
[3652]
[3653]
[3654]
[3655]
[3656]
[3657]
[3658]
[3659]
[3660]
[3661]
[3662]
[3663]
[3664]
[3665]
[3666]
[3667]
[3668]
[3669]
[3670]
[3671]
[3672]
[3673]
[3674]
[3675]
[3676]
[3677]
[3678]
[3679]
[3680]
[3681]
[3682]
[3683]
[3684]
[3685]
[3686]
[3687]
[3688]
[3689]
[3690]
[3691]
[3692]
[3693]
[3694]
[3695]
[3696]
[3697]
[3698]
[3699]
[3700]
[3701]
[3702]
[3703]
[3704]
[3705]
[3706]
[3707]
[3708]
[3709]
[3710]
[3711]
[3712]
[3713]
[3714]
[3715]
[3716]
[3717]
[3718]
[3719]
[3720]
[3721]
[3722]
[3723]
[3724]
[3725]
[3726]
[3727]
[3728]
[3729]
[3730]
[3731]
[3732]
[3733]
[3734]
[3735]
[3736]
[3737]
[3738]
[3739]
[3740]
[3741]
[3742]
[3743]
[3744]
[3745]
[3746]
[3747]
[3748]
[3749]
[3750]
[3751]
[3752]
[3753]
[3754]
[3755]
[3756]
[3757]
[3758]
[3759]
[3760]
[3761]
[3762]
[3763]
[3764]
[3765]
[3766]
[3767]
[3768]
[3769]
[3770]
[3771]
[3772]
[3773]
[3774]
[3775]
[3776]
[3777]
[3778]
[3779]
[3780]
[3781]
[3782]
[3783]
[3784]
[3785]
[3786]
[3787]
[3788]
[3789]
[3790]
[3791]
[3792]
[3793]
[3794]
[3795]
[3796]
[3797]
[3798]
[3799]
[3800]
[3801]
[3802]
[3803]
[3804]
[3805]
[3806]
[3807]
[3808]
[3809]
[3810]
[3811]
[3812]
[3813]
[3814]
[3815]
[3816]
[3817]
[3818]
[3819]
[3820]
[3821]
[3822]
[3823]
[3824]
[3825]
[3826]
[3827]
[3828]
[3829]
[3830]
[3831]
[3832]
[3833]
[3834]
[3835]
[3836]
[3837]
[3838]
[3839]
[3840]
[3841]
[3842]
[3843]
[3844]
[3845]
[3846]
[3847]
[3848]
[3849]
[3850]
[3851]
[3852]
[3853]
[3854]
[3855]
[3856]
[3857]
[3858]
[3859]
[3860]
[3861]
[3862]
[3863]
[3864]
[3865]
[3866]
[3867]
[3868]
[3869]
[3870]
[3871]
[3872]
[3873]
[3874]
[3875]
[3876]
[3877]
[3878]
[3879]
[3880]
[3881]
[3882]
[3883]
[3884]
[3885]
[3886]
[3887]
[3888]
[3889]
[3890]
[3891]
[3892]
[3893]
[3894]
[3895]
[3896]
[3897]
[3898]
[3899]
[3900]
[3901]
[3902]
[3903]
[3904]
[3905]
[3906]
[3907]
[3908]
[3909]
[3910]
[3911]
[3912]
[3913]
[3914]
[3915]
[3916]
[3917]
[3918]
[3919]
[3920]
[3921]
[3922]
[3923]
[3924]
[3925]
[3926]
[3927]
[3928]
[3929]
[3930]
[3931]
[3932]
[3933]
[3934]
[3935]
[3936]
[3937]
[3938]
[3939]
[3940]
[3941]
[3942]
[3943]
[3944]
[3945]
[3946]
[3947]
[3948]
[3949]
[3950]
[3951]
[3952]
[3953]
[3954]
[3955]
[3956]
[3957]
[3958]
[3959]
[3960]
[3961]
[3962]
[3963]
[3964]
[3965]
[3966]
[3967]
[3968]
[3969]
[3970]
[3971]
[3972]
[3973]
[3974]
[3975]
[3976]
[3977]
[3978]
[3979]
[3980]
[3981]
[3982]
[3983]
[3984]
[3985]
[3986]
[3987]
[3988]
[3989]
[3990]
[3991]
[3992]
[3993]
[3994]
[3995]
[3996]
[3997]
[3998]
[3999]
[4000]

{"sheet":"INDUK30014000HAL1","index":1,"n_rows":74,"n_cols":15,"rows_kept":74,"cut":false,"hidden":false,"merged":[[6,1,10,1],[29,1,33,1],[55,4,55,7],[56,1,60,1],[56,4,56,7],[57,4,57,7],[58,4,58,7],[59,4,59,7]]}
[null,null,null,null,"Nomor Induk Murid : ",null,null,null,null,null,3001]
[null,null,null,"A.","KETERANGAN MURID"]
[null,null,null,null,"1.","Nama Murid :"]
[null,null,null,null,null,null,null,null,"a. Lengkap",null,null,{"$f":"\": \"&VLOOKUP($K$1,INDUK30014000!$A$6:$CK$1005,2)","v":": Nama Murid"}]
[null,null,null,null,null,null,null,null,"b. Panggilan",null,null,{"$f":"\": \"&VLOOKUP($K$1,INDUK30014000!$A$6:$CK$1005,7)","v":": Nama Panggilan"}]
[null,null,null,null,"2.","Jenis Kelamin",null,null,null,null,null,{"$f":"\": \"&IF(VLOOKUP($K$1,INDUK30014000!$A$6:$CK$1005,8)=\"L\",\"Laki-Laki\",\"Perempuan\")","v":": Laki-Laki"}]
[null,"PAS FOTO 3X4cm",null,null,"3.","Kelahiran :"]
[null,null,null,null,null,null,null,null,"a. Tanggal",null,null,{"$f":"\": \"&VLOOKUP($K$1,INDUK30014000!$A$6:$CK$1005,9)","v":": Tanggal Lahir"}]
[null,null,null,null,null,null,null,null,"b. Tempat",null,null,{"$f":"\": \"&VLOOKUP($K$1,INDUK30014000!$A$6:$CK$1005,10)","v":": Tempat Lahir"}]
[null,null,null,null,"4.","Agama",null,null,null,null,null,{"$f":"\": \"&VLOOKUP($K$1,INDUK30014000!$A$6:$CK$1005,11)","v":": Agama"}]
[null,null,null,null,"5.","Kewarganegaraan",null,null,null,null,null,{"$f":"\": \"&VLOOKUP($K$1,INDUK30014000!$A$6:$CK$1005,12)","v":": WNI"}]
[null,null,null,null,"6.","Jumlah Saudara"]
[null,null,null,null,null,null,null,"a.","Kandung",null,null,{"$f":"\": \"&VLOOKUP($K$1,INDUK30014000!$A$6:$CK$1005,13)","v":": 21"}]
[null,null,null,null,null,null,null,"b.","Tiri",null,null,{"$f":"\": \"&VLOOKUP($K$1,INDUK30014000!$A$6:$CK$1005,14)","v":": 22"}]
[null,null,null,null,null,null,null,"c.","Angkat",null,null,{"$f":"\": \"&VLOOKUP($K$1,INDUK30014000!$A$6:$CK$1005,15)","v":": 23"}]
[null,null,null,null,"7.","Bahasa Sehari-hari Keluarga",null,null,null,null,null,{"$f":"\": \"&VLOOKUP($K$1,INDUK30014000!$A$6:$CK$1005,16)","v":": Bahasa Sehari-hari keluarga"}]
[null,null,null,null,"8.","Keadaan Jasmani"]
[null,null,null,null,null,null,null,"a.","Berat Badan",null,null,{"$f":"\": \"&VLOOKUP($K$1,INDUK30014000!$A$6:$CK$1005,17)","v":": Berat badan"}]
[null,null,null,null,null,null,null,"b.","Tinggi Badan",null,null,{"$f":"\": \"&VLOOKUP($K$1,INDUK30014000!$A$6:$CK$1005,18)","v":": tinggi badan"}]
[null,null,null,null,null,null,null,"c.","Gol. Darah",null,null,{"$f":"\": \"&VLOOKUP($K$1,INDUK30014000!$A$6:$CK$1005,19)","v":": gol.darah"}]
[null,null,null,null,null,null,null,"d.","Penyakit Berat",null,null,{"$f":"\": \"&VLOOKUP($K$1,INDUK30014000!$A$6:$CK$1005,20)","v":": penyakit berat"}]
[null,null,null,null,"9.","Alamat dan No. Telepon",null,null,null,null,null,{"$f":"\": \"&VLOOKUP($K$1,INDUK30014000!$A$6:$CK$1005,21)","v":": alamat dan no. telp"}]
[null,null,null,null,"10.","Bertempat Tinggal Pada",null,null,null,null,null,{"$f":"\": \"&VLOOKUP($K$1,INDUK30014000!$A$6:$CK$1005,22)","v":": tempat tinggal pada (ortu/numpang/asramah)"}]
[null,null,null,null,"11.","Jarak Tempat Tinggal ke Sekolah",null,null,null,null,null,{"$f":"\": \"&VLOOKUP($K$1,INDUK30014000!$A$6:$CK$1005,23)","v":": Jarak Tempat Tinggal"}]
[null,null,null,null,12,"Tahun Masuk Sekolah ini",null,null,null,null,null,{"$f":"\": \"&VLOOKUP($K$1,INDUK30014000!$A$6:$CK$1005,24)","v":": tahun masuk sekolah ini"}]
[null,null,null,"B.","KETERANGAN ORANG TUA / WALI MURID"]
[null,null,null,null,"1.","Nama Orang Tua kandung"]
[null,null,null,null,null,"a.",null,"Nama"]
[null,null,null,null,null,null,null,"a)","Ayah",null,null,{"$f":"\": \"&VLOOKUP($K$1,INDUK30014000!$A$6:$CK$1005,26)","v":": no1"}]
[null,"PAS FOTO 3X4cm",null,null,null,null,null,"b) ","Ibu",null,null,{"$f":"\": \"&VLOOKUP($K$1,INDUK30014000!$A$6:$CK$1005,27)","v":": no2"}]
[null,null,null,null,null,"b.",null,"Pendidikan Tertinggi"]
[null,null,null,null,null,null,null,"a)","Ayah",null,null,{"$f":"\": \"&VLOOKUP($K$1,INDUK30014000!$A$6:$CK$1005,28)","v":": pt1"}]
[null,null,null,null,null,null,null,"b) ","Ibu",null,null,{"$f":"\": \"&VLOOKUP($K$1,INDUK30014000!$A$6:$CK$1005,29)","v":": pt2"}]
[null,null,null,null,null,"c.",null,"Pekerjaan"]
[null,null,null,null,null,null,null,"a)","Ayah",null,null,{"$f":"\": \"&VLOOKUP($K$1,INDUK30014000!$A$6:$CK$1005,30)","v":": pk1"}]
[null,null,null,null,null,null,null,"b) ","Ibu",null,null,{"$f":"\": \"&VLOOKUP($K$1,INDUK30014000!$A$6:$CK$1005,31)","v":": pk2"}]
[null,null,null,null,null,"d.",null,"Wali Murid (jika mempunyai)"]
[null,null,null,null,null,null,null,"a)","Nama",null,null,{"$f":"\": \"&VLOOKUP($K$1,INDUK30014000!$A$6:$CK$1005,32)","v":": Nama"}]
[null,null,null,null,null,null,null,"b)","Hubungan Keluarga",null,null,{"$f":"\": \"&VLOOKUP($K$1,INDUK30014000!$A$6:$CK$1005,33)","v":": hub.keluarga"}]
[null,null,null,null,null,null,null,"c)","Pendidikan",null,null,{"$f":"\": \"&VLOOKUP($K$1,INDUK30014000!$A$6:$CK$1005,34)","v":": Pendidikan"}]
[null,null,null,null,null,null,null,"d)","Pekerjaan",null,null,{"$f":"\": \"&VLOOKUP($K$1,INDUK30014000!$A$6:$CK$1005,35)","v":": Pekerjaan"}]
[]
[null,null,null,"C.","PERKEMBANGAN MURID"]
[null,null,null,null,"1.","Pendidikan Sebelumnya :"]
[null,null,null,null,null,"a.",null,"Masuk menjadi murid baru tingkat I"]
[null,null,null,null,null,null,null,"a)","Asal Murid",null,null,{"$f":"\": \"&VLOOKUP($K$1,INDUK30014000!$A$6:$CK$1005,37)","v":": Langsung Orang Tua"}]
[null,null,null,null,null,null,null,"b)","Nama TK",null,null,{"$f":"\": \"&VLOOKUP($K$1,INDUK30014000!$A$6:$CK$1005,38)","v":": nama RA/TK"}]
[null,null,null,null,null,null,null,"c)","Alamat",null,null,{"$f":"\": \"&VLOOKUP($K$1,INDUK30014000!$A$6:$CK$1005,39)","v":": Alamat"}]
[null,null,null,null,null,null,null,"d)","Tanggal dan No. STTB",null,null,{"$f":"\": \"&VLOOKUP($K$1,INDUK30014000!$A$6:$CK$1005,40)","v":": Tanggal dan No.STTB"}]
[null,null,null,null,null,"b.",null,"Pindahan dari sekolah lain"]
[null,null,null,null,null,null,null,"a)","Nama Sekolah Asal",null,null,{"$f":"\": \"&VLOOKUP($K$1,INDUK30014000!$A$6:$CK$1005,41)","v":": Nama Sekolah"}]
[null,null,null,null,null,null,null,"b)","Dari Tingkat",null,null,{"$f":"\": \"&VLOOKUP($K$1,INDUK30014000!$A$6:$CK$1005,42)","v":": dari Tingkat"}]
[null,null,null,null,null,null,null,"c)","Diterima Tanggal",null,null,{"$f":"\": \"&VLOOKUP($K$1,INDUK30014000!$A$6:$CK$1005,43)","v":": diterima Tanggal"}]
[null,null,null,null,"2.","Prestasi Belajar (hal. Berikut)"]
[null,null,null,null,"3.","Keadaan Jasmani"]
[null,null,null,"a.","Tahun",null,null,null,{"$f":"VLOOKUP($K$1,INDUK30014000!$A$6:$CA$1005,45)","v":2017},{"$f":"VLOOKUP($K$1,INDUK30014000!$A$6:$CA$1005,50)","v":2018},{"$f":"VLOOKUP($K$1,INDUK30014000!$A$6:$CA$1005,55)","v":2019},{"$f":"VLOOKUP($K$1,INDUK30014000!$A$6:$CK$1005,60)","v":2020},{"$f":"VLOOKUP($K$1,INDUK30014000!$A$6:$CA$1005,65)","v":2021},{"$f":"VLOOKUP($K$1,INDUK30014000!$A$6:$CA$1005,70)","v":2022},{"$f":"VLOOKUP($K$1,INDUK30014000!$A$6:$CA$1005,75)","v":2023}]
[null,"PAS FOTO 3X4cm",null,"b.","Berat Badan",null,null,null,{"$f":"VLOOKUP($K$1,INDUK30014000!$A$6:$CK$1005,46)&\" Kg\"","v":"20171 Kg"},{"$f":"VLOOKUP($K$1,INDUK30014000!$A$6:$CK$1005,51)&\" Kg\"","v":"20181 Kg"},{"$f":"VLOOKUP($K$1,INDUK30014000!$A$6:$CK$1005,56)&\" Kg\"","v":"20191 Kg"},{"$f":"VLOOKUP($K$1,INDUK30014000!$A$6:$CK$1005,61)&\" Kg\"","v":"20201 Kg"},{"$f":"VLOOKUP($K$1,INDUK30014000!$A$6:$CK$1005,66)&\" Kg\"","v":"20211 Kg"},{"$f":"VLOOKUP($K$1,INDUK30014000!$A$6:$CK$1005,71)&\" Kg\"","v":"20221 Kg"},{"$f":"VLOOKUP($K$1,INDUK30014000!$A$6:$CK$1005,76)&\" Kg\"","v":"20231 Kg"}]
[null,null,null,"c.","Tinggi Badan",null,null,null,{"$f":"VLOOKUP($K$1,INDUK30014000!$A$6:$CK$1005,47)&\" Cm\"","v":"20172 Cm"},{"$f":"VLOOKUP($K$1,INDUK30014000!$A$6:$CK$1005,52)&\" Cm\"","v":"20182 Cm"},{"$f":"VLOOKUP($K$1,INDUK30014000!$A$6:$CK$1005,57)&\" Cm\"","v":"20192 Cm"},{"$f":"VLOOKUP($K$1,INDUK30014000!$A$6:$CK$1005,62)&\" Cm\"","v":"20202 Cm"},{"$f":"VLOOKUP($K$1,INDUK30014000!$A$6:$CK$1005,67)&\" Cm\"","v":"20212 Cm"},{"$f":"VLOOKUP($K$1,INDUK30014000!$A$6:$CK$1005,72)&\" Cm\"","v":"20222 Cm"},{"$f":"VLOOKUP($K$1,INDUK30014000!$A$6:$CK$1005,77)&\" Cm\"","v":"20232 Cm"}]
[null,null,null,"d.","Penyakit",null,null,null,{"$f":"VLOOKUP($K$1,INDUK30014000!$A$6:$CK$1005,48)","v":20173},{"$f":"VLOOKUP($K$1,INDUK30014000!$A$6:$CK$1005,53)","v":20183},{"$f":"VLOOKUP($K$1,INDUK30014000!$A$6:$CK$1005,58)","v":20193},{"$f":"VLOOKUP($K$1,INDUK30014000!$A$6:$CK$1005,63)","v":20203},{"$f":"VLOOKUP($K$1,INDUK30014000!$A$6:$CK$1005,68)","v":20213},{"$f":"VLOOKUP($K$1,INDUK30014000!$A$6:$CK$1005,73)","v":20223},{"$f":"VLOOKUP($K$1,INDUK30014000!$A$6:$CK$1005,78)","v":20233}]
[null,null,null,"e.","Kelainan Jasmani",null,null,null,{"$f":"VLOOKUP($K$1,INDUK30014000!$A$6:$CK$1005,49)","v":20174},{"$f":"VLOOKUP($K$1,INDUK30014000!$A$6:$CK$1005,54)","v":20184},{"$f":"VLOOKUP($K$1,INDUK30014000!$A$6:$CK$1005,59)","v":20194},{"$f":"VLOOKUP($K$1,INDUK30014000!$A$6:$CK$1005,64)","v":20204},{"$f":"VLOOKUP($K$1,INDUK30014000!$A$6:$CK$1005,69)","v":20214},{"$f":"VLOOKUP($K$1,INDUK30014000!$A$6:$CK$1005,74)","v":20224},{"$f":"VLOOKUP($K$1,INDUK30014000!$A$6:$CK$1005,79)","v":20234}]
[]
[null,null,null,"D.","BEA SISWA ( Jenis Beasiswa )",null,null,null,null,null,null,{"$f":"\": \"&VLOOKUP($K$1,INDUK30014000!$A$6:$CK$1005,80)","v":": KIP"}]
[null,null,null,"E.","MENINGGALKAN MADRASAH"]
[null,null,null,null,"1.","Tamat Belajar"]
[null,null,null,null,null,"a)",null,"Tahun Tamat",null,null,null,{"$f":"\": Tahun: \"&VLOOKUP($K$1,INDUK30014000!$A$6:$CK$1005,81)","v":": Tahun: Tahun"},null,{"$f":"\"No.STTB : \"&VLOOKUP($K$1,INDUK30014000!$A$6:$CK$1005,82)","v":"No.STTB : No. STTB"}]
[null,null,null,null,null,"b)",null,"Melanjutkan Madrasah",null,null,null,{"$f":"\": \"&VLOOKUP($K$1,INDUK30014000!$A$6:$CK$1005,83)","v":": Melanjutkan Ke"}]
[null,null,null,null,"2.","Pindah Madrasah"]
[null,null,null,null,null,"a)",null,"Dari Tingkat",null,null,null,{"$f":"\": \"&VLOOKUP($K$1,INDUK30014000!$A$6:$CK$1005,84)","v":": Dari Tingkat"}]
[null,null,null,null,null,"b)",null,"Ke Sekolah",null,null,null,{"$f":"\": \"&VLOOKUP($K$1,INDUK30014000!$A$6:$CK$1005,85)","v":": Ke Sekolah"}]
[null,null,null,null,null,"c)",null,"Ke Tingkat",null,null,null,{"$f":"\": \"&VLOOKUP($K$1,INDUK30014000!$A$6:$CK$1005,86)","v":": Ke Tingkat"}]
[null,null,null,null,null,"d)",null,"Tanggal",null,null,null,{"$f":"\": \"&VLOOKUP($K$1,INDUK30014000!$A$6:$CK$1005,87)","v":": Tanggal"}]
[null,null,null,null,"3.","Keluar Madrasah"]
[null,null,null,null,null,"a.",null,"Tanggal",null,null,null,{"$f":"\": \"&VLOOKUP($K$1,INDUK30014000!$A$6:$CK$1005,88)","v":": Tanggal"}]
[null,null,null,null,null,"b.",null,"Alasan",null,null,null,{"$f":"\": \"&VLOOKUP($K$1,INDUK30014000!$A$6:$CK$1005,89)","v":": Alasan"}]

{"sheet":"INDUK30014000HAL2","index":2,"n_rows":53,"n_cols":32,"rows_kept":53,"cut":false,"hidden":false,"merged":[[0,26,0,27],[1,0,4,0],[1,1,4,4],[1,5,1,8],[1,9,1,12],[1,13,1,16],[1,17,1,20],[1,21,1,24],[1,25,1,28],[3,7,3,8],[1,29,1,30],[2,5,2,8],[2,9,2,12],[2,13,2,16],[2,17,2,20],[2,21,2,24],[2,25,2,28],[2,29,4,29],[2,30,4,30],[3,5,3,6],[3,27,3,28],[5,0,9,0],[5,1,5,4],[5,5,5,30],[6,2,6,4],[7,2,7,4],[8,2,8,4],[3,9,3,10],[3,11,3,12],[3,13,3,14],[3,15,3,16],[3,17,3,18],[3,19,3,20],[9,2,9,4],[10,1,10,4],[11,1,11,4],[12,1,12,4],[13,1,13,4],[14,1,14,4],[3,21,3,22],[3,23,3,24],[3,25,3,26],[15,1,15,4],[16,1,16,4],[17,1,17,4],[18,0,21,0],[18,1,18,4],[18,5,18,30],[19,2,19,4],[20,2,20,4],[21,2,21,4],[22,0,22,4],[22,5,22,30],[23,1,23,4],[23,5,23,6],[23,7,23,8],[23,9,23,10],[23,11,23,12],[23,13,23,14],[23,15,23,16],[23,17,23,18],[23,19,23,20],[24,1,24,4],[24,5,24,6],[24,7,24,8],[24,9,24,10],[24,11,24,12],[24,25,24,26],[24,27,24,28],[24,19,24,20],[24,21,24,22],[24,23,24,24],[25,15,25,16],[25,17,25,18],[24,13,24,14],[24,15,24,16],[24,17,24,18],[23,21,23,22],[23,23,23,24],[23,25,23,26],[23,27,23,28],[26,13,26,14],[26,15,26,16],[26,17,26,18],[25,19,25,20],[25,21,25,22],[25,23,25,24],[25,25,25,26],[25,27,25,28],[26,0,26,4],[26,5,26,6],[26,7,26,8],[26,9,26,10],[26,11,26,12],[26,25,26,26],[26,27,26,28],[26,19,26,20],[26,21,26,22],[26,23,26,24],[25,1,25,4],[25,5,25,6],[25,7,25,8],[25,9,25,10],[25,11,25,12],[25,13,25,14],[27,19,27,20],[27,21,27,22],[27,23,27,24],[27,25,27,26],[27,27,27,28],[28,0,28,4],[28,5,28,6],[28,7,28,8],[28,9,28,10],[28,11,28,12],[28,25,28,26],[28,27,28,28],[27,0,27,4],[27,5,27,6],[27,7,27,8],[27,9,27,10],[27,11,27,12],[27,13,27,14],[27,15,27,16],[27,17,27,18],[29,0,29,4],[29,5,29,30],[30,1,30,4],[30,5,30,6],[30,7,30,8],[30,9,30,10],[30,11,30,12],[30,13,30,14],[28,13,28,14],[28,15,28,16],[28,17,28,18],[28,19,28,20],[28,21,28,22],[28,23,28,24],[30,27,30,28],[30,15,30,16],[30,17,30,18],[30,19,30,20],[30,21,30,22],[30,23,30,24],[30,25,30,26],[31,21,31,22],[31,23,31,24],[31,25,31,26],[31,27,31,28],[32,1,32,4],[32,5,32,6],[32,7,32,8],[32,9,32,10],[32,11,32,12],[32,13,32,14],[31,1,31,4],[31,5,31,6],[31,7,31,8],[31,9,31,10],[31,11,31,12],[31,13,31,14],[31,15,31,16],[31,17,31,18],[31,19,31,20],[34,23,34,24],[34,25,34,26],[34,27,34,28],[32,27,32,28],[33,0,33,4],[33,5,33,30],[34,1,34,3],[34,5,34,6],[34,7,34,8],[34,9,34,10],[34,11,34,12],[34,13,34,14],[34,15,34,16],[32,15,32,16],[32,17,32,18],[32,19,32,20],[32,21,32,22],[32,23,32,24],[32,25,32,26],[35,21,35,22],[35,23,35,24],[35,25,35,26],[35,27,35,28],[36,1,36,3],[36,5,36,6],[36,7,36,8],[36,9,36,10],[36,11,36,12],[36,13,36,14],[35,1,35,3],[35,5,35,6],[35,7,35,8],[35,9,35,10],[35,11,35,12],[35,13,35,14],[35,15,35,16],[35,17,35,18],[35,19,35,20],[39,3,39,10],[39,16,39,20],[39,28,39,30],[43,3,43,11],[43,16,43,22],[43,27,43,30],[36,27,36,28],[37,0,37,4],[37,5,37,8],[37,9,37,12],[37,13,37,16],[37,17,37,20],[37,21,37,24],[37,25,37,28],[36,15,36,16],[36,17,36,18],[36,19,36,20],[36,21,36,22],[36,23,36,24],[36,25,36,26],[34,29,37,30],[34,17,34,18],[34,19,34,20],[34,21,34,22],[52,4,52,11],[52,16,52,22],[52,27,52,30],[45,3,45,11],[45,16,45,22],[45,27,45,30],[50,4,50,11],[50,16,50,22],[50,27,50,30]]}
["V.","PENILAIAN HASIL BELAJAR ",null,null,null,null,null,null,null,null,null,null,null,null,null,null,null,null,null,null,null,"NO.INDUK",null,null,null,":",3002]
["NO","Mata Pelajaran ",null,null,null,{"$f":"\"TP. \"&IF(VLOOKUP($AA$1,INDUK30014000!$A$6:$RL$1005,147,)=0,\"-\",VLOOKUP($AA$1,INDUK30014000!$A$6:$RL$1005,147,))","v":"TP. B56"},null,null,null,{"$f":"\"TP. \"&IF(VLOOKUP($AA$1,INDUK30014000!$A$6:$RL$1005,204,)=0,\"-\",VLOOKUP($AA$1,INDUK30014000!$A$6:$RL$1005,204,))","v":"TP. B111"},null,null,null,{"$f":"\"TP. \"&IF(VLOOKUP($AA$1,INDUK30014000!$A$6:$RL$1005,261,)=0,\"-\",VLOOKUP($AA$1,INDUK30014000!$A$6:$RL$1005,261,))","v":"TP. B167"},null,null,null,{"$f":"\"TP. \"&IF(VLOOKUP($AA$1,INDUK30014000!$A$6:$RL$1005,318,)=0,\"-\",VLOOKUP($AA$1,INDUK30014000!$A$6:$RL$1005,318,))","v":"TP. B223"},null,null,null,{"$f":"\"TP. \"&IF(VLOOKUP($AA$1,INDUK30014000!$A$6:$RL$1005,375,)=0,\"-\",VLOOKUP($AA$1,INDUK30014000!$A$6:$RL$1005,375,))","v":"TP. B279"},null,null,null,{"$f":"\"TP. \"&IF(VLOOKUP($AA$1,INDUK30014000!$A$6:$RL$1005,432,)=0,\"-\",VLOOKUP($AA$1,INDUK30014000!$A$6:$RL$1005,432,))","v":"TP. LOELOES"},null,null,null,"NILAI",null,15]
[null,null,null,null,null,"KELAS 1",null,null,null,"KELAS 2",null,null,null,"KELAS 3",null,null,null,"KELAS 4",null,null,null,"KELAS 5",null,null,null,"KELAS 6",null,null,null,"NEM","STTB/   IJAZAH"]
[null,null,null,null,null,"Smt I",null,"Smt II",null,"Smt I",null,"Smt II",null,"Smt I",null,"Smt II",null,"Smt I",null,"Smt II",null,"Smt I",null,"Smt II",null,"Smt I",null,"Smt II"]
[null,null,null,null,null,"KKM","Nilai","KKM","Nilai","KKM","Nilai","KKM","Nilai","KKM","Nilai","KKM","Nilai","KKM","Nilai","KKM","Nilai","KKM","Nilai","KKM","Nilai","KKM","Nilai","KKM","Nilai"]
[1,"Pendidikan Agama Islam "]
[null,"a.","Al-qur'an Hadits",null,null,null,{"$f":"IF(VLOOKUP($AA$1,INDUK30014000!$A$6:$RL$1005,92,)=0,\"-\",VLOOKUP($AA$1,INDUK30014000!$A$6:$RL$1005,92,))","v":"B1"},null,{"$f":"IF(VLOOKUP($AA$1,INDUK30014000!$A$6:$RL$1005,93,)=0,\"-\",VLOOKUP($AA$1,INDUK30014000!$A$6:$RL$1005,93,))","v":"B2"},null,{"$f":"IF(VLOOKUP($AA$1,INDUK30014000!$A$6:$RL$1005,149,)=0,\"-\",VLOOKUP($AA$1,INDUK30014000!$A$6:$RL$1005,149,))","v":"B56"},null,{"$f":"IF(VLOOKUP($AA$1,INDUK30014000!$A$6:$RL$1005,150,)=0,\"-\",VLOOKUP($AA$1,INDUK30014000!$A$6:$RL$1005,150,))","v":"B57"},null,{"$f":"IF(VLOOKUP($AA$1,INDUK30014000!$A$6:$RL$1005,206,)=0,\"-\",VLOOKUP($AA$1,INDUK30014000!$A$6:$RL$1005,206,))","v":"B112"},null,{"$f":"IF(VLOOKUP($AA$1,INDUK30014000!$A$6:$RL$1005,207,)=0,\"-\",VLOOKUP($AA$1,INDUK30014000!$A$6:$RL$1005,207,))","v":"B113"},null,{"$f":"IF(VLOOKUP($AA$1,INDUK30014000!$A$6:$RL$1005,263,)=0,\"-\",VLOOKUP($AA$1,INDUK30014000!$A$6:$RL$1005,263,))","v":"B168"},null,{"$f":"IF(VLOOKUP($AA$1,INDUK30014000!$A$6:$RL$1005,264,)=0,\"-\",VLOOKUP($AA$1,INDUK30014000!$A$6:$RL$1005,264,))","v":"B169"},null,{"$f":"IF(VLOOKUP($AA$1,INDUK30014000!$A$6:$RL$1005,320,)=0,\"-\",VLOOKUP($AA$1,INDUK30014000!$A$6:$RL$1005,320,))","v":"B224"},null,{"$f":"IF(VLOOKUP($AA$1,INDUK30014000!$A$6:$RL$1005,321,)=0,\"-\",VLOOKUP($AA$1,INDUK30014000!$A$6:$RL$1005,321,))","v":"B225"},null,{"$f":"IF(VLOOKUP($AA$1,INDUK30014000!$A$6:$RL$1005,377,)=0,\"-\",VLOOKUP($AA$1,INDUK30014000!$A$6:$RL$1005,377,))","v":"B280"},null,{"$f":"IF(VLOOKUP($AA$1,INDUK30014000!$A$6:$RL$1005,378,)=0,\"-\",VLOOKUP($AA$1,INDUK30014000!$A$6:$RL$1005,378,))","v":"B281"},{"$f":"IF(VLOOKUP($AA$1,INDUK30014000!$A$6:$RL$1005,451,)=0,\"-\",VLOOKUP($AA$1,INDUK30014000!$A$6:$RL$1005,451,))","v":"B352"},{"$f":"IF(VLOOKUP($AA$1,INDUK30014000!$A$6:$RL$1005,452,)=0,\"-\",VLOOKUP($AA$1,INDUK30014000!$A$6:$RL$1005,452,))","v":"B353"},1]
[null,"b.","Aqidah Akhlaq",null,null,null,{"$f":"IF(VLOOKUP($AA$1,INDUK30014000!$A$6:$RL$1005,94,)=0,\"-\",VLOOKUP($AA$1,INDUK30014000!$A$6:$RL$1005,94,))","v":"B3"},null,{"$f":"IF(VLOOKUP($AA$1,INDUK30014000!$A$6:$RL$1005,95,)=0,\"-\",VLOOKUP($AA$1,INDUK30014000!$A$6:$RL$1005,95,))","v":"B4"},null,{"$f":"IF(VLOOKUP($AA$1,INDUK30014000!$A$6:$RL$1005,151,)=0,\"-\",VLOOKUP($AA$1,INDUK30014000!$A$6:$RL$1005,151,))","v":"B58"},null,{"$f":"IF(VLOOKUP($AA$1,INDUK30014000!$A$6:$RL$1005,152,)=0,\"-\",VLOOKUP($AA$1,INDUK30014000!$A$6:$RL$1005,152,))","v":"B59"},null,{"$f":"IF(VLOOKUP($AA$1,INDUK30014000!$A$6:$RL$1005,208,)=0,\"-\",VLOOKUP($AA$1,INDUK30014000!$A$6:$RL$1005,208,))","v":"B114"},null,{"$f":"IF(VLOOKUP($AA$1,INDUK30014000!$A$6:$RL$1005,209,)=0,\"-\",VLOOKUP($AA$1,INDUK30014000!$A$6:$RL$1005,209,))","v":"B115"},null,{"$f":"IF(VLOOKUP($AA$1,INDUK30014000!$A$6:$RL$1005,265,)=0,\"-\",VLOOKUP($AA$1,INDUK30014000!$A$6:$RL$1005,265,))","v":"B170"},null,{"$f":"IF(VLOOKUP($AA$1,INDUK30014000!$A$6:$RL$1005,266,)=0,\"-\",VLOOKUP($AA$1,INDUK30014000!$A$6:$RL$1005,266,))","v":"B171"},null,{"$f":"IF(VLOOKUP($AA$1,INDUK30014000!$A$6:$RL$1005,322,)=0,\"-\",VLOOKUP($AA$1,INDUK30014000!$A$6:$RL$1005,322,))","v":"B226"},null,{"$f":"IF(VLOOKUP($AA$1,INDUK30014000!$A$6:$RL$1005,323,)=0,\"-\",VLOOKUP($AA$1,INDUK30014000!$A$6:$RL$1005,323,))","v":"B227"},null,{"$f":"IF(VLOOKUP($AA$1,INDUK30014000!$A$6:$RL$1005,379,)=0,\"-\",VLOOKUP($AA$1,INDUK30014000!$A$6:$RL$1005,379,))","v":"B282"},null,{"$f":"IF(VLOOKUP($AA$1,INDUK30014000!$A$6:$RL$1005,380,)=0,\"-\",VLOOKUP($AA$1,INDUK30014000!$A$6:$RL$1005,380,))","v":"B283"},{"$f":"IF(VLOOKUP($AA$1,INDUK30014000!$A$6:$RL$1005,453,)=0,\"-\",VLOOKUP($AA$1,INDUK30014000!$A$6:$RL$1005,453,))","v":"B354"},{"$f":"IF(VLOOKUP($AA$1,INDUK30014000!$A$6:$RL$1005,454,)=0,\"-\",VLOOKUP($AA$1,INDUK30014000!$A$6:$RL$1005,454,))","v":"B355"},2]
[null,"c.","Fiqih",null,null,null,{"$f":"IF(VLOOKUP($AA$1,INDUK30014000!$A$6:$RL$1005,96,)=0,\"-\",VLOOKUP($AA$1,INDUK30014000!$A$6:$RL$1005,96,))","v":"B5"},null,{"$f":"IF(VLOOKUP($AA$1,INDUK30014000!$A$6:$RL$1005,97,)=0,\"-\",VLOOKUP($AA$1,INDUK30014000!$A$6:$RL$1005,97,))","v":"B6"},null,{"$f":"IF(VLOOKUP($AA$1,INDUK30014000!$A$6:$RL$1005,153,)=0,\"-\",VLOOKUP($AA$1,INDUK30014000!$A$6:$RL$1005,153,))","v":"B60"},null,{"$f":"IF(VLOOKUP($AA$1,INDUK30014000!$A$6:$RL$1005,154,)=0,\"-\",VLOOKUP($AA$1,INDUK30014000!$A$6:$RL$1005,154,))","v":"B61"},null,{"$f":"IF(VLOOKUP($AA$1,INDUK30014000!$A$6:$RL$1005,210,)=0,\"-\",VLOOKUP($AA$1,INDUK30014000!$A$6:$RL$1005,210,))","v":"B116"},null,{"$f":"IF(VLOOKUP($AA$1,INDUK30014000!$A$6:$RL$1005,211,)=0,\"-\",VLOOKUP($AA$1,INDUK30014000!$A$6:$RL$1005,211,))","v":"B117"},null,{"$f":"IF(VLOOKUP($AA$1,INDUK30014000!$A$6:$RL$1005,267,)=0,\"-\",VLOOKUP($AA$1,INDUK30014000!$A$6:$RL$1005,267,))","v":"B172"},null,{"$f":"IF(VLOOKUP($AA$1,INDUK30014000!$A$6:$RL$1005,268,)=0,\"-\",VLOOKUP($AA$1,INDUK30014000!$A$6:$RL$1005,268,))","v":"B173"},null,{"$f":"IF(VLOOKUP($AA$1,INDUK30014000!$A$6:$RL$1005,324,)=0,\"-\",VLOOKUP($AA$1,INDUK30014000!$A$6:$RL$1005,324,))","v":"B228"},null,{"$f":"IF(VLOOKUP($AA$1,INDUK30014000!$A$6:$RL$1005,325,)=0,\"-\",VLOOKUP($AA$1,INDUK30014000!$A$6:$RL$1005,325,))","v":"B229"},null,{"$f":"IF(VLOOKUP($AA$1,INDUK30014000!$A$6:$RL$1005,381,)=0,\"-\",VLOOKUP($AA$1,INDUK30014000!$A$6:$RL$1005,381,))","v":"B284"},null,{"$f":"IF(VLOOKUP($AA$1,INDUK30014000!$A$6:$RL$1005,382,)=0,\"-\",VLOOKUP($AA$1,INDUK30014000!$A$6:$RL$1005,382,))","v":"B285"},{"$f":"IF(VLOOKUP($AA$1,INDUK30014000!$A$6:$RL$1005,455,)=0,\"-\",VLOOKUP($AA$1,INDUK30014000!$A$6:$RL$1005,455,))","v":"B356"},{"$f":"IF(VLOOKUP($AA$1,INDUK30014000!$A$6:$RL$1005,456,)=0,\"-\",VLOOKUP($AA$1,INDUK30014000!$A$6:$RL$1005,456,))","v":"B357"},3]
[null,"d.","Sejarah Kebudayaan Islam",null,null,null,{"$f":"IF(VLOOKUP($AA$1,INDUK30014000!$A$6:$RL$1005,98,)=0,\"-\",VLOOKUP($AA$1,INDUK30014000!$A$6:$RL$1005,98,))","v":"B7"},null,{"$f":"IF(VLOOKUP($AA$1,INDUK30014000!$A$6:$RL$1005,99,)=0,\"-\",VLOOKUP($AA$1,INDUK30014000!$A$6:$RL$1005,99,))","v":"B8"},null,{"$f":"IF(VLOOKUP($AA$1,INDUK30014000!$A$6:$RL$1005,155,)=0,\"-\",VLOOKUP($AA$1,INDUK30014000!$A$6:$RL$1005,155,))","v":"B62"},null,{"$f":"IF(VLOOKUP($AA$1,INDUK30014000!$A$6:$RL$1005,156,)=0,\"-\",VLOOKUP($AA$1,INDUK30014000!$A$6:$RL$1005,156,))","v":"B63"},null,{"$f":"IF(VLOOKUP($AA$1,INDUK30014000!$A$6:$RL$1005,212,)=0,\"-\",VLOOKUP($AA$1,INDUK30014000!$A$6:$RL$1005,212,))","v":"B118"},null,{"$f":"IF(VLOOKUP($AA$1,INDUK30014000!$A$6:$RL$1005,213,)=0,\"-\",VLOOKUP($AA$1,INDUK30014000!$A$6:$RL$1005,213,))","v":"B119"},null,{"$f":"IF(VLOOKUP($AA$1,INDUK30014000!$A$6:$RL$1005,269,)=0,\"-\",VLOOKUP($AA$1,INDUK30014000!$A$6:$RL$1005,269,))","v":"B174"},null,{"$f":"IF(VLOOKUP($AA$1,INDUK30014000!$A$6:$RL$1005,270,)=0,\"-\",VLOOKUP($AA$1,INDUK30014000!$A$6:$RL$1005,270,))","v":"B175"},null,{"$f":"IF(VLOOKUP($AA$1,INDUK30014000!$A$6:$RL$1005,326,)=0,\"-\",VLOOKUP($AA$1,INDUK30014000!$A$6:$RL$1005,326,))","v":"B230"},null,{"$f":"IF(VLOOKUP($AA$1,INDUK30014000!$A$6:$RL$1005,327,)=0,\"-\",VLOOKUP($AA$1,INDUK30014000!$A$6:$RL$1005,327,))","v":"B231"},null,{"$f":"IF(VLOOKUP($AA$1,INDUK30014000!$A$6:$RL$1005,383,)=0,\"-\",VLOOKUP($AA$1,INDUK30014000!$A$6:$RL$1005,383,))","v":"B286"},null,{"$f":"IF(VLOOKUP($AA$1,INDUK30014000!$A$6:$RL$1005,384,)=0,\"-\",VLOOKUP($AA$1,INDUK30014000!$A$6:$RL$1005,384,))","v":"B287"},{"$f":"IF(VLOOKUP($AA$1,INDUK30014000!$A$6:$RL$1005,457,)=0,\"-\",VLOOKUP($AA$1,INDUK30014000!$A$6:$RL$1005,457,))","v":"B358"},{"$f":"IF(VLOOKUP($AA$1,INDUK30014000!$A$6:$RL$1005,458,)=0,\"-\",VLOOKUP($AA$1,INDUK30014000!$A$6:$RL$1005,458,))","v":"B359"},4]
[2,"Pendidikan Kewarganegaraan",null,null,null,null,{"$f":"IF(VLOOKUP($AA$1,INDUK30014000!$A$6:$RL$1005,104,)=0,\"-\",VLOOKUP($AA$1,INDUK30014000!$A$6:$RL$1005,104,))","v":"B13"},null,{"$f":"IF(VLOOKUP($AA$1,INDUK30014000!$A$6:$RL$1005,105,)=0,\"-\",VLOOKUP($AA$1,INDUK30014000!$A$6:$RL$1005,105,))","v":"B14"},null,{"$f":"IF(VLOOKUP($AA$1,INDUK30014000!$A$6:$RL$1005,161,)=0,\"-\",VLOOKUP($AA$1,INDUK30014000!$A$6:$RL$1005,161,))","v":"B68"},null,{"$f":"IF(VLOOKUP($AA$1,INDUK30014000!$A$6:$RL$1005,162,)=0,\"-\",VLOOKUP($AA$1,INDUK30014000!$A$6:$RL$1005,162,))","v":"B69"},null,{"$f":"IF(VLOOKUP($AA$1,INDUK30014000!$A$6:$RL$1005,218,)=0,\"-\",VLOOKUP($AA$1,INDUK30014000!$A$6:$RL$1005,218,))","v":"B124"},null,{"$f":"IF(VLOOKUP($AA$1,INDUK30014000!$A$6:$RL$1005,219,)=0,\"-\",VLOOKUP($AA$1,INDUK30014000!$A$6:$RL$1005,219,))","v":"B125"},null,{"$f":"IF(VLOOKUP($AA$1,INDUK30014000!$A$6:$RL$1005,275,)=0,\"-\",VLOOKUP($AA$1,INDUK30014000!$A$6:$RL$1005,275,))","v":"B180"},null,{"$f":"IF(VLOOKUP($AA$1,INDUK30014000!$A$6:$RL$1005,276,)=0,\"-\",VLOOKUP($AA$1,INDUK30014000!$A$6:$RL$1005,276,))","v":"B181"},null,{"$f":"IF(VLOOKUP($AA$1,INDUK30014000!$A$6:$RL$1005,332,)=0,\"-\",VLOOKUP($AA$1,INDUK30014000!$A$6:$RL$1005,332,))","v":"B236"},null,{"$f":"IF(VLOOKUP($AA$1,INDUK30014000!$A$6:$RL$1005,333,)=0,\"-\",VLOOKUP($AA$1,INDUK30014000!$A$6:$RL$1005,333,))","v":"B237"},null,{"$f":"IF(VLOOKUP($AA$1,INDUK30014000!$A$6:$RL$1005,389,)=0,\"-\",VLOOKUP($AA$1,INDUK30014000!$A$6:$RL$1005,389,))","v":"B292"},null,{"$f":"IF(VLOOKUP($AA$1,INDUK30014000!$A$6:$RL$1005,390,)=0,\"-\",VLOOKUP($AA$1,INDUK30014000!$A$6:$RL$1005,390,))","v":"B293"},{"$f":"IF(VLOOKUP($AA$1,INDUK30014000!$A$6:$RL$1005,463,)=0,\"-\",VLOOKUP($AA$1,INDUK30014000!$A$6:$RL$1005,463,))","v":"B364"},{"$f":"IF(VLOOKUP($AA$1,INDUK30014000!$A$6:$RL$1005,464,)=0,\"-\",VLOOKUP($AA$1,INDUK30014000!$A$6:$RL$1005,464,))","v":"B365"},7]
[3,"Bahasa Indonesia",null,null,null,null,{"$f":"IF(VLOOKUP($AA$1,INDUK30014000!$A$6:$RL$1005,106,)=0,\"-\",VLOOKUP($AA$1,INDUK30014000!$A$6:$RL$1005,106,))","v":"B15"},null,{"$f":"IF(VLOOKUP($AA$1,INDUK30014000!$A$6:$RL$1005,107,)=0,\"-\",VLOOKUP($AA$1,INDUK30014000!$A$6:$RL$1005,107,))","v":"B16"},null,{"$f":"IF(VLOOKUP($AA$1,INDUK30014000!$A$6:$RL$1005,163,)=0,\"-\",VLOOKUP($AA$1,INDUK30014000!$A$6:$RL$1005,163,))","v":"B70"},null,{"$f":"IF(VLOOKUP($AA$1,INDUK30014000!$A$6:$RL$1005,164,)=0,\"-\",VLOOKUP($AA$1,INDUK30014000!$A$6:$RL$1005,164,))","v":"B71"},null,{"$f":"IF(VLOOKUP($AA$1,INDUK30014000!$A$6:$RL$1005,220,)=0,\"-\",VLOOKUP($AA$1,INDUK30014000!$A$6:$RL$1005,220,))","v":"B126"},null,{"$f":"IF(VLOOKUP($AA$1,INDUK30014000!$A$6:$RL$1005,221,)=0,\"-\",VLOOKUP($AA$1,INDUK30014000!$A$6:$RL$1005,221,))","v":"B127"},null,{"$f":"IF(VLOOKUP($AA$1,INDUK30014000!$A$6:$RL$1005,277,)=0,\"-\",VLOOKUP($AA$1,INDUK30014000!$A$6:$RL$1005,277,))","v":"B182"},null,{"$f":"IF(VLOOKUP($AA$1,INDUK30014000!$A$6:$RL$1005,278,)=0,\"-\",VLOOKUP($AA$1,INDUK30014000!$A$6:$RL$1005,278,))","v":"B183"},null,{"$f":"IF(VLOOKUP($AA$1,INDUK30014000!$A$6:$RL$1005,334,)=0,\"-\",VLOOKUP($AA$1,INDUK30014000!$A$6:$RL$1005,334,))","v":"B238"},null,{"$f":"IF(VLOOKUP($AA$1,INDUK30014000!$A$6:$RL$1005,335,)=0,\"-\",VLOOKUP($AA$1,INDUK30014000!$A$6:$RL$1005,335,))","v":"B239"},null,{"$f":"IF(VLOOKUP($AA$1,INDUK30014000!$A$6:$RL$1005,391,)=0,\"-\",VLOOKUP($AA$1,INDUK30014000!$A$6:$RL$1005,391,))","v":"B294"},null,{"$f":"IF(VLOOKUP($AA$1,INDUK30014000!$A$6:$RL$1005,392,)=0,\"-\",VLOOKUP($AA$1,INDUK30014000!$A$6:$RL$1005,392,))","v":"B295"},{"$f":"IF(VLOOKUP($AA$1,INDUK30014000!$A$6:$RL$1005,465,)=0,\"-\",VLOOKUP($AA$1,INDUK30014000!$A$6:$RL$1005,465,))","v":"B366"},{"$f":"IF(VLOOKUP($AA$1,INDUK30014000!$A$6:$RL$1005,466,)=0,\"-\",VLOOKUP($AA$1,INDUK30014000!$A$6:$RL$1005,466,))","v":"B367"},8]
[4,"Bahasa Arab",null,null,null,null,{"$f":"IF(VLOOKUP($AA$1,INDUK30014000!$A$6:$RL$1005,102,)=0,\"-\",VLOOKUP($AA$1,INDUK30014000!$A$6:$RL$1005,102,))","v":"B11"},null,{"$f":"IF(VLOOKUP($AA$1,INDUK30014000!$A$6:$RL$1005,103,)=0,\"-\",VLOOKUP($AA$1,INDUK30014000!$A$6:$RL$1005,103,))","v":"B12"},null,{"$f":"IF(VLOOKUP($AA$1,INDUK30014000!$A$6:$RL$1005,159,)=0,\"-\",VLOOKUP($AA$1,INDUK30014000!$A$6:$RL$1005,159,))","v":"B66"},null,{"$f":"IF(VLOOKUP($AA$1,INDUK30014000!$A$6:$RL$1005,160,)=0,\"-\",VLOOKUP($AA$1,INDUK30014000!$A$6:$RL$1005,160,))","v":"B67"},null,{"$f":"IF(VLOOKUP($AA$1,INDUK30014000!$A$6:$RL$1005,216,)=0,\"-\",VLOOKUP($AA$1,INDUK30014000!$A$6:$RL$1005,216,))","v":"B122"},null,{"$f":"IF(VLOOKUP($AA$1,INDUK30014000!$A$6:$RL$1005,217,)=0,\"-\",VLOOKUP($AA$1,INDUK30014000!$A$6:$RL$1005,217,))","v":"B123"},null,{"$f":"IF(VLOOKUP($AA$1,INDUK30014000!$A$6:$RL$1005,273,)=0,\"-\",VLOOKUP($AA$1,INDUK30014000!$A$6:$RL$1005,273,))","v":"B178"},null,{"$f":"IF(VLOOKUP($AA$1,INDUK30014000!$A$6:$RL$1005,274,)=0,\"-\",VLOOKUP($AA$1,INDUK30014000!$A$6:$RL$1005,274,))","v":"B179"},null,{"$f":"IF(VLOOKUP($AA$1,INDUK30014000!$A$6:$RL$1005,330,)=0,\"-\",VLOOKUP($AA$1,INDUK30014000!$A$6:$RL$1005,330,))","v":"B234"},null,{"$f":"IF(VLOOKUP($AA$1,INDUK30014000!$A$6:$RL$1005,331,)=0,\"-\",VLOOKUP($AA$1,INDUK30014000!$A$6:$RL$1005,331,))","v":"B235"},null,{"$f":"IF(VLOOKUP($AA$1,INDUK30014000!$A$6:$RL$1005,387,)=0,\"-\",VLOOKUP($AA$1,INDUK30014000!$A$6:$RL$1005,387,))","v":"B290"},null,{"$f":"IF(VLOOKUP($AA$1,INDUK30014000!$A$6:$RL$1005,388,)=0,\"-\",VLOOKUP($AA$1,INDUK30014000!$A$6:$RL$1005,388,))","v":"B291"},{"$f":"IF(VLOOKUP($AA$1,INDUK30014000!$A$6:$RL$1005,461,)=0,\"-\",VLOOKUP($AA$1,INDUK30014000!$A$6:$RL$1005,461,))","v":"B362"},{"$f":"IF(VLOOKUP($AA$1,INDUK30014000!$A$6:$RL$1005,462,)=0,\"-\",VLOOKUP($AA$1,INDUK30014000!$A$6:$RL$1005,462,))","v":"B363"},6]
[5,"Matematika",null,null,null,null,{"$f":"IF(VLOOKUP($AA$1,INDUK30014000!$A$6:$RL$1005,108,)=0,\"-\",VLOOKUP($AA$1,INDUK30014000!$A$6:$RL$1005,108,))","v":"B17"},null,{"$f":"IF(VLOOKUP($AA$1,INDUK30014000!$A$6:$RL$1005,109,)=0,\"-\",VLOOKUP($AA$1,INDUK30014000!$A$6:$RL$1005,109,))","v":"B18"},null,{"$f":"IF(VLOOKUP($AA$1,INDUK30014000!$A$6:$RL$1005,165,)=0,\"-\",VLOOKUP($AA$1,INDUK30014000!$A$6:$RL$1005,165,))","v":"B72"},null,{"$f":"IF(VLOOKUP($AA$1,INDUK30014000!$A$6:$RL$1005,166,)=0,\"-\",VLOOKUP($AA$1,INDUK30014000!$A$6:$RL$1005,166,))","v":"B73"},null,{"$f":"IF(VLOOKUP($AA$1,INDUK30014000!$A$6:$RL$1005,222,)=0,\"-\",VLOOKUP($AA$1,INDUK30014000!$A$6:$RL$1005,222,))","v":"B128"},null,{"$f":"IF(VLOOKUP($AA$1,INDUK30014000!$A$6:$RL$1005,223,)=0,\"-\",VLOOKUP($AA$1,INDUK30014000!$A$6:$RL$1005,223,))","v":"B129"},null,{"$f":"IF(VLOOKUP($AA$1,INDUK30014000!$A$6:$RL$1005,279,)=0,\"-\",VLOOKUP($AA$1,INDUK30014000!$A$6:$RL$1005,279,))","v":"B184"},null,{"$f":"IF(VLOOKUP($AA$1,INDUK30014000!$A$6:$RL$1005,280,)=0,\"-\",VLOOKUP($AA$1,INDUK30014000!$A$6:$RL$1005,280,))","v":"B185"},null,{"$f":"IF(VLOOKUP($AA$1,INDUK30014000!$A$6:$RL$1005,336,)=0,\"-\",VLOOKUP($AA$1,INDUK30014000!$A$6:$RL$1005,336,))","v":"B240"},null,{"$f":"IF(VLOOKUP($AA$1,INDUK30014000!$A$6:$RL$1005,337,)=0,\"-\",VLOOKUP($AA$1,INDUK30014000!$A$6:$RL$1005,337,))","v":"B241"},null,{"$f":"IF(VLOOKUP($AA$1,INDUK30014000!$A$6:$RL$1005,393,)=0,\"-\",VLOOKUP($AA$1,INDUK30014000!$A$6:$RL$1005,393,))","v":"B296"},null,{"$f":"IF(VLOOKUP($AA$1,INDUK30014000!$A$6:$RL$1005,394,)=0,\"-\",VLOOKUP($AA$1,INDUK30014000!$A$6:$RL$1005,394,))","v":"B297"},{"$f":"IF(VLOOKUP($AA$1,INDUK30014000!$A$6:$RL$1005,467,)=0,\"-\",VLOOKUP($AA$1,INDUK30014000!$A$6:$RL$1005,467,))","v":"B368"},{"$f":"IF(VLOOKUP($AA$1,INDUK30014000!$A$6:$RL$1005,468,)=0,\"-\",VLOOKUP($AA$1,INDUK30014000!$A$6:$RL$1005,468,))","v":"B369"},9]
[6,"Ilmu Pengetahuan Alam",null,null,null,null,{"$f":"IF(VLOOKUP($AA$1,INDUK30014000!$A$6:$RL$1005,110,)=0,\"-\",VLOOKUP($AA$1,INDUK30014000!$A$6:$RL$1005,110,))","v":"B19"},null,{"$f":"IF(VLOOKUP($AA$1,INDUK30014000!$A$6:$RL$1005,111,)=0,\"-\",VLOOKUP($AA$1,INDUK30014000!$A$6:$RL$1005,111,))","v":"B20"},null,{"$f":"IF(VLOOKUP($AA$1,INDUK30014000!$A$6:$RL$1005,167,)=0,\"-\",VLOOKUP($AA$1,INDUK30014000!$A$6:$RL$1005,167,))","v":"B74"},null,{"$f":"IF(VLOOKUP($AA$1,INDUK30014000!$A$6:$RL$1005,168,)=0,\"-\",VLOOKUP($AA$1,INDUK30014000!$A$6:$RL$1005,168,))","v":"B75"},null,{"$f":"IF(VLOOKUP($AA$1,INDUK30014000!$A$6:$RL$1005,224,)=0,\"-\",VLOOKUP($AA$1,INDUK30014000!$A$6:$RL$1005,224,))","v":"B130"},null,{"$f":"IF(VLOOKUP($AA$1,INDUK30014000!$A$6:$RL$1005,225,)=0,\"-\",VLOOKUP($AA$1,INDUK30014000!$A$6:$RL$1005,225,))","v":"B131"},null,{"$f":"IF(VLOOKUP($AA$1,INDUK30014000!$A$6:$RL$1005,281,)=0,\"-\",VLOOKUP($AA$1,INDUK30014000!$A$6:$RL$1005,281,))","v":"B186"},null,{"$f":"IF(VLOOKUP($AA$1,INDUK30014000!$A$6:$RL$1005,282,)=0,\"-\",VLOOKUP($AA$1,INDUK30014000!$A$6:$RL$1005,282,))","v":"B187"},null,{"$f":"IF(VLOOKUP($AA$1,INDUK30014000!$A$6:$RL$1005,338,)=0,\"-\",VLOOKUP($AA$1,INDUK30014000!$A$6:$RL$1005,338,))","v":"B242"},null,{"$f":"IF(VLOOKUP($AA$1,INDUK30014000!$A$6:$RL$1005,339,)=0,\"-\",VLOOKUP($AA$1,INDUK30014000!$A$6:$RL$1005,339,))","v":"B243"},null,{"$f":"IF(VLOOKUP($AA$1,INDUK30014000!$A$6:$RL$1005,395,)=0,\"-\",VLOOKUP($AA$1,INDUK30014000!$A$6:$RL$1005,395,))","v":"B298"},null,{"$f":"IF(VLOOKUP($AA$1,INDUK30014000!$A$6:$RL$1005,396,)=0,\"-\",VLOOKUP($AA$1,INDUK30014000!$A$6:$RL$1005,396,))","v":"B299"},{"$f":"IF(VLOOKUP($AA$1,INDUK30014000!$A$6:$RL$1005,469,)=0,\"-\",VLOOKUP($AA$1,INDUK30014000!$A$6:$RL$1005,469,))","v":"B370"},{"$f":"IF(VLOOKUP($AA$1,INDUK30014000!$A$6:$RL$1005,470,)=0,\"-\",VLOOKUP($AA$1,INDUK30014000!$A$6:$RL$1005,470,))","v":"B371"},10]
[7,"Ilmu Pengetahuan Sosial",null,null,null,null,{"$f":"IF(VLOOKUP($AA$1,INDUK30014000!$A$6:$RL$1005,112,)=0,\"-\",VLOOKUP($AA$1,INDUK30014000!$A$6:$RL$1005,112,))","v":"B21"},null,{"$f":"IF(VLOOKUP($AA$1,INDUK30014000!$A$6:$RL$1005,113,)=0,\"-\",VLOOKUP($AA$1,INDUK30014000!$A$6:$RL$1005,113,))","v":"B22"},null,{"$f":"IF(VLOOKUP($AA$1,INDUK30014000!$A$6:$RL$1005,169,)=0,\"-\",VLOOKUP($AA$1,INDUK30014000!$A$6:$RL$1005,169,))","v":"B76"},null,{"$f":"IF(VLOOKUP($AA$1,INDUK30014000!$A$6:$RL$1005,170,)=0,\"-\",VLOOKUP($AA$1,INDUK30014000!$A$6:$RL$1005,170,))","v":"B77"},null,{"$f":"IF(VLOOKUP($AA$1,INDUK30014000!$A$6:$RL$1005,226,)=0,\"-\",VLOOKUP($AA$1,INDUK30014000!$A$6:$RL$1005,226,))","v":"B132"},null,{"$f":"IF(VLOOKUP($AA$1,INDUK30014000!$A$6:$RL$1005,227,)=0,\"-\",VLOOKUP($AA$1,INDUK30014000!$A$6:$RL$1005,227,))","v":"B133"},null,{"$f":"IF(VLOOKUP($AA$1,INDUK30014000!$A$6:$RL$1005,283,)=0,\"-\",VLOOKUP($AA$1,INDUK30014000!$A$6:$RL$1005,283,))","v":"B188"},null,{"$f":"IF(VLOOKUP($AA$1,INDUK30014000!$A$6:$RL$1005,284,)=0,\"-\",VLOOKUP($AA$1,INDUK30014000!$A$6:$RL$1005,284,))","v":"B189"},null,{"$f":"IF(VLOOKUP($AA$1,INDUK30014000!$A$6:$RL$1005,340,)=0,\"-\",VLOOKUP($AA$1,INDUK30014000!$A$6:$RL$1005,340,))","v":"B244"},null,{"$f":"IF(VLOOKUP($AA$1,INDUK30014000!$A$6:$RL$1005,341,)=0,\"-\",VLOOKUP($AA$1,INDUK30014000!$A$6:$RL$1005,341,))","v":"B245"},null,{"$f":"IF(VLOOKUP($AA$1,INDUK30014000!$A$6:$RL$1005,397,)=0,\"-\",VLOOKUP($AA$1,INDUK30014000!$A$6:$RL$1005,397,))","v":"B300"},null,{"$f":"IF(VLOOKUP($AA$1,INDUK30014000!$A$6:$RL$1005,398,)=0,\"-\",VLOOKUP($AA$1,INDUK30014000!$A$6:$RL$1005,398,))","v":"B301"},{"$f":"IF(VLOOKUP($AA$1,INDUK30014000!$A$6:$RL$1005,471,)=0,\"-\",VLOOKUP($AA$1,INDUK30014000!$A$6:$RL$1005,471,))","v":"B372"},{"$f":"IF(VLOOKUP($AA$1,INDUK30014000!$A$6:$RL$1005,472,)=0,\"-\",VLOOKUP($AA$1,INDUK30014000!$A$6:$RL$1005,472,))","v":"B373"},11]
[8,"Seni Budaya dan Keterampilan",null,null,null,null,{"$f":"IF(VLOOKUP($AA$1,INDUK30014000!$A$6:$RL$1005,114,)=0,\"-\",VLOOKUP($AA$1,INDUK30014000!$A$6:$RL$1005,114,))","v":"B23"},null,{"$f":"IF(VLOOKUP($AA$1,INDUK30014000!$A$6:$RL$1005,115,)=0,\"-\",VLOOKUP($AA$1,INDUK30014000!$A$6:$RL$1005,115,))","v":"B24"},null,{"$f":"IF(VLOOKUP($AA$1,INDUK30014000!$A$6:$RL$1005,171,)=0,\"-\",VLOOKUP($AA$1,INDUK30014000!$A$6:$RL$1005,171,))","v":"B78"},null,{"$f":"IF(VLOOKUP($AA$1,INDUK30014000!$A$6:$RL$1005,172,)=0,\"-\",VLOOKUP($AA$1,INDUK30014000!$A$6:$RL$1005,172,))","v":"B79"},null,{"$f":"IF(VLOOKUP($AA$1,INDUK30014000!$A$6:$RL$1005,228,)=0,\"-\",VLOOKUP($AA$1,INDUK30014000!$A$6:$RL$1005,228,))","v":"B134"},null,{"$f":"IF(VLOOKUP($AA$1,INDUK30014000!$A$6:$RL$1005,229,)=0,\"-\",VLOOKUP($AA$1,INDUK30014000!$A$6:$RL$1005,229,))","v":"B135"},null,{"$f":"IF(VLOOKUP($AA$1,INDUK30014000!$A$6:$RL$1005,285,)=0,\"-\",VLOOKUP($AA$1,INDUK30014000!$A$6:$RL$1005,285,))","v":"B190"},null,{"$f":"IF(VLOOKUP($AA$1,INDUK30014000!$A$6:$RL$1005,286,)=0,\"-\",VLOOKUP($AA$1,INDUK30014000!$A$6:$RL$1005,286,))","v":"B191"},null,{"$f":"IF(VLOOKUP($AA$1,INDUK30014000!$A$6:$RL$1005,342,)=0,\"-\",VLOOKUP($AA$1,INDUK30014000!$A$6:$RL$1005,342,))","v":"B246"},null,{"$f":"IF(VLOOKUP($AA$1,INDUK30014000!$A$6:$RL$1005,343,)=0,\"-\",VLOOKUP($AA$1,INDUK30014000!$A$6:$RL$1005,343,))","v":"B247"},null,{"$f":"IF(VLOOKUP($AA$1,INDUK30014000!$A$6:$RL$1005,399,)=0,\"-\",VLOOKUP($AA$1,INDUK30014000!$A$6:$RL$1005,399,))","v":"B302"},null,{"$f":"IF(VLOOKUP($AA$1,INDUK30014000!$A$6:$RL$1005,400,)=0,\"-\",VLOOKUP($AA$1,INDUK30014000!$A$6:$RL$1005,400,))","v":"B303"},{"$f":"IF(VLOOKUP($AA$1,INDUK30014000!$A$6:$RL$1005,473,)=0,\"-\",VLOOKUP($AA$1,INDUK30014000!$A$6:$RL$1005,473,))","v":"B374"},{"$f":"IF(VLOOKUP($AA$1,INDUK30014000!$A$6:$RL$1005,474,)=0,\"-\",VLOOKUP($AA$1,INDUK30014000!$A$6:$RL$1005,474,))","v":"B375"},12]
[9,"Pend. Jasmani, Olah Raga dan Kesehatan",null,null,null,null,{"$f":"IF(VLOOKUP($AA$1,INDUK30014000!$A$6:$RL$1005,116,)=0,\"-\",VLOOKUP($AA$1,INDUK30014000!$A$6:$RL$1005,116,))","v":"B25"},null,{"$f":"IF(VLOOKUP($AA$1,INDUK30014000!$A$6:$RL$1005,117,)=0,\"-\",VLOOKUP($AA$1,INDUK30014000!$A$6:$RL$1005,117,))","v":"B26"},null,{"$f":"IF(VLOOKUP($AA$1,INDUK30014000!$A$6:$RL$1005,173,)=0,\"-\",VLOOKUP($AA$1,INDUK30014000!$A$6:$RL$1005,173,))","v":"B80"},null,{"$f":"IF(VLOOKUP($AA$1,INDUK30014000!$A$6:$RL$1005,174,)=0,\"-\",VLOOKUP($AA$1,INDUK30014000!$A$6:$RL$1005,174,))","v":"B81"},null,{"$f":"IF(VLOOKUP($AA$1,INDUK30014000!$A$6:$RL$1005,230,)=0,\"-\",VLOOKUP($AA$1,INDUK30014000!$A$6:$RL$1005,230,))","v":"B136"},null,{"$f":"IF(VLOOKUP($AA$1,INDUK30014000!$A$6:$RL$1005,231,)=0,\"-\",VLOOKUP($AA$1,INDUK30014000!$A$6:$RL$1005,231,))","v":"B137"},null,{"$f":"IF(VLOOKUP($AA$1,INDUK30014000!$A$6:$RL$1005,287,)=0,\"-\",VLOOKUP($AA$1,INDUK30014000!$A$6:$RL$1005,287,))","v":"B192"},null,{"$f":"IF(VLOOKUP($AA$1,INDUK30014000!$A$6:$RL$1005,288,)=0,\"-\",VLOOKUP($AA$1,INDUK30014000!$A$6:$RL$1005,288,))","v":"B193"},null,{"$f":"IF(VLOOKUP($AA$1,INDUK30014000!$A$6:$RL$1005,344,)=0,\"-\",VLOOKUP($AA$1,INDUK30014000!$A$6:$RL$1005,344,))","v":"B248"},null,{"$f":"IF(VLOOKUP($AA$1,INDUK30014000!$A$6:$RL$1005,345,)=0,\"-\",VLOOKUP($AA$1,INDUK30014000!$A$6:$RL$1005,345,))","v":"B249"},null,{"$f":"IF(VLOOKUP($AA$1,INDUK30014000!$A$6:$RL$1005,401,)=0,\"-\",VLOOKUP($AA$1,INDUK30014000!$A$6:$RL$1005,401,))","v":"B304"},null,{"$f":"IF(VLOOKUP($AA$1,INDUK30014000!$A$6:$RL$1005,402,)=0,\"-\",VLOOKUP($AA$1,INDUK30014000!$A$6:$RL$1005,402,))","v":"B305"},{"$f":"IF(VLOOKUP($AA$1,INDUK30014000!$A$6:$RL$1005,475,)=0,\"-\",VLOOKUP($AA$1,INDUK30014000!$A$6:$RL$1005,475,))","v":"B376"},{"$f":"IF(VLOOKUP($AA$1,INDUK30014000!$A$6:$RL$1005,476,)=0,\"-\",VLOOKUP($AA$1,INDUK30014000!$A$6:$RL$1005,476,))","v":"B377"},13]
[10,"Muatan Lokal"]
[null,"a.","Bahasa Jawa",null,null,null,{"$f":"IF(VLOOKUP($AA$1,INDUK30014000!$A$6:$RL$1005,118,)=0,\"-\",VLOOKUP($AA$1,INDUK30014000!$A$6:$RL$1005,118,))","v":"B27"},null,{"$f":"IF(VLOOKUP($AA$1,INDUK30014000!$A$6:$RL$1005,119,)=0,\"-\",VLOOKUP($AA$1,INDUK30014000!$A$6:$RL$1005,119,))","v":"B28"},null,{"$f":"IF(VLOOKUP($AA$1,INDUK30014000!$A$6:$RL$1005,175,)=0,\"-\",VLOOKUP($AA$1,INDUK30014000!$A$6:$RL$1005,175,))","v":"B82"},null,{"$f":"IF(VLOOKUP($AA$1,INDUK30014000!$A$6:$RL$1005,176,)=0,\"-\",VLOOKUP($AA$1,INDUK30014000!$A$6:$RL$1005,176,))","v":"B83"},null,{"$f":"IF(VLOOKUP($AA$1,INDUK30014000!$A$6:$RL$1005,232,)=0,\"-\",VLOOKUP($AA$1,INDUK30014000!$A$6:$RL$1005,232,))","v":"B138"},null,{"$f":"IF(VLOOKUP($AA$1,INDUK30014000!$A$6:$RL$1005,233,)=0,\"-\",VLOOKUP($AA$1,INDUK30014000!$A$6:$RL$1005,233,))","v":"B139"},null,{"$f":"IF(VLOOKUP($AA$1,INDUK30014000!$A$6:$RL$1005,289,)=0,\"-\",VLOOKUP($AA$1,INDUK30014000!$A$6:$RL$1005,289,))","v":"B194"},null,{"$f":"IF(VLOOKUP($AA$1,INDUK30014000!$A$6:$RL$1005,290,)=0,\"-\",VLOOKUP($AA$1,INDUK30014000!$A$6:$RL$1005,290,))","v":"B195"},null,{"$f":"IF(VLOOKUP($AA$1,INDUK30014000!$A$6:$RL$1005,346,)=0,\"-\",VLOOKUP($AA$1,INDUK30014000!$A$6:$RL$1005,346,))","v":"B250"},null,{"$f":"IF(VLOOKUP($AA$1,INDUK30014000!$A$6:$RL$1005,347,)=0,\"-\",VLOOKUP($AA$1,INDUK30014000!$A$6:$RL$1005,347,))","v":"B251"},null,{"$f":"IF(VLOOKUP($AA$1,INDUK30014000!$A$6:$RL$1005,403,)=0,\"-\",VLOOKUP($AA$1,INDUK30014000!$A$6:$RL$1005,403,))","v":"B306"},null,{"$f":"IF(VLOOKUP($AA$1,INDUK30014000!$A$6:$RL$1005,404,)=0,\"-\",VLOOKUP($AA$1,INDUK30014000!$A$6:$RL$1005,404,))","v":"B307"},{"$f":"IF(VLOOKUP($AA$1,INDUK30014000!$A$6:$RL$1005,477,)=0,\"-\",VLOOKUP($AA$1,INDUK30014000!$A$6:$RL$1005,477,))","v":"B378"},{"$f":"IF(VLOOKUP($AA$1,INDUK30014000!$A$6:$RL$1005,478,)=0,\"-\",VLOOKUP($AA$1,INDUK30014000!$A$6:$RL$1005,478,))","v":"B379"},14]
[null,"b.","Bahasa Inggris",null,null,null,{"$f":"IF(VLOOKUP($AA$1,INDUK30014000!$A$6:$RL$1005,120,)=0,\"-\",VLOOKUP($AA$1,INDUK30014000!$A$6:$RL$1005,120,))","v":"B29"},null,{"$f":"IF(VLOOKUP($AA$1,INDUK30014000!$A$6:$RL$1005,121,)=0,\"-\",VLOOKUP($AA$1,INDUK30014000!$A$6:$RL$1005,121,))","v":"B30"},null,{"$f":"IF(VLOOKUP($AA$1,INDUK30014000!$A$6:$RL$1005,177,)=0,\"-\",VLOOKUP($AA$1,INDUK30014000!$A$6:$RL$1005,177,))","v":"B84"},null,{"$f":"IF(VLOOKUP($AA$1,INDUK30014000!$A$6:$RL$1005,178,)=0,\"-\",VLOOKUP($AA$1,INDUK30014000!$A$6:$RL$1005,178,))","v":"B85"},null,{"$f":"IF(VLOOKUP($AA$1,INDUK30014000!$A$6:$RL$1005,234,)=0,\"-\",VLOOKUP($AA$1,INDUK30014000!$A$6:$RL$1005,234,))","v":"B140"},null,{"$f":"IF(VLOOKUP($AA$1,INDUK30014000!$A$6:$RL$1005,235,)=0,\"-\",VLOOKUP($AA$1,INDUK30014000!$A$6:$RL$1005,235,))","v":"B141"},null,{"$f":"IF(VLOOKUP($AA$1,INDUK30014000!$A$6:$RL$1005,291,)=0,\"-\",VLOOKUP($AA$1,INDUK30014000!$A$6:$RL$1005,291,))","v":"B196"},null,{"$f":"IF(VLOOKUP($AA$1,INDUK30014000!$A$6:$RL$1005,292,)=0,\"-\",VLOOKUP($AA$1,INDUK30014000!$A$6:$RL$1005,292,))","v":"B197"},null,{"$f":"IF(VLOOKUP($AA$1,INDUK30014000!$A$6:$RL$1005,348,)=0,\"-\",VLOOKUP($AA$1,INDUK30014000!$A$6:$RL$1005,348,))","v":"B252"},null,{"$f":"IF(VLOOKUP($AA$1,INDUK30014000!$A$6:$RL$1005,349,)=0,\"-\",VLOOKUP($AA$1,INDUK30014000!$A$6:$RL$1005,349,))","v":"B253"},null,{"$f":"IF(VLOOKUP($AA$1,INDUK30014000!$A$6:$RL$1005,405,)=0,\"-\",VLOOKUP($AA$1,INDUK30014000!$A$6:$RL$1005,405,))","v":"B308"},null,{"$f":"IF(VLOOKUP($AA$1,INDUK30014000!$A$6:$RL$1005,406,)=0,\"-\",VLOOKUP($AA$1,INDUK30014000!$A$6:$RL$1005,406,))","v":"B309"},{"$f":"IF(VLOOKUP($AA$1,INDUK30014000!$A$6:$RL$1005,451,)=0,\"-\",VLOOKUP($AA$1,INDUK30014000!$A$6:$RL$1005,451,))","v":"B352"},{"$f":"IF(VLOOKUP($AA$1,INDUK30014000!$A$6:$RL$1005,451,)=0,\"-\",VLOOKUP($AA$1,INDUK30014000!$A$6:$RL$1005,451,))","v":"B352"},1]
[null,"c.","Ke-NU-an / Aswaja",null,null,null,{"$f":"IF(VLOOKUP($AA$1,INDUK30014000!$A$6:$RL$1005,100,)=0,\"-\",VLOOKUP($AA$1,INDUK30014000!$A$6:$RL$1005,100,))","v":"B9"},null,{"$f":"IF(VLOOKUP($AA$1,INDUK30014000!$A$6:$RL$1005,101,)=0,\"-\",VLOOKUP($AA$1,INDUK30014000!$A$6:$RL$1005,101,))","v":"B10"},null,{"$f":"IF(VLOOKUP($AA$1,INDUK30014000!$A$6:$RL$1005,157,)=0,\"-\",VLOOKUP($AA$1,INDUK30014000!$A$6:$RL$1005,157,))","v":"B64"},null,{"$f":"IF(VLOOKUP($AA$1,INDUK30014000!$A$6:$RL$1005,158,)=0,\"-\",VLOOKUP($AA$1,INDUK30014000!$A$6:$RL$1005,158,))","v":"B65"},null,{"$f":"IF(VLOOKUP($AA$1,INDUK30014000!$A$6:$RL$1005,214,)=0,\"-\",VLOOKUP($AA$1,INDUK30014000!$A$6:$RL$1005,214,))","v":"B120"},null,{"$f":"IF(VLOOKUP($AA$1,INDUK30014000!$A$6:$RL$1005,215,)=0,\"-\",VLOOKUP($AA$1,INDUK30014000!$A$6:$RL$1005,215,))","v":"B121"},null,{"$f":"IF(VLOOKUP($AA$1,INDUK30014000!$A$6:$RL$1005,271,)=0,\"-\",VLOOKUP($AA$1,INDUK30014000!$A$6:$RL$1005,271,))","v":"B176"},null,{"$f":"IF(VLOOKUP($AA$1,INDUK30014000!$A$6:$RL$1005,272,)=0,\"-\",VLOOKUP($AA$1,INDUK30014000!$A$6:$RL$1005,272,))","v":"B177"},null,{"$f":"IF(VLOOKUP($AA$1,INDUK30014000!$A$6:$RL$1005,328,)=0,\"-\",VLOOKUP($AA$1,INDUK30014000!$A$6:$RL$1005,328,))","v":"B232"},null,{"$f":"IF(VLOOKUP($AA$1,INDUK30014000!$A$6:$RL$1005,329,)=0,\"-\",VLOOKUP($AA$1,INDUK30014000!$A$6:$RL$1005,329,))","v":"B233"},null,{"$f":"IF(VLOOKUP($AA$1,INDUK30014000!$A$6:$RL$1005,385,)=0,\"-\",VLOOKUP($AA$1,INDUK30014000!$A$6:$RL$1005,385,))","v":"B288"},null,{"$f":"IF(VLOOKUP($AA$1,INDUK30014000!$A$6:$RL$1005,386,)=0,\"-\",VLOOKUP($AA$1,INDUK30014000!$A$6:$RL$1005,386,))","v":"B289"},{"$f":"IF(VLOOKUP($AA$1,INDUK30014000!$A$6:$RL$1005,459,)=0,\"-\",VLOOKUP($AA$1,INDUK30014000!$A$6:$RL$1005,459,))","v":"B360"},{"$f":"IF(VLOOKUP($AA$1,INDUK30014000!$A$6:$RL$1005,460,)=0,\"-\",VLOOKUP($AA$1,INDUK30014000!$A$6:$RL$1005,460,))","v":"B361"},5]
["Pengembangan diri :"]
["1.","PRAMUKA",null,null,null,{"$f":"IF(VLOOKUP($AA$1,INDUK30014000!$A$6:$RL$1005,134,)=0,\"-\",VLOOKUP($AA$1,INDUK30014000!$A$6:$RL$1005,134,))","v":"B43"},null,{"$f":"IF(VLOOKUP($AA$1,INDUK30014000!$A$6:$RL$1005,135,)=0,\"-\",VLOOKUP($AA$1,INDUK30014000!$A$6:$RL$1005,135,))","v":"B44"},null,{"$f":"IF(VLOOKUP($AA$1,INDUK30014000!$A$6:$RL$1005,191,)=0,\"-\",VLOOKUP($AA$1,INDUK30014000!$A$6:$RL$1005,191,))","v":"B98"},null,{"$f":"IF(VLOOKUP($AA$1,INDUK30014000!$A$6:$RL$1005,192,)=0,\"-\",VLOOKUP($AA$1,INDUK30014000!$A$6:$RL$1005,192,))","v":"B99"},null,{"$f":"IF(VLOOKUP($AA$1,INDUK30014000!$A$6:$RL$1005,248,)=0,\"-\",VLOOKUP($AA$1,INDUK30014000!$A$6:$RL$1005,248,))","v":"B154"},null,{"$f":"IF(VLOOKUP($AA$1,INDUK30014000!$A$6:$RL$1005,249,)=0,\"-\",VLOOKUP($AA$1,INDUK30014000!$A$6:$RL$1005,249,))","v":"B155"},null,{"$f":"IF(VLOOKUP($AA$1,INDUK30014000!$A$6:$RL$1005,305,)=0,\"-\",VLOOKUP($AA$1,INDUK30014000!$A$6:$RL$1005,305,))","v":"B210"},null,{"$f":"IF(VLOOKUP($AA$1,INDUK30014000!$A$6:$RL$1005,306,)=0,\"-\",VLOOKUP($AA$1,INDUK30014000!$A$6:$RL$1005,306,))","v":"B211"},null,{"$f":"IF(VLOOKUP($AA$1,INDUK30014000!$A$6:$RL$1005,362,)=0,\"-\",VLOOKUP($AA$1,INDUK30014000!$A$6:$RL$1005,362,))","v":"B266"},null,{"$f":"IF(VLOOKUP($AA$1,INDUK30014000!$A$6:$RL$1005,363,)=0,\"-\",VLOOKUP($AA$1,INDUK30014000!$A$6:$RL$1005,363,))","v":"B267"},null,{"$f":"IF(VLOOKUP($AA$1,INDUK30014000!$A$6:$RL$1005,419,)=0,\"-\",VLOOKUP($AA$1,INDUK30014000!$A$6:$RL$1005,419,))","v":"B322"},null,{"$f":"IF(VLOOKUP($AA$1,INDUK30014000!$A$6:$RL$1005,420,)=0,\"-\",VLOOKUP($AA$1,INDUK30014000!$A$6:$RL$1005,420,))","v":"B323"},null,null,null,8]
["2.","EKSTRA 1",null,null,null,{"$f":"IF(VLOOKUP($AA$1,INDUK30014000!$A$6:$RL$1005,136,)=0,\"-\",VLOOKUP($AA$1,INDUK30014000!$A$6:$RL$1005,136,))","v":"B45"},null,{"$f":"IF(VLOOKUP($AA$1,INDUK30014000!$A$6:$RL$1005,137,)=0,\"-\",VLOOKUP($AA$1,INDUK30014000!$A$6:$RL$1005,137,))","v":"B46"},null,{"$f":"IF(VLOOKUP($AA$1,INDUK30014000!$A$6:$RL$1005,193,)=0,\"-\",VLOOKUP($AA$1,INDUK30014000!$A$6:$RL$1005,193,))","v":"B100"},null,{"$f":"IF(VLOOKUP($AA$1,INDUK30014000!$A$6:$RL$1005,194,)=0,\"-\",VLOOKUP($AA$1,INDUK30014000!$A$6:$RL$1005,194,))","v":"B101"},null,{"$f":"IF(VLOOKUP($AA$1,INDUK30014000!$A$6:$RL$1005,250,)=0,\"-\",VLOOKUP($AA$1,INDUK30014000!$A$6:$RL$1005,250,))","v":"B156"},null,{"$f":"IF(VLOOKUP($AA$1,INDUK30014000!$A$6:$RL$1005,251,)=0,\"-\",VLOOKUP($AA$1,INDUK30014000!$A$6:$RL$1005,251,))","v":"B157"},null,{"$f":"IF(VLOOKUP($AA$1,INDUK30014000!$A$6:$RL$1005,307,)=0,\"-\",VLOOKUP($AA$1,INDUK30014000!$A$6:$RL$1005,307,))","v":"B212"},null,{"$f":"IF(VLOOKUP($AA$1,INDUK30014000!$A$6:$RL$1005,308,)=0,\"-\",VLOOKUP($AA$1,INDUK30014000!$A$6:$RL$1005,308,))","v":"B213"},null,{"$f":"IF(VLOOKUP($AA$1,INDUK30014000!$A$6:$RL$1005,364,)=0,\"-\",VLOOKUP($AA$1,INDUK30014000!$A$6:$RL$1005,364,))","v":"B268"},null,{"$f":"IF(VLOOKUP($AA$1,INDUK30014000!$A$6:$RL$1005,365,)=0,\"-\",VLOOKUP($AA$1,INDUK30014000!$A$6:$RL$1005,365,))","v":"B269"},null,{"$f":"IF(VLOOKUP($AA$1,INDUK30014000!$A$6:$RL$1005,421,)=0,\"-\",VLOOKUP($AA$1,INDUK30014000!$A$6:$RL$1005,421,))","v":"B324"},null,{"$f":"IF(VLOOKUP($AA$1,INDUK30014000!$A$6:$RL$1005,422,)=0,\"-\",VLOOKUP($AA$1,INDUK30014000!$A$6:$RL$1005,422,))","v":"B325"},null,null,null,9]
["3.","EKSTRA 2",null,null,null,{"$f":"IF(VLOOKUP($AA$1,INDUK30014000!$A$6:$RL$1005,138,)=0,\"-\",VLOOKUP($AA$1,INDUK30014000!$A$6:$RL$1005,138,))","v":"B47"},null,{"$f":"IF(VLOOKUP($AA$1,INDUK30014000!$A$6:$RL$1005,139,)=0,\"-\",VLOOKUP($AA$1,INDUK30014000!$A$6:$RL$1005,139,))","v":"B48"},null,{"$f":"IF(VLOOKUP($AA$1,INDUK30014000!$A$6:$RL$1005,195,)=0,\"-\",VLOOKUP($AA$1,INDUK30014000!$A$6:$RL$1005,195,))","v":"B102"},null,{"$f":"IF(VLOOKUP($AA$1,INDUK30014000!$A$6:$RL$1005,196,)=0,\"-\",VLOOKUP($AA$1,INDUK30014000!$A$6:$RL$1005,196,))","v":"B103"},null,{"$f":"IF(VLOOKUP($AA$1,INDUK30014000!$A$6:$RL$1005,252,)=0,\"-\",VLOOKUP($AA$1,INDUK30014000!$A$6:$RL$1005,252,))","v":"B158"},null,{"$f":"IF(VLOOKUP($AA$1,INDUK30014000!$A$6:$RL$1005,253,)=0,\"-\",VLOOKUP($AA$1,INDUK30014000!$A$6:$RL$1005,253,))","v":"B159"},null,{"$f":"IF(VLOOKUP($AA$1,INDUK30014000!$A$6:$RL$1005,309,)=0,\"-\",VLOOKUP($AA$1,INDUK30014000!$A$6:$RL$1005,309,))","v":"B214"},null,{"$f":"IF(VLOOKUP($AA$1,INDUK30014000!$A$6:$RL$1005,310,)=0,\"-\",VLOOKUP($AA$1,INDUK30014000!$A$6:$RL$1005,310,))","v":"B215"},null,{"$f":"IF(VLOOKUP($AA$1,INDUK30014000!$A$6:$RL$1005,366,)=0,\"-\",VLOOKUP($AA$1,INDUK30014000!$A$6:$RL$1005,366,))","v":"B270"},null,{"$f":"IF(VLOOKUP($AA$1,INDUK30014000!$A$6:$RL$1005,367,)=0,\"-\",VLOOKUP($AA$1,INDUK30014000!$A$6:$RL$1005,367,))","v":"B271"},null,{"$f":"IF(VLOOKUP($AA$1,INDUK30014000!$A$6:$RL$1005,423,)=0,\"-\",VLOOKUP($AA$1,INDUK30014000!$A$6:$RL$1005,423,))","v":"B326"},null,{"$f":"IF(VLOOKUP($AA$1,INDUK30014000!$A$6:$RL$1005,424,)=0,\"-\",VLOOKUP($AA$1,INDUK30014000!$A$6:$RL$1005,424,))","v":"B327"},null,null,null,10]
["Jumlah Nilai",null,null,null,null,{"$f":"IF(VLOOKUP($AA$1,INDUK30014000!$A$6:$RL$1005,122,)=0,\"-\",VLOOKUP($AA$1,INDUK30014000!$A$6:$RL$1005,122,))","v":"B31"},null,{"$f":"IF(VLOOKUP($AA$1,INDUK30014000!$A$6:$RL$1005,123,)=0,\"-\",VLOOKUP($AA$1,INDUK30014000!$A$6:$RL$1005,123,))","v":"B32"},null,{"$f":"IF(VLOOKUP($AA$1,INDUK30014000!$A$6:$RL$1005,179,)=0,\"-\",VLOOKUP($AA$1,INDUK30014000!$A$6:$RL$1005,179,))","v":"B86"},null,{"$f":"IF(VLOOKUP($AA$1,INDUK30014000!$A$6:$RL$1005,180,)=0,\"-\",VLOOKUP($AA$1,INDUK30014000!$A$6:$RL$1005,180,))","v":"B87"},null,{"$f":"IF(VLOOKUP($AA$1,INDUK30014000!$A$6:$RL$1005,236,)=0,\"-\",VLOOKUP($AA$1,INDUK30014000!$A$6:$RL$1005,236,))","v":"B142"},null,{"$f":"IF(VLOOKUP($AA$1,INDUK30014000!$A$6:$RL$1005,237,)=0,\"-\",VLOOKUP($AA$1,INDUK30014000!$A$6:$RL$1005,237,))","v":"B143"},null,{"$f":"IF(VLOOKUP($AA$1,INDUK30014000!$A$6:$RL$1005,293,)=0,\"-\",VLOOKUP($AA$1,INDUK30014000!$A$6:$RL$1005,293,))","v":"B198"},null,{"$f":"IF(VLOOKUP($AA$1,INDUK30014000!$A$6:$RL$1005,294,)=0,\"-\",VLOOKUP($AA$1,INDUK30014000!$A$6:$RL$1005,294,))","v":"B199"},null,{"$f":"IF(VLOOKUP($AA$1,INDUK30014000!$A$6:$RL$1005,350,)=0,\"-\",VLOOKUP($AA$1,INDUK30014000!$A$6:$RL$1005,350,))","v":"B254"},null,{"$f":"IF(VLOOKUP($AA$1,INDUK30014000!$A$6:$RL$1005,351,)=0,\"-\",VLOOKUP($AA$1,INDUK30014000!$A$6:$RL$1005,351,))","v":"B255"},null,{"$f":"IF(VLOOKUP($AA$1,INDUK30014000!$A$6:$RL$1005,407,)=0,\"-\",VLOOKUP($AA$1,INDUK30014000!$A$6:$RL$1005,407,))","v":"B310"},null,{"$f":"IF(VLOOKUP($AA$1,INDUK30014000!$A$6:$RL$1005,408,)=0,\"-\",VLOOKUP($AA$1,INDUK30014000!$A$6:$RL$1005,408,))","v":"B311"},null,null,null,2]
["Rata - Rata",null,null,null,null,{"$f":"IF(VLOOKUP($AA$1,INDUK30014000!$A$6:$RL$1005,124,)=0,\"-\",VLOOKUP($AA$1,INDUK30014000!$A$6:$RL$1005,124,))","v":"B33"},null,{"$f":"IF(VLOOKUP($AA$1,INDUK30014000!$A$6:$RL$1005,125,)=0,\"-\",VLOOKUP($AA$1,INDUK30014000!$A$6:$RL$1005,125,))","v":"B34"},null,{"$f":"IF(VLOOKUP($AA$1,INDUK30014000!$A$6:$RL$1005,181,)=0,\"-\",VLOOKUP($AA$1,INDUK30014000!$A$6:$RL$1005,181,))","v":"B88"},null,{"$f":"IF(VLOOKUP($AA$1,INDUK30014000!$A$6:$RL$1005,182,)=0,\"-\",VLOOKUP($AA$1,INDUK30014000!$A$6:$RL$1005,182,))","v":"B89"},null,{"$f":"IF(VLOOKUP($AA$1,INDUK30014000!$A$6:$RL$1005,238,)=0,\"-\",VLOOKUP($AA$1,INDUK30014000!$A$6:$RL$1005,238,))","v":"B144"},null,{"$f":"IF(VLOOKUP($AA$1,INDUK30014000!$A$6:$RL$1005,239,)=0,\"-\",VLOOKUP($AA$1,INDUK30014000!$A$6:$RL$1005,239,))","v":"B145"},null,{"$f":"IF(VLOOKUP($AA$1,INDUK30014000!$A$6:$RL$1005,295,)=0,\"-\",VLOOKUP($AA$1,INDUK30014000!$A$6:$RL$1005,295,))","v":"B200"},null,{"$f":"IF(VLOOKUP($AA$1,INDUK30014000!$A$6:$RL$1005,296,)=0,\"-\",VLOOKUP($AA$1,INDUK30014000!$A$6:$RL$1005,296,))","v":"B201"},null,{"$f":"IF(VLOOKUP($AA$1,INDUK30014000!$A$6:$RL$1005,352,)=0,\"-\",VLOOKUP($AA$1,INDUK30014000!$A$6:$RL$1005,352,))","v":"B256"},null,{"$f":"IF(VLOOKUP($AA$1,INDUK30014000!$A$6:$RL$1005,353,)=0,\"-\",VLOOKUP($AA$1,INDUK30014000!$A$6:$RL$1005,353,))","v":"B257"},null,{"$f":"IF(VLOOKUP($AA$1,INDUK30014000!$A$6:$RL$1005,409,)=0,\"-\",VLOOKUP($AA$1,INDUK30014000!$A$6:$RL$1005,409,))","v":"B312"},null,{"$f":"IF(VLOOKUP($AA$1,INDUK30014000!$A$6:$RL$1005,410,)=0,\"-\",VLOOKUP($AA$1,INDUK30014000!$A$6:$RL$1005,410,))","v":"B313"},null,null,null,3]
["Peringkat Kelas Ke :",null,null,null,null,{"$f":"IF(VLOOKUP($AA$1,INDUK30014000!$A$6:$RL$1005,126,)=0,\"-\",VLOOKUP($AA$1,INDUK30014000!$A$6:$RL$1005,126,))","v":"B35"},null,{"$f":"IF(VLOOKUP($AA$1,INDUK30014000!$A$6:$RL$1005,127,)=0,\"-\",VLOOKUP($AA$1,INDUK30014000!$A$6:$RL$1005,127,))","v":"B36"},null,{"$f":"IF(VLOOKUP($AA$1,INDUK30014000!$A$6:$RL$1005,183,)=0,\"-\",VLOOKUP($AA$1,INDUK30014000!$A$6:$RL$1005,183,))","v":"B90"},null,{"$f":"IF(VLOOKUP($AA$1,INDUK30014000!$A$6:$RL$1005,184,)=0,\"-\",VLOOKUP($AA$1,INDUK30014000!$A$6:$RL$1005,184,))","v":"B91"},null,{"$f":"IF(VLOOKUP($AA$1,INDUK30014000!$A$6:$RL$1005,240,)=0,\"-\",VLOOKUP($AA$1,INDUK30014000!$A$6:$RL$1005,240,))","v":"B146"},null,{"$f":"IF(VLOOKUP($AA$1,INDUK30014000!$A$6:$RL$1005,241,)=0,\"-\",VLOOKUP($AA$1,INDUK30014000!$A$6:$RL$1005,241,))","v":"B147"},null,{"$f":"IF(VLOOKUP($AA$1,INDUK30014000!$A$6:$RL$1005,297,)=0,\"-\",VLOOKUP($AA$1,INDUK30014000!$A$6:$RL$1005,297,))","v":"B202"},null,{"$f":"IF(VLOOKUP($AA$1,INDUK30014000!$A$6:$RL$1005,298,)=0,\"-\",VLOOKUP($AA$1,INDUK30014000!$A$6:$RL$1005,298,))","v":"B203"},null,{"$f":"IF(VLOOKUP($AA$1,INDUK30014000!$A$6:$RL$1005,354,)=0,\"-\",VLOOKUP($AA$1,INDUK30014000!$A$6:$RL$1005,354,))","v":"B258"},null,{"$f":"IF(VLOOKUP($AA$1,INDUK30014000!$A$6:$RL$1005,355,)=0,\"-\",VLOOKUP($AA$1,INDUK30014000!$A$6:$RL$1005,355,))","v":"B259"},null,{"$f":"IF(VLOOKUP($AA$1,INDUK30014000!$A$6:$RL$1005,411,)=0,\"-\",VLOOKUP($AA$1,INDUK30014000!$A$6:$RL$1005,411,))","v":"B314"},null,{"$f":"IF(VLOOKUP($AA$1,INDUK30014000!$A$6:$RL$1005,412,)=0,\"-\",VLOOKUP($AA$1,INDUK30014000!$A$6:$RL$1005,412,))","v":"B315"},null,null,null,4]
["Perilaku Kepribadian"]
["1.","Kelakuan",null,null,null,{"$f":"IF(VLOOKUP($AA$1,INDUK30014000!$A$6:$RL$1005,140,)=0,\"-\",VLOOKUP($AA$1,INDUK30014000!$A$6:$RL$1005,140,))","v":"B49"},null,{"$f":"IF(VLOOKUP($AA$1,INDUK30014000!$A$6:$RL$1005,141,)=0,\"-\",VLOOKUP($AA$1,INDUK30014000!$A$6:$RL$1005,141,))","v":"B50"},null,{"$f":"IF(VLOOKUP($AA$1,INDUK30014000!$A$6:$RL$1005,197,)=0,\"-\",VLOOKUP($AA$1,INDUK30014000!$A$6:$RL$1005,197,))","v":"B104"},null,{"$f":"IF(VLOOKUP($AA$1,INDUK30014000!$A$6:$RL$1005,198,)=0,\"-\",VLOOKUP($AA$1,INDUK30014000!$A$6:$RL$1005,198,))","v":"B105"},null,{"$f":"IF(VLOOKUP($AA$1,INDUK30014000!$A$6:$RL$1005,254,)=0,\"-\",VLOOKUP($AA$1,INDUK30014000!$A$6:$RL$1005,254,))","v":"B160"},null,{"$f":"IF(VLOOKUP($AA$1,INDUK30014000!$A$6:$RL$1005,255,)=0,\"-\",VLOOKUP($AA$1,INDUK30014000!$A$6:$RL$1005,255,))","v":"B161"},null,{"$f":"IF(VLOOKUP($AA$1,INDUK30014000!$A$6:$RL$1005,311,)=0,\"-\",VLOOKUP($AA$1,INDUK30014000!$A$6:$RL$1005,311,))","v":"B216"},null,{"$f":"IF(VLOOKUP($AA$1,INDUK30014000!$A$6:$RL$1005,312,)=0,\"-\",VLOOKUP($AA$1,INDUK30014000!$A$6:$RL$1005,312,))","v":"B217"},null,{"$f":"IF(VLOOKUP($AA$1,INDUK30014000!$A$6:$RL$1005,368,)=0,\"-\",VLOOKUP($AA$1,INDUK30014000!$A$6:$RL$1005,368,))","v":"B272"},null,{"$f":"IF(VLOOKUP($AA$1,INDUK30014000!$A$6:$RL$1005,369,)=0,\"-\",VLOOKUP($AA$1,INDUK30014000!$A$6:$RL$1005,369,))","v":"B273"},null,{"$f":"IF(VLOOKUP($AA$1,INDUK30014000!$A$6:$RL$1005,425,)=0,\"-\",VLOOKUP($AA$1,INDUK30014000!$A$6:$RL$1005,425,))","v":"B328"},null,{"$f":"IF(VLOOKUP($AA$1,INDUK30014000!$A$6:$RL$1005,426,)=0,\"-\",VLOOKUP($AA$1,INDUK30014000!$A$6:$RL$1005,426,))","v":"B329"},null,null,null,11]
["2.","Kerajinan",null,null,null,{"$f":"IF(VLOOKUP($AA$1,INDUK30014000!$A$6:$RL$1005,142,)=0,\"-\",VLOOKUP($AA$1,INDUK30014000!$A$6:$RL$1005,142,))","v":"B51"},null,{"$f":"IF(VLOOKUP($AA$1,INDUK30014000!$A$6:$RL$1005,143,)=0,\"-\",VLOOKUP($AA$1,INDUK30014000!$A$6:$RL$1005,143,))","v":"B52"},null,{"$f":"IF(VLOOKUP($AA$1,INDUK30014000!$A$6:$RL$1005,199,)=0,\"-\",VLOOKUP($AA$1,INDUK30014000!$A$6:$RL$1005,199,))","v":"B106"},null,{"$f":"IF(VLOOKUP($AA$1,INDUK30014000!$A$6:$RL$1005,200,)=0,\"-\",VLOOKUP($AA$1,INDUK30014000!$A$6:$RL$1005,200,))","v":"B107"},null,{"$f":"IF(VLOOKUP($AA$1,INDUK30014000!$A$6:$RL$1005,256,)=0,\"-\",VLOOKUP($AA$1,INDUK30014000!$A$6:$RL$1005,256,))","v":"B162"},null,{"$f":"IF(VLOOKUP($AA$1,INDUK30014000!$A$6:$RL$1005,257,)=0,\"-\",VLOOKUP($AA$1,INDUK30014000!$A$6:$RL$1005,257,))","v":"B163"},null,{"$f":"IF(VLOOKUP($AA$1,INDUK30014000!$A$6:$RL$1005,313,)=0,\"-\",VLOOKUP($AA$1,INDUK30014000!$A$6:$RL$1005,313,))","v":"B218"},null,{"$f":"IF(VLOOKUP($AA$1,INDUK30014000!$A$6:$RL$1005,314,)=0,\"-\",VLOOKUP($AA$1,INDUK30014000!$A$6:$RL$1005,314,))","v":"B219"},null,{"$f":"IF(VLOOKUP($AA$1,INDUK30014000!$A$6:$RL$1005,370,)=0,\"-\",VLOOKUP($AA$1,INDUK30014000!$A$6:$RL$1005,370,))","v":"B274"},null,{"$f":"IF(VLOOKUP($AA$1,INDUK30014000!$A$6:$RL$1005,371,)=0,\"-\",VLOOKUP($AA$1,INDUK30014000!$A$6:$RL$1005,371,))","v":"B275"},null,{"$f":"IF(VLOOKUP($AA$1,INDUK30014000!$A$6:$RL$1005,427,)=0,\"-\",VLOOKUP($AA$1,INDUK30014000!$A$6:$RL$1005,427,))","v":"B330"},null,{"$f":"IF(VLOOKUP($AA$1,INDUK30014000!$A$6:$RL$1005,428,)=0,\"-\",VLOOKUP($AA$1,INDUK30014000!$A$6:$RL$1005,428,))","v":"B331"},null,null,null,12]
["3.","Kebersihan dan Kerapian",null,null,null,{"$f":"IF(VLOOKUP($AA$1,INDUK30014000!$A$6:$RL$1005,144,)=0,\"-\",VLOOKUP($AA$1,INDUK30014000!$A$6:$RL$1005,144,))","v":"B53"},null,{"$f":"IF(VLOOKUP($AA$1,INDUK30014000!$A$6:$RL$1005,145,)=0,\"-\",VLOOKUP($AA$1,INDUK30014000!$A$6:$RL$1005,145,))","v":"B54"},null,{"$f":"IF(VLOOKUP($AA$1,INDUK30014000!$A$6:$RL$1005,201,)=0,\"-\",VLOOKUP($AA$1,INDUK30014000!$A$6:$RL$1005,201,))","v":"B108"},null,{"$f":"IF(VLOOKUP($AA$1,INDUK30014000!$A$6:$RL$1005,202,)=0,\"-\",VLOOKUP($AA$1,INDUK30014000!$A$6:$RL$1005,202,))","v":"B109"},null,{"$f":"IF(VLOOKUP($AA$1,INDUK30014000!$A$6:$RL$1005,258,)=0,\"-\",VLOOKUP($AA$1,INDUK30014000!$A$6:$RL$1005,258,))","v":"B164"},null,{"$f":"IF(VLOOKUP($AA$1,INDUK30014000!$A$6:$RL$1005,259,)=0,\"-\",VLOOKUP($AA$1,INDUK30014000!$A$6:$RL$1005,259,))","v":"B165"},null,{"$f":"IF(VLOOKUP($AA$1,INDUK30014000!$A$6:$RL$1005,315,)=0,\"-\",VLOOKUP($AA$1,INDUK30014000!$A$6:$RL$1005,315,))","v":"B220"},null,{"$f":"IF(VLOOKUP($AA$1,INDUK30014000!$A$6:$RL$1005,316,)=0,\"-\",VLOOKUP($AA$1,INDUK30014000!$A$6:$RL$1005,316,))","v":"B221"},null,{"$f":"IF(VLOOKUP($AA$1,INDUK30014000!$A$6:$RL$1005,372,)=0,\"-\",VLOOKUP($AA$1,INDUK30014000!$A$6:$RL$1005,372,))","v":"B276"},null,{"$f":"IF(VLOOKUP($AA$1,INDUK30014000!$A$6:$RL$1005,373,)=0,\"-\",VLOOKUP($AA$1,INDUK30014000!$A$6:$RL$1005,373,))","v":"B277"},null,{"$f":"IF(VLOOKUP($AA$1,INDUK30014000!$A$6:$RL$1005,429,)=0,\"-\",VLOOKUP($AA$1,INDUK30014000!$A$6:$RL$1005,429,))","v":"B332"},null,{"$f":"IF(VLOOKUP($AA$1,INDUK30014000!$A$6:$RL$1005,430,)=0,\"-\",VLOOKUP($AA$1,INDUK30014000!$A$6:$RL$1005,430,))","v":"B333"},null,null,null,13]
["Ketidakhadiran"]
["1.","Sakit",null,null,"( Hari )",{"$f":"IF(VLOOKUP($AA$1,INDUK30014000!$A$6:$RL$1005,128,)=0,\"-\",VLOOKUP($AA$1,INDUK30014000!$A$6:$RL$1005,128,))","v":"B37"},null,{"$f":"IF(VLOOKUP($AA$1,INDUK30014000!$A$6:$RL$1005,129,)=0,\"-\",VLOOKUP($AA$1,INDUK30014000!$A$6:$RL$1005,129,))","v":"B38"},null,{"$f":"IF(VLOOKUP($AA$1,INDUK30014000!$A$6:$RL$1005,185,)=0,\"-\",VLOOKUP($AA$1,INDUK30014000!$A$6:$RL$1005,185,))","v":"B92"},null,{"$f":"IF(VLOOKUP($AA$1,INDUK30014000!$A$6:$RL$1005,186,)=0,\"-\",VLOOKUP($AA$1,INDUK30014000!$A$6:$RL$1005,186,))","v":"B93"},null,{"$f":"IF(VLOOKUP($AA$1,INDUK30014000!$A$6:$RL$1005,242,)=0,\"-\",VLOOKUP($AA$1,INDUK30014000!$A$6:$RL$1005,242,))","v":"B148"},null,{"$f":"IF(VLOOKUP($AA$1,INDUK30014000!$A$6:$RL$1005,243,)=0,\"-\",VLOOKUP($AA$1,INDUK30014000!$A$6:$RL$1005,243,))","v":"B149"},null,{"$f":"IF(VLOOKUP($AA$1,INDUK30014000!$A$6:$RL$1005,299,)=0,\"-\",VLOOKUP($AA$1,INDUK30014000!$A$6:$RL$1005,299,))","v":"B204"},null,{"$f":"IF(VLOOKUP($AA$1,INDUK30014000!$A$6:$RL$1005,300,)=0,\"-\",VLOOKUP($AA$1,INDUK30014000!$A$6:$RL$1005,300,))","v":"B205"},null,{"$f":"IF(VLOOKUP($AA$1,INDUK30014000!$A$6:$RL$1005,356,)=0,\"-\",VLOOKUP($AA$1,INDUK30014000!$A$6:$RL$1005,356,))","v":"B260"},null,{"$f":"IF(VLOOKUP($AA$1,INDUK30014000!$A$6:$RL$1005,357,)=0,\"-\",VLOOKUP($AA$1,INDUK30014000!$A$6:$RL$1005,357,))","v":"B261"},null,{"$f":"IF(VLOOKUP($AA$1,INDUK30014000!$A$6:$RL$1005,413,)=0,\"-\",VLOOKUP($AA$1,INDUK30014000!$A$6:$RL$1005,413,))","v":"B316"},null,{"$f":"IF(VLOOKUP($AA$1,INDUK30014000!$A$6:$RL$1005,414,)=0,\"-\",VLOOKUP($AA$1,INDUK30014000!$A$6:$RL$1005,414,))","v":"B317"},null,"Catatan :",null,5]
["2.","Izin",null,null,"( Hari )",{"$f":"IF(VLOOKUP($AA$1,INDUK30014000!$A$6:$RL$1005,130,)=0,\"-\",VLOOKUP($AA$1,INDUK30014000!$A$6:$RL$1005,130,))","v":"B39"},null,{"$f":"IF(VLOOKUP($AA$1,INDUK30014000!$A$6:$RL$1005,131,)=0,\"-\",VLOOKUP($AA$1,INDUK30014000!$A$6:$RL$1005,131,))","v":"B40"},null,{"$f":"IF(VLOOKUP($AA$1,INDUK30014000!$A$6:$RL$1005,187,)=0,\"-\",VLOOKUP($AA$1,INDUK30014000!$A$6:$RL$1005,187,))","v":"B94"},null,{"$f":"IF(VLOOKUP($AA$1,INDUK30014000!$A$6:$RL$1005,188,)=0,\"-\",VLOOKUP($AA$1,INDUK30014000!$A$6:$RL$1005,188,))","v":"B95"},null,{"$f":"IF(VLOOKUP($AA$1,INDUK30014000!$A$6:$RL$1005,244,)=0,\"-\",VLOOKUP($AA$1,INDUK30014000!$A$6:$RL$1005,244,))","v":"B150"},null,{"$f":"IF(VLOOKUP($AA$1,INDUK30014000!$A$6:$RL$1005,245,)=0,\"-\",VLOOKUP($AA$1,INDUK30014000!$A$6:$RL$1005,245,))","v":"B151"},null,{"$f":"IF(VLOOKUP($AA$1,INDUK30014000!$A$6:$RL$1005,301,)=0,\"-\",VLOOKUP($AA$1,INDUK30014000!$A$6:$RL$1005,301,))","v":"B206"},null,{"$f":"IF(VLOOKUP($AA$1,INDUK30014000!$A$6:$RL$1005,302,)=0,\"-\",VLOOKUP($AA$1,INDUK30014000!$A$6:$RL$1005,302,))","v":"B207"},null,{"$f":"IF(VLOOKUP($AA$1,INDUK30014000!$A$6:$RL$1005,358,)=0,\"-\",VLOOKUP($AA$1,INDUK30014000!$A$6:$RL$1005,358,))","v":"B262"},null,{"$f":"IF(VLOOKUP($AA$1,INDUK30014000!$A$6:$RL$1005,359,)=0,\"-\",VLOOKUP($AA$1,INDUK30014000!$A$6:$RL$1005,359,))","v":"B263"},null,{"$f":"IF(VLOOKUP($AA$1,INDUK30014000!$A$6:$RL$1005,415,)=0,\"-\",VLOOKUP($AA$1,INDUK30014000!$A$6:$RL$1005,415,))","v":"B318"},null,{"$f":"IF(VLOOKUP($AA$1,INDUK30014000!$A$6:$RL$1005,416,)=0,\"-\",VLOOKUP($AA$1,INDUK30014000!$A$6:$RL$1005,416,))","v":"B319"},null,null,null,6]
["3.","Tanpa Keterangan",null,null,"( Hari )",{"$f":"IF(VLOOKUP($AA$1,INDUK30014000!$A$6:$RL$1005,132,)=0,\"-\",VLOOKUP($AA$1,INDUK30014000!$A$6:$RL$1005,132,))","v":"B41"},null,{"$f":"IF(VLOOKUP($AA$1,INDUK30014000!$A$6:$RL$1005,133,)=0,\"-\",VLOOKUP($AA$1,INDUK30014000!$A$6:$RL$1005,133,))","v":"B42"},null,{"$f":"IF(VLOOKUP($AA$1,INDUK30014000!$A$6:$RL$1005,189,)=0,\"-\",VLOOKUP($AA$1,INDUK30014000!$A$6:$RL$1005,189,))","v":"B96"},null,{"$f":"IF(VLOOKUP($AA$1,INDUK30014000!$A$6:$RL$1005,190,)=0,\"-\",VLOOKUP($AA$1,INDUK30014000!$A$6:$RL$1005,190,))","v":"B97"},null,{"$f":"IF(VLOOKUP($AA$1,INDUK30014000!$A$6:$RL$1005,246,)=0,\"-\",VLOOKUP($AA$1,INDUK30014000!$A$6:$RL$1005,246,))","v":"B152"},null,{"$f":"IF(VLOOKUP($AA$1,INDUK30014000!$A$6:$RL$1005,247,)=0,\"-\",VLOOKUP($AA$1,INDUK30014000!$A$6:$RL$1005,247,))","v":"B153"},null,{"$f":"IF(VLOOKUP($AA$1,INDUK30014000!$A$6:$RL$1005,303,)=0,\"-\",VLOOKUP($AA$1,INDUK30014000!$A$6:$RL$1005,303,))","v":"B208"},null,{"$f":"IF(VLOOKUP($AA$1,INDUK30014000!$A$6:$RL$1005,304,)=0,\"-\",VLOOKUP($AA$1,INDUK30014000!$A$6:$RL$1005,304,))","v":"B209"},null,{"$f":"IF(VLOOKUP($AA$1,INDUK30014000!$A$6:$RL$1005,360,)=0,\"-\",VLOOKUP($AA$1,INDUK30014000!$A$6:$RL$1005,360,))","v":"B264"},null,{"$f":"IF(VLOOKUP($AA$1,INDUK30014000!$A$6:$RL$1005,361,)=0,\"-\",VLOOKUP($AA$1,INDUK30014000!$A$6:$RL$1005,361,))","v":"B265"},null,{"$f":"IF(VLOOKUP($AA$1,INDUK30014000!$A$6:$RL$1005,417,)=0,\"-\",VLOOKUP($AA$1,INDUK30014000!$A$6:$RL$1005,417,))","v":"B320"},null,{"$f":"IF(VLOOKUP($AA$1,INDUK30014000!$A$6:$RL$1005,418,)=0,\"-\",VLOOKUP($AA$1,INDUK30014000!$A$6:$RL$1005,418,))","v":"B321"},null,null,null,7]
["NAIK / TIDAK NAIK KELAS",null,null,null,null,{"$f":"IF(VLOOKUP($AA$1,INDUK30014000!$A$6:$RL$1005,146,)=0,\"-\",VLOOKUP($AA$1,INDUK30014000!$A$6:$RL$1005,146,))","v":"B55"},null,null,null,{"$f":"IF(VLOOKUP($AA$1,INDUK30014000!$A$6:$RL$1005,203,)=0,\"-\",VLOOKUP($AA$1,INDUK30014000!$A$6:$RL$1005,203,))","v":"B110"},null,null,null,{"$f":"IF(VLOOKUP($AA$1,INDUK30014000!$A$6:$RL$1005,260,)=0,\"-\",VLOOKUP($AA$1,INDUK30014000!$A$6:$RL$1005,260,))","v":"B166"},null,null,null,{"$f":"IF(VLOOKUP($AA$1,INDUK30014000!$A$6:$RL$1005,317,)=0,\"-\",VLOOKUP($AA$1,INDUK30014000!$A$6:$RL$1005,317,))","v":"B222"},null,null,null,{"$f":"IF(VLOOKUP($AA$1,INDUK30014000!$A$6:$RL$1005,374,)=0,\"-\",VLOOKUP($AA$1,INDUK30014000!$A$6:$RL$1005,374,))","v":"B278"},null,null,null,{"$f":"IF(VLOOKUP($AA$1,INDUK30014000!$A$6:$RL$1005,431,)=0,\"-\",VLOOKUP($AA$1,INDUK30014000!$A$6:$RL$1005,431,))","v":"LOELOES"},null,null,null,null,null,14]
["VI.","STTB / IJAZAH :"]
[null,"21.","Nomor :",{"$f":"IF(VLOOKUP($AA$1,INDUK30014000!$A$6:$RL$1005,434,)=0,\"-\",VLOOKUP($AA$1,INDUK30014000!$A$6:$RL$1005,434,))","v":"B336"},null,null,null,null,null,null,null,null,null,"Tempat",null,null,{"$f":"IF(VLOOKUP($AA$1,INDUK30014000!$A$6:$RL$1005,435,)=0,\"-\",VLOOKUP($AA$1,INDUK30014000!$A$6:$RL$1005,435,))","v":"B337"},null,null,null,null,null,"22. Diberikan Tanggal :",null,null,null,null,null,{"$f":"IF(VLOOKUP($AA$1,INDUK30014000!$A$6:$RL$1005,436,)=0,\"-\",VLOOKUP($AA$1,INDUK30014000!$A$6:$RL$1005,436,))","v":"B338"}]
["VII.","PENGHARGAAN"]
[null,"23.","Piagam Penghargaan yang pernah diterima :"]
[]
[null,null,"a. Bidang",{"$f":"IF(VLOOKUP($AA$1,INDUK30014000!$A$6:$RL$105,437,)=0,\"-\",VLOOKUP($AA$1,INDUK30014000!$A$6:$RL$105,437,))","v":"B339"},null,null,null,null,null,null,null,null,null,"Nomor",null,":",{"$f":"IF(VLOOKUP($AA$1,INDUK30014000!$A$6:$RL$105,438,)=0,\"-\",VLOOKUP($AA$1,INDUK30014000!$A$6:$RL$105,438,))","v":"B340"},null,null,null,null,null,null,null,"Tanggal",null,":",{"$f":"IF(VLOOKUP($AA$1,INDUK30014000!$A$6:$RL$105,439,)=0,\"-\",VLOOKUP($AA$1,INDUK30014000!$A$6:$RL$105,439,))","v":"B341"}]
[]
[null,null,"b. Bidang",{"$f":"IF(VLOOKUP($AA$1,INDUK30014000!$A$6:$RL$105,440,)=0,\"-\",VLOOKUP($AA$1,INDUK30014000!$A$6:$RL$105,440,))","v":"B342"},null,null,null,null,null,null,null,null,null,"Nomor",null,":",{"$f":"IF(VLOOKUP($AA$1,INDUK30014000!$A$6:$RL$105,441,)=0,\"-\",VLOOKUP($AA$1,INDUK30014000!$A$6:$RL$105,441,))","v":"B343"},null,null,null,null,null,null,null,"Tanggal",null,":",{"$f":"IF(VLOOKUP($AA$1,INDUK30014000!$A$6:$RL$105,442,)=0,\"-\",VLOOKUP($AA$1,INDUK30014000!$A$6:$RL$105,442,))","v":"B344"}]
[]
["VIII. ","KETERANGAN"]
[null,"24.","Surat Keterangan yang pernah diberikan oleh Madrasah ini :"]
[]
[null,null,"a. Tentang",":",{"$f":"IF(VLOOKUP($AA$1,INDUK30014000!$A$6:$RL$105,443,)=0,\"-\",VLOOKUP($AA$1,INDUK30014000!$A$6:$RL$105,443,))","v":"B345"},null,null,null,null,null,null,null,null,"Nomor",null,":",{"$f":"IF(VLOOKUP($AA$1,INDUK30014000!$A$6:$RL$105,444,)=0,\"-\",VLOOKUP($AA$1,INDUK30014000!$A$6:$RL$105,444,))","v":"B346"},null,null,null,null,null,null,null,"Tanggal",null,":",{"$f":"IF(VLOOKUP($AA$1,INDUK30014000!$A$6:$RL$105,445,)=0,\"-\",VLOOKUP($AA$1,INDUK30014000!$A$6:$RL$105,445,))","v":"B347"}]
[]
[null,null,"b. Tentang",":",{"$f":"IF(VLOOKUP($AA$1,INDUK30014000!$A$6:$RL$105,446,)=0,\"-\",VLOOKUP($AA$1,INDUK30014000!$A$6:$RL$105,446,))","v":"B348"},null,null,null,null,null,null,null,null,"Nomor",null,":",{"$f":"IF(VLOOKUP($AA$1,INDUK30014000!$A$6:$RL$105,447,)=0,\"-\",VLOOKUP($AA$1,INDUK30014000!$A$6:$RL$105,447,))","v":"B349"},null,null,null,null,null,null,null,"Tanggal",null,":",{"$f":"IF(VLOOKUP($AA$1,INDUK30014000!$A$6:$RL$105,448,)=0,\"-\",VLOOKUP($AA$1,INDUK30014000!$A$6:$RL$105,448,))","v":"B350"}]

{"sheet":"INDUK40015000","index":3,"n_rows":1005,"n_cols":480,"rows_kept":1005,"cut":false,"hidden":false,"merged":[[1,0,2,0],[1,1,2,1],[1,2,2,2],[1,3,2,3],[1,4,2,4],[1,5,2,5],[1,12,1,14],[1,15,2,15],[1,16,1,19],[1,20,2,20],[1,21,2,21],[1,22,2,22],[1,6,2,6],[1,7,2,7],[1,8,2,8],[1,9,2,9],[1,10,2,10],[1,11,2,11],[1,40,1,42],[1,43,2,43],[1,44,2,44],[1,45,1,48],[1,49,2,49],[1,50,1,53],[1,23,2,23],[1,25,1,26],[1,27,1,28],[1,29,1,30],[1,31,1,34],[1,36,1,39],[1,69,2,69],[1,70,1,73],[1,74,2,74],[1,75,1,78],[1,79,2,79],[1,80,1,81],[1,54,2,54],[1,55,1,58],[1,59,2,59],[1,60,1,63],[1,64,2,64],[1,65,1,68],[1,82,2,82],[1,83,1,86],[1,91,1,146],[1,148,1,203],[1,205,1,260],[1,262,1,317],[2,109,2,110],[2,111,2,112],[2,113,2,114],[2,115,2,116],[2,117,2,118],[2,119,2,120],[2,121,2,122],[2,123,2,124],[2,125,2,126],[2,127,2,128],[2,133,2,134],[2,135,2,136],[2,137,2,138],[2,139,2,140],[2,168,2,169],[2,170,2,171],[2,172,2,173],[2,174,2,175],[1,446,1,448],[2,91,2,92],[2,93,2,94],[2,95,2,96],[2,97,2,98],[2,99,2,100],[2,101,2,102],[2,103,2,104],[2,105,2,106],[2,107,2,108],[1,319,1,374],[1,376,1,431],[1,433,1,435],[1,436,1,438],[1,439,1,441],[1,442,1,444],[2,141,2,142],[2,143,2,144],[2,148,2,149],[2,150,2,151],[2,152,2,153],[2,154,2,155],[2,129,2,130],[2,131,2,132],[2,176,2,177],[2,178,2,179],[2,156,2,157],[2,158,2,159],[2,160,2,161],[2,162,2,163],[2,164,2,165],[2,166,2,167],[2,192,2,193],[2,194,2,195],[2,196,2,197],[2,198,2,199],[2,200,2,201],[2,205,2,206],[2,180,2,181],[2,182,2,183],[2,184,2,185],[2,186,2,187],[2,188,2,189],[2,190,2,191],[2,219,2,220],[2,221,2,222],[2,223,2,224],[2,225,2,226],[2,227,2,228],[2,229,2,230],[2,207,2,208],[2,209,2,210],[2,211,2,212],[2,213,2,214],[2,215,2,216],[2,217,2,218],[2,243,2,244],[2,245,2,246],[2,247,2,248],[2,249,2,250],[2,251,2,252],[2,253,2,254],[2,231,2,232],[2,233,2,234],[2,235,2,236],[2,237,2,238],[2,239,2,240],[2,241,2,242],[2,270,2,271],[2,272,2,273],[2,274,2,275],[2,276,2,277],[2,278,2,279],[2,280,2,281],[2,255,2,256],[2,257,2,258],[2,262,2,263],[2,264,2,265],[2,266,2,267],[2,268,2,269],[2,294,2,295],[2,296,2,297],[2,298,2,299],[2,300,2,301],[2,302,2,303],[2,304,2,305],[2,282,2,283],[2,284,2,285],[2,286,2,287],[2,288,2,289],[2,290,2,291],[2,292,2,293],[2,321,2,322],[2,323,2,324],[2,325,2,326],[2,327,2,328],[2,329,2,330],[2,331,2,332],[2,306,2,307],[2,308,2,309],[2,310,2,311],[2,312,2,313],[2,314,2,315],[2,319,2,320],[2,345,2,346],[2,347,2,348],[2,349,2,350],[2,351,2,352],[2,353,2,354],[2,355,2,356],[2,333,2,334],[2,335,2,336],[2,337,2,338],[2,339,2,340],[2,341,2,342],[2,343,2,344],[2,369,2,370],[2,371,2,372],[2,376,2,377],[2,378,2,379],[2,380,2,381],[2,382,2,383],[2,357,2,358],[2,359,2,360],[2,361,2,362],[2,363,2,364],[2,365,2,366],[2,367,2,368],[2,396,2,397],[2,398,2,399],[2,400,2,401],[2,402,2,403],[2,404,2,405],[2,406,2,407],[2,384,2,385],[2,386,2,387],[2,388,2,389],[2,390,2,391],[2,392,2,393],[2,394,2,395],[2,420,2,421],[2,422,2,423],[2,424,2,425],[2,426,2,427],[2,428,2,429],[2,450,2,451],[2,408,2,409],[2,410,2,411],[2,412,2,413],[2,414,2,415],[2,416,2,417],[2,418,2,419],[2,476,2,477],[2,478,2,479],[1,450,1,479],[2,464,2,465],[2,466,2,467],[2,468,2,469],[2,470,2,471],[2,472,2,473],[2,474,2,475],[2,452,2,453],[2,454,2,455],[2,456,2,457],[2,458,2,459],[2,460,2,461],[2,462,2,463]]}
[1,2,3,4,5,6,7,8,9,10,11,12,13,14,15,16,17,18,19,20,21,22,23,24,25,26,27,28,29,30,31,32,33,34,35,36,37,38,39,40,41,42,43,44,45,46,47,48,49,50,51,52,53,54,55,56,57,58,59,60,61,62,63,64,65,66,67,68,69,70,71,72,73,74,75,76,77,78,79,80,81,82,83,84,85,86,87,88,89,90,91,92,93,94,95,96,97,98,99,100,101,102,103,104,105,106,107,108,109,110,111,112,113,114,115,116,117,118,119,120,121,122,123,124,125,126,127,128,129,130,131,132,133,134,135,136,137,138,139,140,141,142,143,144,145,146,147,148,149,150,151,152,153,154,155,156,157,158,159,160,161,162,163,164,165,166,167,168,169,170,171,172,173,174,175,176,177,178,179,180,181,182,183,184,185,186,187,188,189,190,191,192,193,194,195,196,197,198,199,200,201,202,203,204,205,206,207,208,209,210,211,212,213,214,215,216,217,218,219,220,221,222,223,224,225,226,227,228,229,230,231,232,233,234,235,236,237,238,239,240,241,242,243,244,245,246,247,248,249,250,251,252,253,254,255,256,257,258,259,260,261,262,263,264,265,266,267,268,269,270,271,272,273,274,275,276,277,278,279,280,281,282,283,284,285,286,287,288,289,290,291,292,293,294,295,296,297,298,299,300,301,302,303,304,305,306,307,308,309,310,311,312,313,314,315,316,317,318,319,320,321,322,323,324,325,326,327,328,329,330,331,332,333,334,335,336,337,338,339,340,341,342,343,344,345,346,347,348,349,350,351,352,353,354,355,356,357,358,359,360,361,362,363,364,365,366,367,368,369,370,371,372,373,374,375,376,377,378,379,380,381,382,383,384,385,386,387,388,389,390,391,392,393,394,395,396,397,398,399,400,401,402,403,404,405,406,407,408,409,410,411,412,413,414,415,416,417,418,419,420,421,422,423,424,425,426,427,428,429,430,431,432,433,434,435,436,437,438,439,440,441,442,443,444,445,446,447,448,449,450,451,452,453,454,455,456,457,458,459,460,461,462,463,464,465,466,467,468,469,470,471,472,473,474,475,476,477,478,479,480]
["Induk","Nama Murid","Nama Orang Tua","Kls.","Tgl Masuk","Tgl Keluar","Nama Panggilan",{"$f":"\"L/P\"","v":"L/P"},"Tanggal Lahir","Tempat Lahir","Agama","Kewarganegaraan","Jumlah saudara",null,null,"Bahasa Sehari-hari keluarga","Keadaan Jasmani",null,null,null,"alamat dan no. telp","tempat tinggal pada (ortu/numpang/asramah)","Jarak Tempat Tinggal","tahun masuk sekolah ini",null,"Nama Orang tua",null,"pendidikan Tertinggi",null,"Pekerjaan",null,"Wali (jika ada)",null,null,null,null,"Masuk menjadi murid tingkat 1",null,null,null,"pindahan jika dari sekolah lain",null,null,"Prestasi Belajar","MASUKKAN TAHUN",null,null,null,null,2018,null,null,null,null,2019,null,null,null,null,2020,null,null,null,null,2021,null,null,null,null,2022,null,null,null,null,2023,null,null,null,null,"Beasiswa","Tahun Tamat",null,"Melanjutkan Ke","Mutasi Masuk Madrasah",null,null,null,"Mutasi Keluar Madrasah",null,null,null,"KELAS 1",null,null,null,null,null,null,null,null,null,null,null,null,null,null,null,null,null,null,null,null,null,null,null,null,null,null,null,null,null,null,null,null,null,null,null,null,null,null,null,null,null,null,null,null,null,null,null,null,null,null,null,null,null,null,null,null,"KELAS 2",null,null,null,null,null,null,null,null,null,null,null,null,null,null,null,null,null,null,null,null,null,null,null,null,null,null,null,null,null,null,null,null,null,null,null,null,null,null,null,null,null,null,null,null,null,null,null,null,null,null,null,null,null,null,null,null,"KELAS 3",null,null,null,null,null,null,null,null,null,null,null,null,null,null,null,null,null,null,null,null,null,null,null,null,null,null,null,null,null,null,null,null,null,null,null,null,null,null,null,null,null,null,null,null,null,null,null,null,null,null,null,null,null,null,null,null,"KELAS 4",null,null,null,null,null,null,null,null,null,null,null,null,null,null,null,null,null,null,null,null,null,null,null,null,null,null,null,null,null,null,null,null,null,null,null,null,null,null,null,null,null,null,null,null,null,null,null,null,null,null,null,null,null,null,null,null,"KELAS 5",null,null,null,null,null,null,null,null,null,null,null,null,null,null,null,null,null,null,null,null,null,null,null,null,null,null,null,null,null,null,null,null,null,null,null,null,null,null,null,null,null,null,null,null,null,null,null,null,null,null,null,null,null,null,null,null,"KELAS 6",null,null,null,null,null,null,null,null,null,null,null,null,null,null,null,null,null,null,null,null,null,null,null,null,null,null,null,null,null,null,null,null,null,null,null,null,null,null,null,null,null,null,null,null,null,null,null,null,null,null,null,null,null,null,null,null,"LULUSAN",null,null,"PENGHARGAAN 1",null,null,"PENGHARGAAN 2",null,null,"KETERANGAN",null,null,null,"KETERANGAN",null,null,null,"NILAI IJAZAH"]
[null,null,null,null,null,null,null,null,null,null,null,null,"Kandung","Tiri","Angkat",null,"Berat badan","tinggi badan","gol.darah","penyakit berat",null,null,null,null,null,"Ayah","Ibu","Ayah","Ibu","Ayah","Ibu","Nama","hub.keluarga","Pendidikan","Pekerjaan",null,"asal TK/RA","nama RA/TK","Alamat","Tanggal dan No.STTB","Nama Sekolah","dari Tingkat","diterima Tanggal",null,null,"Kg","Cm","Penyakit","Kelainan",null,"Kg","Cm","Penyakit","Kelainan",null,"Kg","Cm","Penyakit","Kelainan",null,"Kg","Cm","Penyakit","Kelainan",null,"Kg","Cm","Penyakit","Kelainan",null,"Kg","Cm","Penyakit","Kelainan",null,"Kg","Cm","Penyakit","Kelainan",null,"Tahun","No. STTB",null,"Dari Tingkat","Ke Sekolah","Ke Tingkat","Tanggal","Tanggal","Alasan",null,null,"QH 1",null,"AA 1",null,"FQ 1",null,"SKI 1",null,"AWJ 1",null,"BA1",null,"PKN 1",null,"BID 1",null,"MTK 1",null,"IPA 1",null,"IPS 1",null,"SBK 1",null,"PJO 1",null,"BD 1",null,"BIG 1",null,"JML NILAI",null,"RATA - RATA",null,"PE RINGKAT",null,"SAKIT",null,"IJIN",null,"ALPA",null,"EKSKUL PRAMUKA",null,"EKSKUL 1",null,"EKSKUL 2",null,"KE-LAKU-AN",null,"KE-RAJINAN",null,"KE-BERSIHAN",null,"NAIK/ TIDAK NAIK","TAHUN PLJARAN",null,"QH 2",null,"AA 2",null,"FQ 2",null,"SKI 2",null,"AWJ 2",null,"BA2",null,"PKN 2",null,"BID 2",null,"MTK 2",null,"IPA 2",null,"IPS 2",null,"SBK 2",null,"PJO 2",null,"BD 2",null,"BIG 2",null,"JML NILAI",null,"RATA - RATA",null,"PE RINGKAT",null,"SAKIT",null,"IJIN",null,"ALPA",null,"EKSKUL PRAMUKA",null,"EKSKUL 1",null,"EKSKUL 2",null,"KE-LAKU-AN",null,"KE-RAJINAN",null,"KE-BERSIHAN",null,"NAIK/ TIDAK NAIK","TAHUN PLJARAN",null,"QH 3",null,"AA 3",null,"FQ 3",null,"SKI 3",null,"AWJ 3",null,"BA3",null,"PKN 3",null,"BID 3",null,"MTK 3",null,"IPA 3",null,"IPS 3",null,"SBK 3",null,"PJO 3",null,"BD 3",null,"BIG 3",null,"JML NILAI",null,"RATA - RATA",null,"PE RINGKAT",null,"SAKIT",null,"IJIN",null,"ALPA",null,"EKSKUL PRAMUKA",null,"EKSKUL 1",null,"EKSKUL 2",null,"KE-LAKU-AN",null,"KE-RAJINAN",null,"KE-BERSIHAN",null,"NAIK/ TIDAK NAIK","TAHUN PLJARAN",null,"QH 4",null,"AA 4",null,"FQ 4",null,"SKI 4",null,"AWJ 4",null,"BA4",null,"PKN 4",null,"BID 4",null,"MTK 4",null,"IPA 4",null,"IPS 4",null,"SBK 4",null,"PJO 4",null,"BD 4",null,"BIG 4",null,"JML NILAI",null,"RATA - RATA",null,"PE RINGKAT",null,"SAKIT",null,"IJIN",null,"ALPA",null,"EKSKUL PRAMUKA",null,"EKSKUL 1",null,"EKSKUL 2",null,"KE-LAKU-AN",null,"KE-RAJINAN",null,"KE-BERSIHAN",null,"NAIK/ TIDAK NAIK","TAHUN PLJARAN",null,"QH 5",null,"AA 5",null,"FQ 5",null,"SKI 5",null,"AWJ 5",null,"BA5",null,"PKN 5",null,"BID 5",null,"MTK 5",null,"IPA 5",null,"IPS 5",null,"SBK 5",null,"PJO 5",null,"BD 5",null,"BIG 5",null,"JML NILAI",null,"RATA - RATA",null,"PE RINGKAT",null,"SAKIT",null,"IJIN",null,"ALPA",null,"EKSKUL PRAMUKA",null,"EKSKUL 1",null,"EKSKUL 2",null,"KE-LAKU-AN",null,"KE-RAJINAN",null,"KE-BERSIHAN",null,"NAIK/ TIDAK NAIK","TAHUN PLJARAN",null,"QH 6",null,"AA 6",null,"FQ 6",null,"SKI 6",null,"AWJ 6",null,"BA6",null,"PKN 6",null,"BID 6",null,"MTK 6",null,"IPA 6",null,"IPS 6",null,"SBK 6",null,"PJO 6",null,"BD 6",null,"BIG 6",null,"JML NILAI",null,"RATA - RATA",null,"PE RINGKAT",null,"SAKIT",null,"IJIN",null,"ALPA",null,"EKSKUL PRAMUKA",null,"EKSKUL 1",null,"EKSKUL 2",null,"KE-LAKU-AN",null,"KE-RAJINAN",null,"KE-BERSIHAN",null,"NAIK/ TIDAK NAIK","TAHUN PLJARAN",null,"NOMOR IJAZAH","Tempat IJAZAH","TANGGALIJAZAH","BIDANG","NOMOR","TANGGAL","NOMOR IJAZAH","NOMOR IJAZAH","NOMOR IJAZAH","TENTANG","NOMOR SRT KET","TANGGAL SRT KET","NOMOR IJAZAH","TENTANG","NOMOR SRT KET","TANGGAL SRT KET",null,"QH (NILAI AKHIR)",null,"AA (NILAI AKHIR)",null,"FQ (NILAI AKHIR)",null,"SKI (NILAI AKHIR)",null,"AWJ (NILAI AKHIR)",null,"BA(NILAI AKHIR)",null,"PKN (NILAI AKHIR)",null,"BID (NILAI AKHIR)",null,"MTK (NILAI AKHIR)",null,"IPA (NILAI AKHIR)",null,"IPS (NILAI AKHIR)",null,"SBK (NILAI AKHIR)",null,"PJO (NILAI AKHIR)",null,"BD (NILAI AKHIR)",null,"BIG (NILAI AKHIR)"]
[null,null,null,null,null,null,null,null,null,null,null,null,null,null,null,null,null,null,null,null,null,null,null,null,null,null,null,null,null,null,null,null,null,null,null,null,null,null,null,null,null,null,null,null,null,null,null,null,null,null,null,null,null,null,null,null,null,null,null,null,null,null,null,null,null,null,null,null,null,null,null,null,null,null,null,null,null,null,null,null,null,null,null,null,null,null,null,null,null,null,null,"SMT1","SMT2","SMT1","SMT2","SMT1","SMT2","SMT1","SMT2","SMT1","SMT2","SMT1","SMT2","SMT1","SMT2","SMT1","SMT2","SMT1","SMT2","SMT1","SMT2","SMT1","SMT2","SMT1","SMT2","SMT1","SMT2","SMT1","SMT2","SMT1","SMT2","SMT1","SMT2","SMT1","SMT2","SMT1","SMT2","SMT1","SMT2","SMT1","SMT2","SMT1","SMT2","SMT1","SMT2","SMT1","SMT2","SMT1","SMT2","SMT1","SMT2","SMT1","SMT2","SMT1","SMT2",null,null,null,"SMT1","SMT2","SMT1","SMT2","SMT1","SMT2","SMT1","SMT2","SMT1","SMT2","SMT1","SMT2","SMT1","SMT2","SMT1","SMT2","SMT1","SMT2","SMT1","SMT2","SMT1","SMT2","SMT1","SMT2","SMT1","SMT2","SMT1","SMT2","SMT1","SMT2","SMT1","SMT2","SMT1","SMT2","SMT1","SMT2","SMT1","SMT2","SMT1","SMT2","SMT1","SMT2","SMT1","SMT2","SMT1","SMT2","SMT1","SMT2","SMT1","SMT2","SMT1","SMT2","SMT1","SMT2",null,null,null,"SMT1","SMT2","SMT1","SMT2","SMT1","SMT2","SMT1","SMT2","SMT1","SMT2","SMT1","SMT2","SMT1","SMT2","SMT1","SMT2","SMT1","SMT2","SMT1","SMT2","SMT1","SMT2","SMT1","SMT2","SMT1","SMT2","SMT1","SMT2","SMT1","SMT2","SMT1","SMT2","SMT1","SMT2","SMT1","SMT2","SMT1","SMT2","SMT1","SMT2","SMT1","SMT2","SMT1","SMT2","SMT1","SMT2","SMT1","SMT2","SMT1","SMT2","SMT1","SMT2","SMT1","SMT2",null,null,null,"SMT1","SMT2","SMT1","SMT2","SMT1","SMT2","SMT1","SMT2","SMT1","SMT2","SMT1","SMT2","SMT1","SMT2","SMT1","SMT2","SMT1","SMT2","SMT1","SMT2","SMT1","SMT2","SMT1","SMT2","SMT1","SMT2","SMT1","SMT2","SMT1","SMT2","SMT1","SMT2","SMT1","SMT2","SMT1","SMT2","SMT1","SMT2","SMT1","SMT2","SMT1","SMT2","SMT1","SMT2","SMT1","SMT2","SMT1","SMT2","SMT1","SMT2","SMT1","SMT2","SMT1","SMT2",null,null,null,"SMT1","SMT2","SMT1","SMT2","SMT1","SMT2","SMT1","SMT2","SMT1","SMT2","SMT1","SMT2","SMT1","SMT2","SMT1","SMT2","SMT1","SMT2","SMT1","SMT2","SMT1","SMT2","SMT1","SMT2","SMT1","SMT2","SMT1","SMT2","SMT1","SMT2","SMT1","SMT2","SMT1","SMT2","SMT1","SMT2","SMT1","SMT2","SMT1","SMT2","SMT1","SMT2","SMT1","SMT2","SMT1","SMT2","SMT1","SMT2","SMT1","SMT2","SMT1","SMT2","SMT1","SMT2",null,null,null,"SMT1","SMT2","SMT1","SMT2","SMT1","SMT2","SMT1","SMT2","SMT1","SMT2","SMT1","SMT2","SMT1","SMT2","SMT1","SMT2","SMT1","SMT2","SMT1","SMT2","SMT1","SMT2","SMT1","SMT2","SMT1","SMT2","SMT1","SMT2","SMT1","SMT2","SMT1","SMT2","SMT1","SMT2","SMT1","SMT2","SMT1","SMT2","SMT1","SMT2","SMT1","SMT2","SMT1","SMT2","SMT1","SMT2","SMT1","SMT2","SMT1","SMT2","SMT1","SMT2","SMT1","SMT2",null,null,null,null,null,null,null,null,null,null,null,null,null,null,null,null,null,null,null,null,"IJAZAH","SKHU","IJAZAH","SKHU","IJAZAH","SKHU","IJAZAH","SKHU","IJAZAH","SKHU","IJAZAH","SKHU","IJAZAH","SKHU","IJAZAH","SKHU","IJAZAH","SKHU","IJAZAH","SKHU","IJAZAH","SKHU","IJAZAH","SKHU","IJAZAH","SKHU","IJAZAH","SKHU","IJAZAH","SKHU"]
[]
[4001,"Nama Murid","Nama Orang Tua","Kls.","Tgl Masuk","Tgl Keluar","Nama Panggilan","L","Tanggal Lahir","Tempat Lahir","Agama","WNI",21,22,23,"Bahasa Sehari-hari keluarga","Berat badan","tinggi badan","gol.darah","penyakit berat","alamat dan no. telp","tempat tinggal pada (ortu/numpang/asramah)","Jarak Tempat Tinggal","tahun masuk sekolah ini",null,"no1","no2","pt1","pt2","pk1","pk2","Nama","hub.keluarga","Pendidikan","Pekerjaan",null,"Langsung Orang Tua","nama RA/TK","Alamat","Tanggal dan No.STTB","Nama Sekolah","dari Tingkat","diterima Tanggal","Prestasi Belajar",2017,20171,20172,20173,20174,2018,20181,20182,20183,20184,2019,20191,20192,20193,20194,2020,20201,20202,20203,20204,2021,20211,20212,20213,20214,2022,20221,20222,20223,20224,2023,20231,20232,20233,20234,"KIP","Tahun","No. STTB","Melanjutkan Ke","Dari Tingkat","Ke Sekolah","Ke Tingkat","Tanggal","Tanggal","Alasan",null,null,"A1","A2","A3","A4","A5","A6","A7","A8","A9","A10","A11","A12","A13","A14","A15","A16","A17","A18","A19","A20","A21","A22","A23","A24","A25","A26","A27","A28","A29","A30","A31","A32","A33","A34","A35","A36","A37","A38","A39","A40","A41","A42","A43","A44","A45","A46","A47","A48","A49","A50","A51","A52","A53","A54","A55","A56",null,"A56","A57","A58","A59","A60","A61","A62","A63","A64","A65","A66","A67","A68","A69","A70","A71","A72","A73","A74","A75","A76","A77","A78","A79","A80","A81","A82","A83","A84","A85","A86","A87","A88","A89","A90","A91","A92","A93","A94","A95","A96","A97","A98","A99","A100","A101","A102","A103","A104","A105","A106","A107","A108","A109","A110","A111",null,"A112","A113","A114","A115","A116","A117","A118","A119","A120","A121","A122","A123","A124","A125","A126","A127","A128","A129","A130","A131","A132","A133","A134","A135","A136","A137","A138","A139","A140","A141","A142","A143","A144","A145","A146","A147","A148","A149","A150","A151","A152","A153","A154","A155","A156","A157","A158","A159","A160","A161","A162","A163","A164","A165","A166","A167",null,"A168","A169","A170","A171","A172","A173","A174","A175","A176","A177","A178","A179","A180","A181","A182","A183","A184","A185","A186","A187","A188","A189","A190","A191","A192","A193","A194","A195","A196","A197","A198","A199","A200","A201","A202","A203","A204","A205","A206","A207","A208","A209","A210","A211","A212","A213","A214","A215","A216","A217","A218","A219","A220","A221","A222","A223",null,"A224","A225","A226","A227","A228","A229","A230","A231","A232","A233","A234","A235","A236","A237","A238","A239","A240","A241","A242","A243","A244","A245","A246","A247","A248","A249","A250","A251","A252","A253","A254","A255","A256","A257","A258","A259","A260","A261","A262","A263","A264","A265","A266","A267","A268","A269","A270","A271","A272","A273","A274","A275","A276","A277","A278","A279",null,"A280","A281","A282","A283","A284","A285","A286","A287","A288","A289","A290","A291","A292","A293","A294","A295","A296","A297","A298","A299","A300","A301","A302","A303","A304","A305","A306","A307","A308","A309","A310","A311","A312","A313","A314","A315","A316","A317","A318","A319","A320","A321","A322","A323","A324","A325","A326","A327","A328","A329","A330","A331","A332","A333","LULUS","A335",null,"A336","A337","A338","A339","A340","A341","A342","A343","A344","A345","A346","A347","A348","A349","A350","A351",null,"A352","A353","A354","A355","A356","A357","A358","A359","A360","A361","A362","A363","A364","A365","A366","A367","A368","A369","A370","A371","A372","A373","A374","A375","A376","A377","A378","A379","A380","A381"]
[4002,"Nama Murid","Nama Orang Tua","Kls.","Tgl Masuk","Tgl Keluar","Nama Panggilan","L","Tanggal Lahir","Tempat Lahir","Agama","WNI",21,22,23,"Bahasa Sehari-hari keluarga","Berat badan","tinggi badan","gol.darah","penyakit berat","alamat dan no. telp","tempat tinggal pada (ortu/numpang/asramah)","Jarak Tempat Tinggal","tahun masuk sekolah ini",null,"no1","no2","pt1","pt2","pk1","pk2","Nama","hub.keluarga","Pendidikan","Pekerjaan",null,"Langsung Orang Tua","nama RA/TK","Alamat","Tanggal dan No.STTB","Nama Sekolah","dari Tingkat","diterima Tanggal","Prestasi Belajar",2017,20171,20172,20173,20174,2018,20181,20182,20183,20184,2019,20191,20192,20193,20194,2020,20201,20202,20203,20204,2021,20211,20212,20213,20214,2022,20221,20222,20223,20224,2023,20231,20232,20233,20234,"KIP","Tahun","No. STTB","Melanjutkan Ke","Dari Tingkat","Ke Sekolah","Ke Tingkat","Tanggal","Tanggal","Alasan",null,null,"B1","B2","B3","B4","B5","B6","B7","B8","B9","B10","B11","B12","B13","B14","B15","B16","B17","B18","B19","B20","B21","B22","B23","B24","B25","B26","B27","B28","B29","B30","B31","B32","B33","B34","B35","B36","B37","B38","B39","B40","B41","B42","B43","B44","B45","B46","B47","B48","B49","B50","B51","B52","B53","B54","B55","B56",null,"B56","B57","B58","B59","B60","B61","B62","B63","B64","B65","B66","B67","B68","B69","B70","B71","B72","B73","B74","B75","B76","B77","B78","B79","B80","B81","B82","B83","B84","B85","B86","B87","B88","B89","B90","B91","B92","B93","B94","B95","B96","B97","B98","B99","B100","B101","B102","B103","B104","B105","B106","B107","B108","B109","B110","B111",null,"B112","B113","B114","B115","B116","B117","B118","B119","B120","B121","B122","B123","B124","B125","B126","B127","B128","B129","B130","B131","B132","B133","B134","B135","B136","B137","B138","B139","B140","B141","B142","B143","B144","B145","B146","B147","B148","B149","B150","B151","B152","B153","B154","B155","B156","B157","B158","B159","B160","B161","B162","B163","B164","B165","B166","B167",null,"B168","B169","B170","B171","B172","B173","B174","B175","B176","B177","B178","B179","B180","B181","B182","B183","B184","B185","B186","B187","B188","B189","B190","B191","B192","B193","B194","B195","B196","B197","B198","B199","B200","B201","B202","B203","B204","B205","B206","B207","B208","B209","B210","B211","B212","B213","B214","B215","B216","B217","B218","B219","B220","B221","B222","B223",null,"B224","B225","B226","B227","B228","B229","B230","B231","B232","B233","B234","B235","B236","B237","B238","B239","B240","B241","B242","B243","B244","B245","B246","B247","B248","B249","B250","B251","B252","B253","B254","B255","B256","B257","B258","B259","B260","B261","B262","B263","B264","B265","B266","B267","B268","B269","B270","B271","B272","B273","B274","B275","B276","B277","B278","B279",null,"B280","B281","B282","B283","B284","B285","B286","B287","B288","B289","B290","B291","B292","B293","B294","B295","B296","B297","B298","B299","B300","B301","B302","B303","B304","B305","B306","B307","B308","B309","B310","B311","B312","B313","B314","B315","B316","B317","B318","B319","B320","B321","B322","B323","B324","B325","B326","B327","B328","B329","B330","B331","B332","B333","LOELOES","LOELOES",null,"B336","B337","B338","B339","B340","B341","B342","B343","B344","B345","B346","B347","B348","B349","B350","B351",null,"B352","B353","B354","B355","B356","B357","B358","B359","B360","B361","B362","B363","B364","B365","B366","B367","B368","B369","B370","B371","B372","B373","B374","B375","B376","B377","B378","B379","B380","B381"]
[4003]
[4004]
[4005]
[4006]
[4007]
[4008]
[4009]
[4010]
[4011]
[4012]
[4013]
[4014]
[4015]
[4016]
[4017]
[4018]
[4019]
[4020]
[4021]
[4022]
[4023]
[4024]
[4025]
[4026]
[4027]
[4028]
[4029]
[4030]
[4031]
[4032]
[4033]
[4034]
[4035]
[4036]
[4037]
[4038]
[4039]
[4040]
[4041]
[4042]
[4043]
[4044]
[4045]
[4046]
[4047]
[4048]
[4049]
[4050]
[4051]
[4052]
[4053]
[4054]
[4055]
[4056]
[4057]
[4058]
[4059]
[4060]
[4061]
[4062]
[4063]
[4064]
[4065]
[4066]
[4067]
[4068]
[4069]
[4070]
[4071]
[4072]
[4073]
[4074]
[4075]
[4076]
[4077]
[4078]
[4079]
[4080]
[4081]
[4082]
[4083]
[4084]
[4085]
[4086]
[4087]
[4088]
[4089]
[4090]
[4091]
[4092]
[4093]
[4094]
[4095]
[4096]
[4097]
[4098]
[4099]
[4100]
[4101]
[4102]
[4103]
[4104]
[4105]
[4106]
[4107]
[4108]
[4109]
[4110]
[4111]
[4112]
[4113]
[4114]
[4115]
[4116]
[4117]
[4118]
[4119]
[4120]
[4121]
[4122]
[4123]
[4124]
[4125]
[4126]
[4127]
[4128]
[4129]
[4130]
[4131]
[4132]
[4133]
[4134]
[4135]
[4136]
[4137]
[4138]
[4139]
[4140]
[4141]
[4142]
[4143]
[4144]
[4145]
[4146]
[4147]
[4148]
[4149]
[4150]
[4151]
[4152]
[4153]
[4154]
[4155]
[4156]
[4157]
[4158]
[4159]
[4160]
[4161]
[4162]
[4163]
[4164]
[4165]
[4166]
[4167]
[4168]
[4169]
[4170]
[4171]
[4172]
[4173]
[4174]
[4175]
[4176]
[4177]
[4178]
[4179]
[4180]
[4181]
[4182]
[4183]
[4184]
[4185]
[4186]
[4187]
[4188]
[4189]
[4190]
[4191]
[4192]
[4193]
[4194]
[4195]
[4196]
[4197]
[4198]
[4199]
[4200]
[4201]
[4202]
[4203]
[4204]
[4205]
[4206]
[4207]
[4208]
[4209]
[4210]
[4211]
[4212]
[4213]
[4214]
[4215]
[4216]
[4217]
[4218]
[4219]
[4220]
[4221]
[4222]
[4223]
[4224]
[4225]
[4226]
[4227]
[4228]
[4229]
[4230]
[4231]
[4232]
[4233]
[4234]
[4235]
[4236]
[4237]
[4238]
[4239]
[4240]
[4241]
[4242]
[4243]
[4244]
[4245]
[4246]
[4247]
[4248]
[4249]
[4250]
[4251]
[4252]
[4253]
[4254]
[4255]
[4256]
[4257]
[4258]
[4259]
[4260]
[4261]
[4262]
[4263]
[4264]
[4265]
[4266]
[4267]
[4268]
[4269]
[4270,"ADITYA MAULA FANDY TAULANI"]
[4271,"AHMAD RAMADHANI FADLULLOH"]
[4272,"ANDINI MAULID DWI LESTARI"]
[4273,"DEWI SAKINAH ISWARA"]
[4274,"DWITA FITA WULANDARI"]
[4275,"HANIK APRILIA SARI"]
[4276,"IZZA ILMIA AZZAHRA"]
[4277,"KARINA FEBBY CAHYA AMILIA"]
[4278,"KHARISYA AZZAHRO"]
[4279,"MITA SEPTIANI ISLAMIA"]
[4280,"MUCHAMMAD ALIEF FERDIANSYAH"]
[4281,"MUHAMMAD AGUS ANDRIANTO"]
[4282,"MUHAMMAD AGUS FERDIANSYAH"]
[4283,"MUHAMMAD FERDINAN JAYYIDAH RIFQI"]
[4284,"MUHAMMAD RAYA KAFAF JAUHARI"]
[4285,"MUHAMMAD VERYANSYAH"]
[4286,"MUHAMMAD ZIDNY NA'IM"]
[4287,"NABILA ARISKA PUTRI"]
[4288,"NAFISA INDRIANI"]
[4289,"NUR FITRIYAH"]
[4290,"QORIATUN SHOLIHAH"]
[4291,"RACHMAD HIDAYAT"]
[4292,"RHEA RAYSHANADA NUGRAHA"]
[4293,"RIYANTI APRILIA"]
[4294,"RIZKA AYU WULANDARI"]
[4295,"SHONIA AULIA AS'AD"]
[4296,"USWATUN KHASANAH"]
[4297,"VERLINA DWI MAULANI"]
[4298]
[4299]
[4300,"AHMAD FERDIAN ALAMSYAH"]
[4301,"ANDRIK YUSRI"]
[4302]
[4303,"FARIDATUS SAHDIAH"]
[4304]
[4305,"JULI ANDRIYANTO"]
[4306,"LENNY AGUSTIN NINGTYAS"]
[4307,"CHAKIM"]
[4308,"MAURIS HIDAYATUR ROCHMAN"]
[4309,"MAYA BUNGA ANJANI"]
[4310,"MOCHAMMAD BIMA RISFANDA"]
[4311]
[4312]
[4313]
[4314,"MUHAMMAD BISMAR TAUFIQUROHMAN"]
[4315,"MUHAMMAD FARDAN ABDILLAH"]
[4316]
[4317,"MUHAMMAD FIRMANSYAH"]
[4318,"MUHAMMAD HILDAN DWI SAPUTRA"]
[4319,"MUHAMMAD RUDI TANTOWIK"]
[4320,"MUHAMMAD SAHLAN SHODIQ"]
[4321,"MUHAMMAD SEPTYAN EKA PRATAMA"]
[4322,"MUHAMMAD ZULDIENUR HABIBIE"]
[4323,"MUKHAMAD KHOIRUL AMIN"]
[4324,"VIKA KUSUMA WATI"]
[4325]
[4326,"YOHAN EGA GILANG PERMANA"]
[4327]
[4328]
[4329]
[4330,"ACHID ATHIRIL ARDAN"]
[4331,"ACHMAD FATHIR IZUDDIN"]
[4332]
[4333,"AININ NAFISA FEBRIYANTI"]
[4334,"AISYAH DWI ANDINI"]
[4335,"AJENG AGUSTINA KIRANA PUTRI"]
[4336,"ALVIAN FAIZULHAQQI"]
[4337,"ANGGITA RIZKY YUGA MEISYA"]
[4338,"AURA SALSABILA WULAN SARI"]
[4339,"DEVI KARUNIA RATNA PUTRI"]
[4340,"DEVITA FEBRIANI PUTRI"]
[4341,"ERSA PUSPITA EKA ROSA LINDA"]
[4342,"FARAH NAILATUL ALYAH"]
[4343,"FELISITA APRILIA NUR NIHAYA"]
[4344,"FIRDA DWI ANDRIANI"]
[4345,"GALANG MARDHOTILLAH SATOTO"]
[4346,"IKA KURNIA WATI AGUSTINA"]
[4347,"LIYA FEBRIYANI"]
[4348,"LIZATUL CHAIYUNI"]
[4349,"MUHAMMAD FARIZ UBAIDILLA"]
[4350,"MAYLUNA EKA PRATIWI"]
[4351,"MOCHAMAD RAFLI DIAN SAPUTRA"]
[4352,"MOCHAMMAD AFAREL PUTRA RAMDHANA"]
[4353,"MOHAMAD DWIMAS FIRDAUS"]
[4354,"MUHAMMAD ALVIN RIDHO"]
[4355,"MUHAMAD JEFRI MAULANA"]
[4356,"MUHAMMAD MAULANA ZIDANIL ILMI"]
[4357,"MUHAMMAD SUTRISNO ISMAIL"]
[4358,"PUTRI SHOLIKHA"]
[4359,"ROUDHOTUS SA'DIYAH"]
[4360,"ZIDNY ILMA NABILA"]
[4361,"ACHMAD SEPTIAN HAMDANI"]
[4362,"ACHMAD SULAIMAN"]
[4363]
[4364,"AIRLANGGA DWIKA RIZQI"]
[4365,"AUFAN AZKAL ABRORI"]
[4366,"BALQIS NAILA AUDIA"]
[4367,"BIMA SATRIA DIRGANTARA"]
[4368,"EKA AULIYA` PUTRI"]
[4369,"FABIYAN TRI BAKTI OKTAFIAN"]
[4370,"FAKHIS GABRIL LIA"]
[4371,"GALIH FAREL PRASETYO"]
[4372,"GILANG AKBAR PRASETYO"]
[4373,"IFTAH IZZAH EMILIA  MAHMUD"]
[4374,"IYAAD  AFLAKHA RAMZII"]
[4375,"MUHAMMAD AFFAN ABI SYAHPUTRA"]
[4376,"MUHAMMAD DWI WILDAN BAGUS KURNIAWAN"]
[4377,"MUHAMMAD FARIL FIRMANSYA"]
[4378,"MUKHAMAD DAVID ARIF FIRDAUS"]
[4379,"NAORA ISQI AINAYYA"]
[4380,"NAZRA ISLAMAY PASHA"]
[4381,"NOVITA ERNIAWAN"]
[4382,"NUR ALYA NABILA"]
[4383,"PUTRI AULIA DWI AGUSTIN"]
[4384,"RESTI FITRIANTI DWI OCTAVIANI"]
[4385,"STANY RAFIDAH RAHMANIA"]
[4386,"TIERSYA BETA RAMANUZAN"]
[4387,"USWATUN KHASANAH"]
[4388,"VERA MUSTIKA"]
[4389,"VIKROUL KHAMILA"]
[4390,"ZITNATUL AULIA ILLA"]
[4391,"HIDAYATUL KHUMAINIA"]
[4392,"PUTRI NAFI'ATUS SOLIKHAH"]
[4393]
[4394]
[4395]
[4396]
[4397]
[4398,"ANANDA AMILIA"]
[4399]
[4400]
[4401]
[4402]
[4403]
[4404]
[4405]
[4406]
[4407]
[4408]
[4409]
[4410]
[4411]
[4412]
[4413]
[4414]
[4415]
[4416]
[4417]
[4418]
[4419]
[4420]
[4421]
[4422]
[4423]
[4424]
[4425]
[4426]
[4427]
[4428]
[4429]
[4430]
[4431]
[4432]
[4433]
[4434]
[4435]
[4436]
[4437]
[4438]
[4439]
[4440]
[4441]
[4442]
[4443]
[4444]
[4445]
[4446]
[4447]
[4448]
[4449]
[4450]
[4451]
[4452]
[4453]
[4454]
[4455]
[4456]
[4457]
[4458]
[4459]
[4460]
[4461]
[4462]
[4463]
[4464]
[4465,"AZZA PRISHAL DWI PUTRA"]
[4466,"HIBATULLAH MUSTAGHFIRY RUSLI"]
[4467]
[4468]
[4469]
[4470]
[4471]
[4472]
[4473]
[4474]
[4475]
[4476]
[4477]
[4478]
[4479]
[4480]
[4481]
[4482]
[4483]
[4484]
[4485]
[4486]
[4487]
[4488]
[4489]
[4490]
[4491]
[4492]
[4493]
[4494]
[4495]
[4496]
[4497]
[4498]
[4499]
[4500]
[4501]
[4502]
[4503]
[4504]
[4505]
[4506]
[4507]
[4508]
[4509]
[4510]
[4511]
[4512]
[4513]
[4514]
[4515]
[4516]
[4517]
[4518]
[4519]
[4520]
[4521]
[4522]
[4523]
[4524]
[4525]
[4526]
[4527]
[4528]
[4529]
[4530]
[4531]
[4532]
[4533]
[4534]
[4535]
[4536]
[4537]
[4538]
[4539]
[4540]
[4541]
[4542]
[4543]
[4544]
[4545]
[4546]
[4547]
[4548]
[4549]
[4550]
[4551]
[4552]
[4553]
[4554]
[4555]
[4556]
[4557]
[4558]
[4559]
[4560]
[4561]
[4562]
[4563]
[4564]
[4565]
[4566]
[4567]
[4568]
[4569]
[4570]
[4571]
[4572]
[4573]
[4574]
[4575]
[4576]
[4577]
[4578]
[4579]
[4580]
[4581]
[4582]
[4583]
[4584]
[4585]
[4586]
[4587]
[4588]
[4589]
[4590]
[4591]
[4592]
[4593]
[4594]
[4595]
[4596]
[4597]
[4598]
[4599]
[4600]
[4601]
[4602]
[4603]
[4604]
[4605]
[4606]
[4607]
[4608]
[4609]
[4610]
[4611]
[4612]
[4613]
[4614]
[4615]
[4616]
[4617]
[4618]
[4619]
[4620]
[4621]
[4622]
[4623]
[4624]
[4625]
[4626]
[4627]
[4628]
[4629]
[4630]
[4631]
[4632]
[4633]
[4634]
[4635]
[4636]
[4637]
[4638]
[4639]
[4640]
[4641]
[4642]
[4643]
[4644]
[4645]
[4646]
[4647]
[4648]
[4649]
[4650]
[4651]
[4652]
[4653]
[4654]
[4655]
[4656]
[4657]
[4658]
[4659]
[4660]
[4661]
[4662]
[4663]
[4664]
[4665]
[4666]
[4667]
[4668]
[4669]
[4670]
[4671]
[4672]
[4673]
[4674]
[4675]
[4676]
[4677]
[4678]
[4679]
[4680]
[4681]
[4682]
[4683]
[4684]
[4685]
[4686]
[4687]
[4688]
[4689]
[4690]
[4691]
[4692]
[4693]
[4694]
[4695]
[4696]
[4697]
[4698]
[4699]
[4700]
[4701]
[4702]
[4703]
[4704]
[4705]
[4706]
[4707]
[4708]
[4709]
[4710]
[4711]
[4712]
[4713]
[4714]
[4715]
[4716]
[4717]
[4718]
[4719]
[4720]
[4721]
[4722]
[4723]
[4724]
[4725]
[4726]
[4727]
[4728]
[4729]
[4730]
[4731]
[4732]
[4733]
[4734]
[4735]
[4736]
[4737]
[4738]
[4739]
[4740]
[4741]
[4742]
[4743]
[4744]
[4745]
[4746]
[4747]
[4748]
[4749]
[4750]
[4751]
[4752]
[4753]
[4754]
[4755]
[4756]
[4757]
[4758]
[4759]
[4760]
[4761]
[4762]
[4763]
[4764]
[4765]
[4766]
[4767]
[4768]
[4769]
[4770]
[4771]
[4772]
[4773]
[4774]
[4775]
[4776]
[4777]
[4778]
[4779]
[4780]
[4781]
[4782]
[4783]
[4784]
[4785]
[4786]
[4787]
[4788]
[4789]
[4790]
[4791]
[4792]
[4793]
[4794]
[4795]
[4796]
[4797]
[4798]
[4799]
[4800]
[4801]
[4802]
[4803]
[4804]
[4805]
[4806]
[4807]
[4808]
[4809]
[4810]
[4811]
[4812]
[4813]
[4814]
[4815]
[4816]
[4817]
[4818]
[4819]
[4820]
[4821]
[4822]
[4823]
[4824]
[4825]
[4826]
[4827]
[4828]
[4829]
[4830]
[4831]
[4832]
[4833]
[4834]
[4835]
[4836]
[4837]
[4838]
[4839]
[4840]
[4841]
[4842]
[4843]
[4844]
[4845]
[4846]
[4847]
[4848]
[4849]
[4850]
[4851]
[4852]
[4853]
[4854]
[4855]
[4856]
[4857]
[4858]
[4859]
[4860]
[4861]
[4862]
[4863]
[4864]
[4865]
[4866]
[4867]
[4868]
[4869]
[4870]
[4871]
[4872]
[4873]
[4874]
[4875]
[4876]
[4877]
[4878]
[4879]
[4880]
[4881]
[4882]
[4883]
[4884]
[4885]
[4886]
[4887]
[4888]
[4889]
[4890]
[4891]
[4892]
[4893]
[4894]
[4895]
[4896]
[4897]
[4898]
[4899]
[4900]
[4901]
[4902]
[4903]
[4904]
[4905]
[4906]
[4907]
[4908]
[4909]
[4910]
[4911]
[4912]
[4913]
[4914]
[4915]
[4916]
[4917]
[4918]
[4919]
[4920]
[4921]
[4922]
[4923]
[4924]
[4925]
[4926]
[4927]
[4928]
[4929]
[4930]
[4931]
[4932]
[4933]
[4934]
[4935]
[4936]
[4937]
[4938]
[4939]
[4940]
[4941]
[4942]
[4943]
[4944]
[4945]
[4946]
[4947]
[4948]
[4949]
[4950]
[4951]
[4952]
[4953]
[4954]
[4955]
[4956]
[4957]
[4958]
[4959]
[4960]
[4961]
[4962]
[4963]
[4964]
[4965]
[4966]
[4967]
[4968]
[4969]
[4970]
[4971]
[4972]
[4973]
[4974]
[4975]
[4976]
[4977]
[4978]
[4979]
[4980]
[4981]
[4982]
[4983]
[4984]
[4985]
[4986]
[4987]
[4988]
[4989]
[4990]
[4991]
[4992]
[4993]
[4994]
[4995]
[4996]
[4997]
[4998]
[4999]
[5000]

{"sheet":"INDUK40015000HAL1","index":4,"n_rows":74,"n_cols":15,"rows_kept":74,"cut":false,"hidden":false,"merged":[[6,1,10,1],[29,1,33,1],[55,4,55,7],[56,1,60,1],[56,4,56,7],[57,4,57,7],[58,4,58,7],[59,4,59,7]]}
[null,null,null,null,"Nomor Induk Murid : ",null,null,null,null,null,4365]
[null,null,null,"A.","KETERANGAN MURID"]
[null,null,null,null,"1.","Nama Murid :"]
[null,null,null,null,null,null,null,null,"a. Lengkap",null,null,{"$f":"\": \"&VLOOKUP($K$1,INDUK40015000!$A$6:$CK$1005,2)","v":": AUFAN AZKAL ABRORI"}]
[null,null,null,null,null,null,null,null,"b. Panggilan",null,null,{"$f":"\": \"&VLOOKUP($K$1,INDUK40015000!$A$6:$CK$1005,7)","v":": "}]
[null,null,null,null,"2.","Jenis Kelamin",null,null,null,null,null,{"$f":"\": \"&IF(VLOOKUP($K$1,INDUK40015000!$A$6:$CK$1005,8)=\"L\",\"Laki-Laki\",\"Perempuan\")","v":": Perempuan"}]
[null,"PAS FOTO 3X4cm",null,null,"3.","Kelahiran :"]
[null,null,null,null,null,null,null,null,"a. Tanggal",null,null,{"$f":"\": \"&VLOOKUP($K$1,INDUK40015000!$A$6:$CK$1005,9)","v":": "}]
[null,null,null,null,null,null,null,null,"b. Tempat",null,null,{"$f":"\": \"&VLOOKUP($K$1,INDUK40015000!$A$6:$CK$1005,10)","v":": "}]
[null,null,null,null,"4.","Agama",null,null,null,null,null,{"$f":"\": \"&VLOOKUP($K$1,INDUK40015000!$A$6:$CK$1005,11)","v":": "}]
[null,null,null,null,"5.","Kewarganegaraan",null,null,null,null,null,{"$f":"\": \"&VLOOKUP($K$1,INDUK40015000!$A$6:$CK$1005,12)","v":": "}]
[null,null,null,null,"6.","Jumlah Saudara"]
[null,null,null,null,null,null,null,"a.","Kandung",null,null,{"$f":"\": \"&VLOOKUP($K$1,INDUK40015000!$A$6:$CK$1005,13)","v":": "}]
[null,null,null,null,null,null,null,"b.","Tiri",null,null,{"$f":"\": \"&VLOOKUP($K$1,INDUK40015000!$A$6:$CK$1005,14)","v":": "}]
[null,null,null,null,null,null,null,"c.","Angkat",null,null,{"$f":"\": \"&VLOOKUP($K$1,INDUK40015000!$A$6:$CK$1005,15)","v":": "}]
[null,null,null,null,"7.","Bahasa Sehari-hari Keluarga",null,null,null,null,null,{"$f":"\": \"&VLOOKUP($K$1,INDUK40015000!$A$6:$CK$1005,16)","v":": "}]
[null,null,null,null,"8.","Keadaan Jasmani"]
[null,null,null,null,null,null,null,"a.","Berat Badan",null,null,{"$f":"\": \"&VLOOKUP($K$1,INDUK40015000!$A$6:$CK$1005,17)","v":": "}]
[null,null,null,null,null,null,null,"b.","Tinggi Badan",null,null,{"$f":"\": \"&VLOOKUP($K$1,INDUK40015000!$A$6:$CK$1005,18)","v":": "}]
[null,null,null,null,null,null,null,"c.","Gol. Darah",null,null,{"$f":"\": \"&VLOOKUP($K$1,INDUK40015000!$A$6:$CK$1005,19)","v":": "}]
[null,null,null,null,null,null,null,"d.","Penyakit Berat",null,null,{"$f":"\": \"&VLOOKUP($K$1,INDUK40015000!$A$6:$CK$1005,20)","v":": "}]
[null,null,null,null,"9.","Alamat dan No. Telepon",null,null,null,null,null,{"$f":"\": \"&VLOOKUP($K$1,INDUK40015000!$A$6:$CK$1005,21)","v":": "}]
[null,null,null,null,"10.","Bertempat Tinggal Pada",null,null,null,null,null,{"$f":"\": \"&VLOOKUP($K$1,INDUK40015000!$A$6:$CK$1005,22)","v":": "}]
[null,null,null,null,"11.","Jarak Tempat Tinggal ke Sekolah",null,null,null,null,null,{"$f":"\": \"&VLOOKUP($K$1,INDUK40015000!$A$6:$CK$1005,23)","v":": "}]
[null,null,null,null,12,"Tahun Masuk Sekolah ini",null,null,null,null,null,{"$f":"\": \"&VLOOKUP($K$1,INDUK40015000!$A$6:$CK$1005,24)","v":": "}]
[null,null,null,"B.","KETERANGAN ORANG TUA / WALI MURID"]
[null,null,null,null,"1.","Nama Orang Tua kandung"]
[null,null,null,null,null,"a.",null,"Nama"]
[null,null,null,null,null,null,null,"a)","Ayah",null,null,{"$f":"\": \"&VLOOKUP($K$1,INDUK40015000!$A$6:$CK$1005,26)","v":": "}]
[null,"PAS FOTO 3X4cm",null,null,null,null,null,"b) ","Ibu",null,null,{"$f":"\": \"&VLOOKUP($K$1,INDUK40015000!$A$6:$CK$1005,27)","v":": "}]
[null,null,null,null,null,"b.",null,"Pendidikan Tertinggi"]
[null,null,null,null,null,null,null,"a)","Ayah",null,null,{"$f":"\": \"&VLOOKUP($K$1,INDUK40015000!$A$6:$CK$1005,28)","v":": "}]
[null,null,null,null,null,null,null,"b) ","Ibu",null,null,{"$f":"\": \"&VLOOKUP($K$1,INDUK40015000!$A$6:$CK$1005,29)","v":": "}]
[null,null,null,null,null,"c.",null,"Pekerjaan"]
[null,null,null,null,null,null,null,"a)","Ayah",null,null,{"$f":"\": \"&VLOOKUP($K$1,INDUK40015000!$A$6:$CK$1005,30)","v":": "}]
[null,null,null,null,null,null,null,"b) ","Ibu",null,null,{"$f":"\": \"&VLOOKUP($K$1,INDUK40015000!$A$6:$CK$1005,31)","v":": "}]
[null,null,null,null,null,"d.",null,"Wali Murid (jika mempunyai)"]
[null,null,null,null,null,null,null,"a)","Nama",null,null,{"$f":"\": \"&VLOOKUP($K$1,INDUK40015000!$A$6:$CK$1005,32)","v":": "}]
[null,null,null,null,null,null,null,"b)","Hubungan Keluarga",null,null,{"$f":"\": \"&VLOOKUP($K$1,INDUK40015000!$A$6:$CK$1005,33)","v":": "}]
[null,null,null,null,null,null,null,"c)","Pendidikan",null,null,{"$f":"\": \"&VLOOKUP($K$1,INDUK40015000!$A$6:$CK$1005,34)","v":": "}]
[null,null,null,null,null,null,null,"d)","Pekerjaan",null,null,{"$f":"\": \"&VLOOKUP($K$1,INDUK40015000!$A$6:$CK$1005,35)","v":": "}]
[]
[null,null,null,"C.","PERKEMBANGAN MURID"]
[null,null,null,null,"1.","Pendidikan Sebelumnya :"]
[null,null,null,null,null,"a.",null,"Masuk menjadi murid baru tingkat I"]
[null,null,null,null,null,null,null,"a)","Asal Murid",null,null,{"$f":"\": \"&VLOOKUP($K$1,INDUK40015000!$A$6:$CK$1005,37)","v":": "}]
[null,null,null,null,null,null,null,"b)","Nama TK",null,null,{"$f":"\": \"&VLOOKUP($K$1,INDUK40015000!$A$6:$CK$1005,38)","v":": "}]
[null,null,null,null,null,null,null,"c)","Alamat",null,null,{"$f":"\": \"&VLOOKUP($K$1,INDUK40015000!$A$6:$CK$1005,39)","v":": "}]
[null,null,null,null,null,null,null,"d)","Tanggal dan No. STTB",null,null,{"$f":"\": \"&VLOOKUP($K$1,INDUK40015000!$A$6:$CK$1005,40)","v":": "}]
[null,null,null,null,null,"b.",null,"Pindahan dari sekolah lain"]
[null,null,null,null,null,null,null,"a)","Nama Sekolah Asal",null,null,{"$f":"\": \"&VLOOKUP($K$1,INDUK40015000!$A$6:$CK$1005,41)","v":": "}]
[null,null,null,null,null,null,null,"b)","Dari Tingkat",null,null,{"$f":"\": \"&VLOOKUP($K$1,INDUK40015000!$A$6:$CK$1005,42)","v":": "}]
[null,null,null,null,null,null,null,"c)","Diterima Tanggal",null,null,{"$f":"\": \"&VLOOKUP($K$1,INDUK40015000!$A$6:$CK$1005,43)","v":": "}]
[null,null,null,null,"2.","Prestasi Belajar (hal. Berikut)"]
[null,null,null,null,"3.","Keadaan Jasmani"]
[null,null,null,"a.","Tahun",null,null,null,{"$f":"VLOOKUP($K$1,INDUK40015000!$A$6:$CA$1005,45)","v":0},{"$f":"VLOOKUP($K$1,INDUK40015000!$A$6:$CA$1005,50)","v":0},{"$f":"VLOOKUP($K$1,INDUK40015000!$A$6:$CA$1005,55)","v":0},{"$f":"VLOOKUP($K$1,INDUK40015000!$A$6:$CK$1005,60)","v":0},{"$f":"VLOOKUP($K$1,INDUK40015000!$A$6:$CA$1005,65)","v":0},{"$f":"VLOOKUP($K$1,INDUK40015000!$A$6:$CA$1005,70)","v":0},{"$f":"VLOOKUP($K$1,INDUK40015000!$A$6:$CA$1005,75)","v":0}]
[null,"PAS FOTO 3X4cm",null,"b.","Berat Badan",null,null,null,{"$f":"VLOOKUP($K$1,INDUK40015000!$A$6:$CK$1005,46)&\" Kg\"","v":" Kg"},{"$f":"VLOOKUP($K$1,INDUK40015000!$A$6:$CK$1005,51)&\" Kg\"","v":" Kg"},{"$f":"VLOOKUP($K$1,INDUK40015000!$A$6:$CK$1005,56)&\" Kg\"","v":" Kg"},{"$f":"VLOOKUP($K$1,INDUK40015000!$A$6:$CK$1005,61)&\" Kg\"","v":" Kg"},{"$f":"VLOOKUP($K$1,INDUK40015000!$A$6:$CK$1005,66)&\" Kg\"","v":" Kg"},{"$f":"VLOOKUP($K$1,INDUK40015000!$A$6:$CK$1005,71)&\" Kg\"","v":" Kg"},{"$f":"VLOOKUP($K$1,INDUK40015000!$A$6:$CK$1005,76)&\" Kg\"","v":" Kg"}]
[null,null,null,"c.","Tinggi Badan",null,null,null,{"$f":"VLOOKUP($K$1,INDUK40015000!$A$6:$CK$1005,47)&\" Cm\"","v":" Cm"},{"$f":"VLOOKUP($K$1,INDUK40015000!$A$6:$CK$1005,52)&\" Cm\"","v":" Cm"},{"$f":"VLOOKUP($K$1,INDUK40015000!$A$6:$CK$1005,57)&\" Cm\"","v":" Cm"},{"$f":"VLOOKUP($K$1,INDUK40015000!$A$6:$CK$1005,62)&\" Cm\"","v":" Cm"},{"$f":"VLOOKUP($K$1,INDUK40015000!$A$6:$CK$1005,67)&\" Cm\"","v":" Cm"},{"$f":"VLOOKUP($K$1,INDUK40015000!$A$6:$CK$1005,72)&\" Cm\"","v":" Cm"},{"$f":"VLOOKUP($K$1,INDUK40015000!$A$6:$CK$1005,77)&\" Cm\"","v":" Cm"}]
[null,null,null,"d.","Penyakit",null,null,null,{"$f":"VLOOKUP($K$1,INDUK40015000!$A$6:$CK$1005,48)","v":0},{"$f":"VLOOKUP($K$1,INDUK40015000!$A$6:$CK$1005,53)","v":0},{"$f":"VLOOKUP($K$1,INDUK40015000!$A$6:$CK$1005,58)","v":0},{"$f":"VLOOKUP($K$1,INDUK40015000!$A$6:$CK$1005,63)","v":0},{"$f":"VLOOKUP($K$1,INDUK40015000!$A$6:$CK$1005,68)","v":0},{"$f":"VLOOKUP($K$1,INDUK40015000!$A$6:$CK$1005,73)","v":0},{"$f":"VLOOKUP($K$1,INDUK40015000!$A$6:$CK$1005,78)","v":0}]
[null,null,null,"e.","Kelainan Jasmani",null,null,null,{"$f":"VLOOKUP($K$1,INDUK40015000!$A$6:$CK$1005,49)","v":0},{"$f":"VLOOKUP($K$1,INDUK40015000!$A$6:$CK$1005,54)","v":0},{"$f":"VLOOKUP($K$1,INDUK40015000!$A$6:$CK$1005,59)","v":0},{"$f":"VLOOKUP($K$1,INDUK40015000!$A$6:$CK$1005,64)","v":0},{"$f":"VLOOKUP($K$1,INDUK40015000!$A$6:$CK$1005,69)","v":0},{"$f":"VLOOKUP($K$1,INDUK40015000!$A$6:$CK$1005,74)","v":0},{"$f":"VLOOKUP($K$1,INDUK40015000!$A$6:$CK$1005,79)","v":0}]
[]
[null,null,null,"D.","BEA SISWA ( Jenis Beasiswa )",null,null,null,null,null,null,{"$f":"\": \"&VLOOKUP($K$1,INDUK40015000!$A$6:$CK$1005,80)","v":": "}]
[null,null,null,"E.","MENINGGALKAN MADRASAH"]
[null,null,null,null,"1.","Tamat Belajar"]
[null,null,null,null,null,"a)",null,"Tahun Tamat",null,null,null,{"$f":"\": Tahun: \"&VLOOKUP($K$1,INDUK40015000!$A$6:$CK$1005,81)","v":": Tahun: "},null,{"$f":"\"No.STTB : \"&VLOOKUP($K$1,INDUK40015000!$A$6:$CK$1005,82)","v":"No.STTB : "}]
[null,null,null,null,null,"b)",null,"Melanjutkan Madrasah",null,null,null,{"$f":"\": \"&VLOOKUP($K$1,INDUK40015000!$A$6:$CK$1005,83)","v":": "}]
[null,null,null,null,"2.","Pindah Madrasah"]
[null,null,null,null,null,"a)",null,"Dari Tingkat",null,null,null,{"$f":"\": \"&VLOOKUP($K$1,INDUK40015000!$A$6:$CK$1005,84)","v":": "}]
[null,null,null,null,null,"b)",null,"Ke Sekolah",null,null,null,{"$f":"\": \"&VLOOKUP($K$1,INDUK40015000!$A$6:$CK$1005,85)","v":": "}]
[null,null,null,null,null,"c)",null,"Ke Tingkat",null,null,null,{"$f":"\": \"&VLOOKUP($K$1,INDUK40015000!$A$6:$CK$1005,86)","v":": "}]
[null,null,null,null,null,"d)",null,"Tanggal",null,null,null,{"$f":"\": \"&VLOOKUP($K$1,INDUK40015000!$A$6:$CK$1005,87)","v":": "}]
[null,null,null,null,"3.","Keluar Madrasah"]
[null,null,null,null,null,"a.",null,"Tanggal",null,null,null,{"$f":"\": \"&VLOOKUP($K$1,INDUK40015000!$A$6:$CK$1005,88)","v":": "}]
[null,null,null,null,null,"b.",null,"Alasan",null,null,null,{"$f":"\": \"&VLOOKUP($K$1,INDUK40015000!$A$6:$CK$1005,89)","v":": "}]

{"sheet":"INDUK40015000HAL2","index":5,"n_rows":53,"n_cols":32,"rows_kept":53,"cut":false,"hidden":false,"merged":[[0,26,0,27],[1,0,4,0],[1,1,4,4],[1,5,1,8],[1,9,1,12],[1,13,1,16],[1,17,1,20],[1,21,1,24],[1,25,1,28],[3,7,3,8],[1,29,1,30],[2,5,2,8],[2,9,2,12],[2,13,2,16],[2,17,2,20],[2,21,2,24],[2,25,2,28],[2,29,4,29],[2,30,4,30],[3,5,3,6],[3,27,3,28],[5,0,9,0],[5,1,5,4],[5,5,5,30],[6,2,6,4],[7,2,7,4],[8,2,8,4],[3,9,3,10],[3,11,3,12],[3,13,3,14],[3,15,3,16],[3,17,3,18],[3,19,3,20],[9,2,9,4],[10,1,10,4],[11,1,11,4],[12,1,12,4],[13,1,13,4],[14,1,14,4],[3,21,3,22],[3,23,3,24],[3,25,3,26],[15,1,15,4],[16,1,16,4],[17,1,17,4],[18,0,21,0],[18,1,18,4],[18,5,18,30],[19,2,19,4],[20,2,20,4],[21,2,21,4],[22,0,22,4],[22,5,22,30],[23,1,23,4],[23,5,23,6],[23,7,23,8],[23,9,23,10],[23,11,23,12],[23,13,23,14],[23,15,23,16],[23,17,23,18],[23,19,23,20],[24,1,24,4],[24,5,24,6],[24,7,24,8],[24,9,24,10],[24,11,24,12],[24,25,24,26],[24,27,24,28],[24,19,24,20],[24,21,24,22],[24,23,24,24],[25,15,25,16],[25,17,25,18],[24,13,24,14],[24,15,24,16],[24,17,24,18],[23,21,23,22],[23,23,23,24],[23,25,23,26],[23,27,23,28],[26,13,26,14],[26,15,26,16],[26,17,26,18],[25,19,25,20],[25,21,25,22],[25,23,25,24],[25,25,25,26],[25,27,25,28],[26,0,26,4],[26,5,26,6],[26,7,26,8],[26,9,26,10],[26,11,26,12],[26,25,26,26],[26,27,26,28],[26,19,26,20],[26,21,26,22],[26,23,26,24],[25,1,25,4],[25,5,25,6],[25,7,25,8],[25,9,25,10],[25,11,25,12],[25,13,25,14],[27,19,27,20],[27,21,27,22],[27,23,27,24],[27,25,27,26],[27,27,27,28],[28,0,28,4],[28,5,28,6],[28,7,28,8],[28,9,28,10],[28,11,28,12],[28,25,28,26],[28,27,28,28],[27,0,27,4],[27,5,27,6],[27,7,27,8],[27,9,27,10],[27,11,27,12],[27,13,27,14],[27,15,27,16],[27,17,27,18],[29,0,29,4],[29,5,29,30],[30,1,30,4],[30,5,30,6],[30,7,30,8],[30,9,30,10],[30,11,30,12],[30,13,30,14],[28,13,28,14],[28,15,28,16],[28,17,28,18],[28,19,28,20],[28,21,28,22],[28,23,28,24],[30,27,30,28],[30,15,30,16],[30,17,30,18],[30,19,30,20],[30,21,30,22],[30,23,30,24],[30,25,30,26],[31,21,31,22],[31,23,31,24],[31,25,31,26],[31,27,31,28],[32,1,32,4],[32,5,32,6],[32,7,32,8],[32,9,32,10],[32,11,32,12],[32,13,32,14],[31,1,31,4],[31,5,31,6],[31,7,31,8],[31,9,31,10],[31,11,31,12],[31,13,31,14],[31,15,31,16],[31,17,31,18],[31,19,31,20],[34,23,34,24],[34,25,34,26],[34,27,34,28],[32,27,32,28],[33,0,33,4],[33,5,33,30],[34,1,34,3],[34,5,34,6],[34,7,34,8],[34,9,34,10],[34,11,34,12],[34,13,34,14],[34,15,34,16],[32,15,32,16],[32,17,32,18],[32,19,32,20],[32,21,32,22],[32,23,32,24],[32,25,32,26],[35,21,35,22],[35,23,35,24],[35,25,35,26],[35,27,35,28],[36,1,36,3],[36,5,36,6],[36,7,36,8],[36,9,36,10],[36,11,36,12],[36,13,36,14],[35,1,35,3],[35,5,35,6],[35,7,35,8],[35,9,35,10],[35,11,35,12],[35,13,35,14],[35,15,35,16],[35,17,35,18],[35,19,35,20],[39,3,39,10],[39,16,39,20],[39,28,39,30],[43,3,43,11],[43,16,43,22],[43,27,43,30],[36,27,36,28],[37,0,37,4],[37,5,37,8],[37,9,37,12],[37,13,37,16],[37,17,37,20],[37,21,37,24],[37,25,37,28],[36,15,36,16],[36,17,36,18],[36,19,36,20],[36,21,36,22],[36,23,36,24],[36,25,36,26],[34,29,37,30],[34,17,34,18],[34,19,34,20],[34,21,34,22],[52,4,52,11],[52,16,52,22],[52,27,52,30],[45,3,45,11],[45,16,45,22],[45,27,45,30],[50,4,50,11],[50,16,50,22],[50,27,50,30]]}
["V.","PENILAIAN HASIL BELAJAR ",null,null,null,null,null,null,null,null,null,null,null,null,null,null,null,null,null,null,null,"NO.INDUK",null,null,null,":",4002]
["NO","Mata Pelajaran ",null,null,null,{"$f":"\"TP. \"&IF(VLOOKUP($AA$1,INDUK40015000!$A$6:$RL$1005,147,)=0,\"-\",VLOOKUP($AA$1,INDUK40015000!$A$6:$RL$1005,147,))","v":"TP. B56"},null,null,null,{"$f":"\"TP. \"&IF(VLOOKUP($AA$1,INDUK40015000!$A$6:$RL$1005,204,)=0,\"-\",VLOOKUP($AA$1,INDUK40015000!$A$6:$RL$1005,204,))","v":"TP. B111"},null,null,null,{"$f":"\"TP. \"&IF(VLOOKUP($AA$1,INDUK40015000!$A$6:$RL$1005,261,)=0,\"-\",VLOOKUP($AA$1,INDUK40015000!$A$6:$RL$1005,261,))","v":"TP. B167"},null,null,null,{"$f":"\"TP. \"&IF(VLOOKUP($AA$1,INDUK40015000!$A$6:$RL$1005,318,)=0,\"-\",VLOOKUP($AA$1,INDUK40015000!$A$6:$RL$1005,318,))","v":"TP. B223"},null,null,null,{"$f":"\"TP. \"&IF(VLOOKUP($AA$1,INDUK40015000!$A$6:$RL$1005,375,)=0,\"-\",VLOOKUP($AA$1,INDUK40015000!$A$6:$RL$1005,375,))","v":"TP. B279"},null,null,null,{"$f":"\"TP. \"&IF(VLOOKUP($AA$1,INDUK40015000!$A$6:$RL$1005,432,)=0,\"-\",VLOOKUP($AA$1,INDUK40015000!$A$6:$RL$1005,432,))","v":"TP. LOELOES"},null,null,null,"NILAI",null,15]
[null,null,null,null,null,"KELAS 1",null,null,null,"KELAS 2",null,null,null,"KELAS 3",null,null,null,"KELAS 4",null,null,null,"KELAS 5",null,null,null,"KELAS 6",null,null,null,"NEM","STTB/   IJAZAH"]
[null,null,null,null,null,"Smt I",null,"Smt II",null,"Smt I",null,"Smt II",null,"Smt I",null,"Smt II",null,"Smt I",null,"Smt II",null,"Smt I",null,"Smt II",null,"Smt I",null,"Smt II"]
[null,null,null,null,null,"KKM","Nilai","KKM","Nilai","KKM","Nilai","KKM","Nilai","KKM","Nilai","KKM","Nilai","KKM","Nilai","KKM","Nilai","KKM","Nilai","KKM","Nilai","KKM","Nilai","KKM","Nilai"]
[1,"Pendidikan Agama Islam "]
[null,"a.","Al-qur'an Hadits",null,null,null,{"$f":"IF(VLOOKUP($AA$1,INDUK40015000!$A$6:$RL$1005,92,)=0,\"-\",VLOOKUP($AA$1,INDUK40015000!$A$6:$RL$1005,92,))","v":"B1"},null,{"$f":"IF(VLOOKUP($AA$1,INDUK40015000!$A$6:$RL$1005,93,)=0,\"-\",VLOOKUP($AA$1,INDUK40015000!$A$6:$RL$1005,93,))","v":"B2"},null,{"$f":"IF(VLOOKUP($AA$1,INDUK40015000!$A$6:$RL$1005,149,)=0,\"-\",VLOOKUP($AA$1,INDUK40015000!$A$6:$RL$1005,149,))","v":"B56"},null,{"$f":"IF(VLOOKUP($AA$1,INDUK40015000!$A$6:$RL$1005,150,)=0,\"-\",VLOOKUP($AA$1,INDUK40015000!$A$6:$RL$1005,150,))","v":"B57"},null,{"$f":"IF(VLOOKUP($AA$1,INDUK40015000!$A$6:$RL$1005,206,)=0,\"-\",VLOOKUP($AA$1,INDUK40015000!$A$6:$RL$1005,206,))","v":"B112"},null,{"$f":"IF(VLOOKUP($AA$1,INDUK40015000!$A$6:$RL$1005,207,)=0,\"-\",VLOOKUP($AA$1,INDUK40015000!$A$6:$RL$1005,207,))","v":"B113"},null,{"$f":"IF(VLOOKUP($AA$1,INDUK40015000!$A$6:$RL$1005,263,)=0,\"-\",VLOOKUP($AA$1,INDUK40015000!$A$6:$RL$1005,263,))","v":"B168"},null,{"$f":"IF(VLOOKUP($AA$1,INDUK40015000!$A$6:$RL$1005,264,)=0,\"-\",VLOOKUP($AA$1,INDUK40015000!$A$6:$RL$1005,264,))","v":"B169"},null,{"$f":"IF(VLOOKUP($AA$1,INDUK40015000!$A$6:$RL$1005,320,)=0,\"-\",VLOOKUP($AA$1,INDUK40015000!$A$6:$RL$1005,320,))","v":"B224"},null,{"$f":"IF(VLOOKUP($AA$1,INDUK40015000!$A$6:$RL$1005,321,)=0,\"-\",VLOOKUP($AA$1,INDUK40015000!$A$6:$RL$1005,321,))","v":"B225"},null,{"$f":"IF(VLOOKUP($AA$1,INDUK40015000!$A$6:$RL$1005,377,)=0,\"-\",VLOOKUP($AA$1,INDUK40015000!$A$6:$RL$1005,377,))","v":"B280"},null,{"$f":"IF(VLOOKUP($AA$1,INDUK40015000!$A$6:$RL$1005,378,)=0,\"-\",VLOOKUP($AA$1,INDUK40015000!$A$6:$RL$1005,378,))","v":"B281"},{"$f":"IF(VLOOKUP($AA$1,INDUK40015000!$A$6:$RL$1005,451,)=0,\"-\",VLOOKUP($AA$1,INDUK40015000!$A$6:$RL$1005,451,))","v":"B352"},{"$f":"IF(VLOOKUP($AA$1,INDUK40015000!$A$6:$RL$1005,452,)=0,\"-\",VLOOKUP($AA$1,INDUK40015000!$A$6:$RL$1005,452,))","v":"B353"},1]
[null,"b.","Aqidah Akhlaq",null,null,null,{"$f":"IF(VLOOKUP($AA$1,INDUK40015000!$A$6:$RL$1005,94,)=0,\"-\",VLOOKUP($AA$1,INDUK40015000!$A$6:$RL$1005,94,))","v":"B3"},null,{"$f":"IF(VLOOKUP($AA$1,INDUK40015000!$A$6:$RL$1005,95,)=0,\"-\",VLOOKUP($AA$1,INDUK40015000!$A$6:$RL$1005,95,))","v":"B4"},null,{"$f":"IF(VLOOKUP($AA$1,INDUK40015000!$A$6:$RL$1005,151,)=0,\"-\",VLOOKUP($AA$1,INDUK40015000!$A$6:$RL$1005,151,))","v":"B58"},null,{"$f":"IF(VLOOKUP($AA$1,INDUK40015000!$A$6:$RL$1005,152,)=0,\"-\",VLOOKUP($AA$1,INDUK40015000!$A$6:$RL$1005,152,))","v":"B59"},null,{"$f":"IF(VLOOKUP($AA$1,INDUK40015000!$A$6:$RL$1005,208,)=0,\"-\",VLOOKUP($AA$1,INDUK40015000!$A$6:$RL$1005,208,))","v":"B114"},null,{"$f":"IF(VLOOKUP($AA$1,INDUK40015000!$A$6:$RL$1005,209,)=0,\"-\",VLOOKUP($AA$1,INDUK40015000!$A$6:$RL$1005,209,))","v":"B115"},null,{"$f":"IF(VLOOKUP($AA$1,INDUK40015000!$A$6:$RL$1005,265,)=0,\"-\",VLOOKUP($AA$1,INDUK40015000!$A$6:$RL$1005,265,))","v":"B170"},null,{"$f":"IF(VLOOKUP($AA$1,INDUK40015000!$A$6:$RL$1005,266,)=0,\"-\",VLOOKUP($AA$1,INDUK40015000!$A$6:$RL$1005,266,))","v":"B171"},null,{"$f":"IF(VLOOKUP($AA$1,INDUK40015000!$A$6:$RL$1005,322,)=0,\"-\",VLOOKUP($AA$1,INDUK40015000!$A$6:$RL$1005,322,))","v":"B226"},null,{"$f":"IF(VLOOKUP($AA$1,INDUK40015000!$A$6:$RL$1005,323,)=0,\"-\",VLOOKUP($AA$1,INDUK40015000!$A$6:$RL$1005,323,))","v":"B227"},null,{"$f":"IF(VLOOKUP($AA$1,INDUK40015000!$A$6:$RL$1005,379,)=0,\"-\",VLOOKUP($AA$1,INDUK40015000!$A$6:$RL$1005,379,))","v":"B282"},null,{"$f":"IF(VLOOKUP($AA$1,INDUK40015000!$A$6:$RL$1005,380,)=0,\"-\",VLOOKUP($AA$1,INDUK40015000!$A$6:$RL$1005,380,))","v":"B283"},{"$f":"IF(VLOOKUP($AA$1,INDUK40015000!$A$6:$RL$1005,453,)=0,\"-\",VLOOKUP($AA$1,INDUK40015000!$A$6:$RL$1005,453,))","v":"B354"},{"$f":"IF(VLOOKUP($AA$1,INDUK40015000!$A$6:$RL$1005,454,)=0,\"-\",VLOOKUP($AA$1,INDUK40015000!$A$6:$RL$1005,454,))","v":"B355"},2]
[null,"c.","Fiqih",null,null,null,{"$f":"IF(VLOOKUP($AA$1,INDUK40015000!$A$6:$RL$1005,96,)=0,\"-\",VLOOKUP($AA$1,INDUK40015000!$A$6:$RL$1005,96,))","v":"B5"},null,{"$f":"IF(VLOOKUP($AA$1,INDUK40015000!$A$6:$RL$1005,97,)=0,\"-\",VLOOKUP($AA$1,INDUK40015000!$A$6:$RL$1005,97,))","v":"B6"},null,{"$f":"IF(VLOOKUP($AA$1,INDUK40015000!$A$6:$RL$1005,153,)=0,\"-\",VLOOKUP($AA$1,INDUK40015000!$A$6:$RL$1005,153,))","v":"B60"},null,{"$f":"IF(VLOOKUP($AA$1,INDUK40015000!$A$6:$RL$1005,154,)=0,\"-\",VLOOKUP($AA$1,INDUK40015000!$A$6:$RL$1005,154,))","v":"B61"},null,{"$f":"IF(VLOOKUP($AA$1,INDUK40015000!$A$6:$RL$1005,210,)=0,\"-\",VLOOKUP($AA$1,INDUK40015000!$A$6:$RL$1005,210,))","v":"B116"},null,{"$f":"IF(VLOOKUP($AA$1,INDUK40015000!$A$6:$RL$1005,211,)=0,\"-\",VLOOKUP($AA$1,INDUK40015000!$A$6:$RL$1005,211,))","v":"B117"},null,{"$f":"IF(VLOOKUP($AA$1,INDUK40015000!$A$6:$RL$1005,267,)=0,\"-\",VLOOKUP($AA$1,INDUK40015000!$A$6:$RL$1005,267,))","v":"B172"},null,{"$f":"IF(VLOOKUP($AA$1,INDUK40015000!$A$6:$RL$1005,268,)=0,\"-\",VLOOKUP($AA$1,INDUK40015000!$A$6:$RL$1005,268,))","v":"B173"},null,{"$f":"IF(VLOOKUP($AA$1,INDUK40015000!$A$6:$RL$1005,324,)=0,\"-\",VLOOKUP($AA$1,INDUK40015000!$A$6:$RL$1005,324,))","v":"B228"},null,{"$f":"IF(VLOOKUP($AA$1,INDUK40015000!$A$6:$RL$1005,325,)=0,\"-\",VLOOKUP($AA$1,INDUK40015000!$A$6:$RL$1005,325,))","v":"B229"},null,{"$f":"IF(VLOOKUP($AA$1,INDUK40015000!$A$6:$RL$1005,381,)=0,\"-\",VLOOKUP($AA$1,INDUK40015000!$A$6:$RL$1005,381,))","v":"B284"},null,{"$f":"IF(VLOOKUP($AA$1,INDUK40015000!$A$6:$RL$1005,382,)=0,\"-\",VLOOKUP($AA$1,INDUK40015000!$A$6:$RL$1005,382,))","v":"B285"},{"$f":"IF(VLOOKUP($AA$1,INDUK40015000!$A$6:$RL$1005,455,)=0,\"-\",VLOOKUP($AA$1,INDUK40015000!$A$6:$RL$1005,455,))","v":"B356"},{"$f":"IF(VLOOKUP($AA$1,INDUK40015000!$A$6:$RL$1005,456,)=0,\"-\",VLOOKUP($AA$1,INDUK40015000!$A$6:$RL$1005,456,))","v":"B357"},3]
[null,"d.","Sejarah Kebudayaan Islam",null,null,null,{"$f":"IF(VLOOKUP($AA$1,INDUK40015000!$A$6:$RL$1005,98,)=0,\"-\",VLOOKUP($AA$1,INDUK40015000!$A$6:$RL$1005,98,))","v":"B7"},null,{"$f":"IF(VLOOKUP($AA$1,INDUK40015000!$A$6:$RL$1005,99,)=0,\"-\",VLOOKUP($AA$1,INDUK40015000!$A$6:$RL$1005,99,))","v":"B8"},null,{"$f":"IF(VLOOKUP($AA$1,INDUK40015000!$A$6:$RL$1005,155,)=0,\"-\",VLOOKUP($AA$1,INDUK40015000!$A$6:$RL$1005,155,))","v":"B62"},null,{"$f":"IF(VLOOKUP($AA$1,INDUK40015000!$A$6:$RL$1005,156,)=0,\"-\",VLOOKUP($AA$1,INDUK40015000!$A$6:$RL$1005,156,))","v":"B63"},null,{"$f":"IF(VLOOKUP($AA$1,INDUK40015000!$A$6:$RL$1005,212,)=0,\"-\",VLOOKUP($AA$1,INDUK40015000!$A$6:$RL$1005,212,))","v":"B118"},null,{"$f":"IF(VLOOKUP($AA$1,INDUK40015000!$A$6:$RL$1005,213,)=0,\"-\",VLOOKUP($AA$1,INDUK40015000!$A$6:$RL$1005,213,))","v":"B119"},null,{"$f":"IF(VLOOKUP($AA$1,INDUK40015000!$A$6:$RL$1005,269,)=0,\"-\",VLOOKUP($AA$1,INDUK40015000!$A$6:$RL$1005,269,))","v":"B174"},null,{"$f":"IF(VLOOKUP($AA$1,INDUK40015000!$A$6:$RL$1005,270,)=0,\"-\",VLOOKUP($AA$1,INDUK40015000!$A$6:$RL$1005,270,))","v":"B175"},null,{"$f":"IF(VLOOKUP($AA$1,INDUK40015000!$A$6:$RL$1005,326,)=0,\"-\",VLOOKUP($AA$1,INDUK40015000!$A$6:$RL$1005,326,))","v":"B230"},null,{"$f":"IF(VLOOKUP($AA$1,INDUK40015000!$A$6:$RL$1005,327,)=0,\"-\",VLOOKUP($AA$1,INDUK40015000!$A$6:$RL$1005,327,))","v":"B231"},null,{"$f":"IF(VLOOKUP($AA$1,INDUK40015000!$A$6:$RL$1005,383,)=0,\"-\",VLOOKUP($AA$1,INDUK40015000!$A$6:$RL$1005,383,))","v":"B286"},null,{"$f":"IF(VLOOKUP($AA$1,INDUK40015000!$A$6:$RL$1005,384,)=0,\"-\",VLOOKUP($AA$1,INDUK40015000!$A$6:$RL$1005,384,))","v":"B287"},{"$f":"IF(VLOOKUP($AA$1,INDUK40015000!$A$6:$RL$1005,457,)=0,\"-\",VLOOKUP($AA$1,INDUK40015000!$A$6:$RL$1005,457,))","v":"B358"},{"$f":"IF(VLOOKUP($AA$1,INDUK40015000!$A$6:$RL$1005,458,)=0,\"-\",VLOOKUP($AA$1,INDUK40015000!$A$6:$RL$1005,458,))","v":"B359"},4]
[2,"Pendidikan Kewarganegaraan",null,null,null,null,{"$f":"IF(VLOOKUP($AA$1,INDUK40015000!$A$6:$RL$1005,104,)=0,\"-\",VLOOKUP($AA$1,INDUK40015000!$A$6:$RL$1005,104,))","v":"B13"},null,{"$f":"IF(VLOOKUP($AA$1,INDUK40015000!$A$6:$RL$1005,105,)=0,\"-\",VLOOKUP($AA$1,INDUK40015000!$A$6:$RL$1005,105,))","v":"B14"},null,{"$f":"IF(VLOOKUP($AA$1,INDUK40015000!$A$6:$RL$1005,161,)=0,\"-\",VLOOKUP($AA$1,INDUK40015000!$A$6:$RL$1005,161,))","v":"B68"},null,{"$f":"IF(VLOOKUP($AA$1,INDUK40015000!$A$6:$RL$1005,162,)=0,\"-\",VLOOKUP($AA$1,INDUK40015000!$A$6:$RL$1005,162,))","v":"B69"},null,{"$f":"IF(VLOOKUP($AA$1,INDUK40015000!$A$6:$RL$1005,218,)=0,\"-\",VLOOKUP($AA$1,INDUK40015000!$A$6:$RL$1005,218,))","v":"B124"},null,{"$f":"IF(VLOOKUP($AA$1,INDUK40015000!$A$6:$RL$1005,219,)=0,\"-\",VLOOKUP($AA$1,INDUK40015000!$A$6:$RL$1005,219,))","v":"B125"},null,{"$f":"IF(VLOOKUP($AA$1,INDUK40015000!$A$6:$RL$1005,275,)=0,\"-\",VLOOKUP($AA$1,INDUK40015000!$A$6:$RL$1005,275,))","v":"B180"},null,{"$f":"IF(VLOOKUP($AA$1,INDUK40015000!$A$6:$RL$1005,276,)=0,\"-\",VLOOKUP($AA$1,INDUK40015000!$A$6:$RL$1005,276,))","v":"B181"},null,{"$f":"IF(VLOOKUP($AA$1,INDUK40015000!$A$6:$RL$1005,332,)=0,\"-\",VLOOKUP($AA$1,INDUK40015000!$A$6:$RL$1005,332,))","v":"B236"},null,{"$f":"IF(VLOOKUP($AA$1,INDUK40015000!$A$6:$RL$1005,333,)=0,\"-\",VLOOKUP($AA$1,INDUK40015000!$A$6:$RL$1005,333,))","v":"B237"},null,{"$f":"IF(VLOOKUP($AA$1,INDUK40015000!$A$6:$RL$1005,389,)=0,\"-\",VLOOKUP($AA$1,INDUK40015000!$A$6:$RL$1005,389,))","v":"B292"},null,{"$f":"IF(VLOOKUP($AA$1,INDUK40015000!$A$6:$RL$1005,390,)=0,\"-\",VLOOKUP($AA$1,INDUK40015000!$A$6:$RL$1005,390,))","v":"B293"},{"$f":"IF(VLOOKUP($AA$1,INDUK40015000!$A$6:$RL$1005,463,)=0,\"-\",VLOOKUP($AA$1,INDUK40015000!$A$6:$RL$1005,463,))","v":"B364"},{"$f":"IF(VLOOKUP($AA$1,INDUK40015000!$A$6:$RL$1005,464,)=0,\"-\",VLOOKUP($AA$1,INDUK40015000!$A$6:$RL$1005,464,))","v":"B365"},7]
[3,"Bahasa Indonesia",null,null,null,null,{"$f":"IF(VLOOKUP($AA$1,INDUK40015000!$A$6:$RL$1005,106,)=0,\"-\",VLOOKUP($AA$1,INDUK40015000!$A$6:$RL$1005,106,))","v":"B15"},null,{"$f":"IF(VLOOKUP($AA$1,INDUK40015000!$A$6:$RL$1005,107,)=0,\"-\",VLOOKUP($AA$1,INDUK40015000!$A$6:$RL$1005,107,))","v":"B16"},null,{"$f":"IF(VLOOKUP($AA$1,INDUK40015000!$A$6:$RL$1005,163,)=0,\"-\",VLOOKUP($AA$1,INDUK40015000!$A$6:$RL$1005,163,))","v":"B70"},null,{"$f":"IF(VLOOKUP($AA$1,INDUK40015000!$A$6:$RL$1005,164,)=0,\"-\",VLOOKUP($AA$1,INDUK40015000!$A$6:$RL$1005,164,))","v":"B71"},null,{"$f":"IF(VLOOKUP($AA$1,INDUK40015000!$A$6:$RL$1005,220,)=0,\"-\",VLOOKUP($AA$1,INDUK40015000!$A$6:$RL$1005,220,))","v":"B126"},null,{"$f":"IF(VLOOKUP($AA$1,INDUK40015000!$A$6:$RL$1005,221,)=0,\"-\",VLOOKUP($AA$1,INDUK40015000!$A$6:$RL$1005,221,))","v":"B127"},null,{"$f":"IF(VLOOKUP($AA$1,INDUK40015000!$A$6:$RL$1005,277,)=0,\"-\",VLOOKUP($AA$1,INDUK40015000!$A$6:$RL$1005,277,))","v":"B182"},null,{"$f":"IF(VLOOKUP($AA$1,INDUK40015000!$A$6:$RL$1005,278,)=0,\"-\",VLOOKUP($AA$1,INDUK40015000!$A$6:$RL$1005,278,))","v":"B183"},null,{"$f":"IF(VLOOKUP($AA$1,INDUK40015000!$A$6:$RL$1005,334,)=0,\"-\",VLOOKUP($AA$1,INDUK40015000!$A$6:$RL$1005,334,))","v":"B238"},null,{"$f":"IF(VLOOKUP($AA$1,INDUK40015000!$A$6:$RL$1005,335,)=0,\"-\",VLOOKUP($AA$1,INDUK40015000!$A$6:$RL$1005,335,))","v":"B239"},null,{"$f":"IF(VLOOKUP($AA$1,INDUK40015000!$A$6:$RL$1005,391,)=0,\"-\",VLOOKUP($AA$1,INDUK40015000!$A$6:$RL$1005,391,))","v":"B294"},null,{"$f":"IF(VLOOKUP($AA$1,INDUK40015000!$A$6:$RL$1005,392,)=0,\"-\",VLOOKUP($AA$1,INDUK40015000!$A$6:$RL$1005,392,))","v":"B295"},{"$f":"IF(VLOOKUP($AA$1,INDUK40015000!$A$6:$RL$1005,465,)=0,\"-\",VLOOKUP($AA$1,INDUK40015000!$A$6:$RL$1005,465,))","v":"B366"},{"$f":"IF(VLOOKUP($AA$1,INDUK40015000!$A$6:$RL$1005,466,)=0,\"-\",VLOOKUP($AA$1,INDUK40015000!$A$6:$RL$1005,466,))","v":"B367"},8]
[4,"Bahasa Arab",null,null,null,null,{"$f":"IF(VLOOKUP($AA$1,INDUK40015000!$A$6:$RL$1005,102,)=0,\"-\",VLOOKUP($AA$1,INDUK40015000!$A$6:$RL$1005,102,))","v":"B11"},null,{"$f":"IF(VLOOKUP($AA$1,INDUK40015000!$A$6:$RL$1005,103,)=0,\"-\",VLOOKUP($AA$1,INDUK40015000!$A$6:$RL$1005,103,))","v":"B12"},null,{"$f":"IF(VLOOKUP($AA$1,INDUK40015000!$A$6:$RL$1005,159,)=0,\"-\",VLOOKUP($AA$1,INDUK40015000!$A$6:$RL$1005,159,))","v":"B66"},null,{"$f":"IF(VLOOKUP($AA$1,INDUK40015000!$A$6:$RL$1005,160,)=0,\"-\",VLOOKUP($AA$1,INDUK40015000!$A$6:$RL$1005,160,))","v":"B67"},null,{"$f":"IF(VLOOKUP($AA$1,INDUK40015000!$A$6:$RL$1005,216,)=0,\"-\",VLOOKUP($AA$1,INDUK40015000!$A$6:$RL$1005,216,))","v":"B122"},null,{"$f":"IF(VLOOKUP($AA$1,INDUK40015000!$A$6:$RL$1005,217,)=0,\"-\",VLOOKUP($AA$1,INDUK40015000!$A$6:$RL$1005,217,))","v":"B123"},null,{"$f":"IF(VLOOKUP($AA$1,INDUK40015000!$A$6:$RL$1005,273,)=0,\"-\",VLOOKUP($AA$1,INDUK40015000!$A$6:$RL$1005,273,))","v":"B178"},null,{"$f":"IF(VLOOKUP($AA$1,INDUK40015000!$A$6:$RL$1005,274,)=0,\"-\",VLOOKUP($AA$1,INDUK40015000!$A$6:$RL$1005,274,))","v":"B179"},null,{"$f":"IF(VLOOKUP($AA$1,INDUK40015000!$A$6:$RL$1005,330,)=0,\"-\",VLOOKUP($AA$1,INDUK40015000!$A$6:$RL$1005,330,))","v":"B234"},null,{"$f":"IF(VLOOKUP($AA$1,INDUK40015000!$A$6:$RL$1005,331,)=0,\"-\",VLOOKUP($AA$1,INDUK40015000!$A$6:$RL$1005,331,))","v":"B235"},null,{"$f":"IF(VLOOKUP($AA$1,INDUK40015000!$A$6:$RL$1005,387,)=0,\"-\",VLOOKUP($AA$1,INDUK40015000!$A$6:$RL$1005,387,))","v":"B290"},null,{"$f":"IF(VLOOKUP($AA$1,INDUK40015000!$A$6:$RL$1005,388,)=0,\"-\",VLOOKUP($AA$1,INDUK40015000!$A$6:$RL$1005,388,))","v":"B291"},{"$f":"IF(VLOOKUP($AA$1,INDUK40015000!$A$6:$RL$1005,461,)=0,\"-\",VLOOKUP($AA$1,INDUK40015000!$A$6:$RL$1005,461,))","v":"B362"},{"$f":"IF(VLOOKUP($AA$1,INDUK40015000!$A$6:$RL$1005,462,)=0,\"-\",VLOOKUP($AA$1,INDUK40015000!$A$6:$RL$1005,462,))","v":"B363"},6]
[5,"Matematika",null,null,null,null,{"$f":"IF(VLOOKUP($AA$1,INDUK40015000!$A$6:$RL$1005,108,)=0,\"-\",VLOOKUP($AA$1,INDUK40015000!$A$6:$RL$1005,108,))","v":"B17"},null,{"$f":"IF(VLOOKUP($AA$1,INDUK40015000!$A$6:$RL$1005,109,)=0,\"-\",VLOOKUP($AA$1,INDUK40015000!$A$6:$RL$1005,109,))","v":"B18"},null,{"$f":"IF(VLOOKUP($AA$1,INDUK40015000!$A$6:$RL$1005,165,)=0,\"-\",VLOOKUP($AA$1,INDUK40015000!$A$6:$RL$1005,165,))","v":"B72"},null,{"$f":"IF(VLOOKUP($AA$1,INDUK40015000!$A$6:$RL$1005,166,)=0,\"-\",VLOOKUP($AA$1,INDUK40015000!$A$6:$RL$1005,166,))","v":"B73"},null,{"$f":"IF(VLOOKUP($AA$1,INDUK40015000!$A$6:$RL$1005,222,)=0,\"-\",VLOOKUP($AA$1,INDUK40015000!$A$6:$RL$1005,222,))","v":"B128"},null,{"$f":"IF(VLOOKUP($AA$1,INDUK40015000!$A$6:$RL$1005,223,)=0,\"-\",VLOOKUP($AA$1,INDUK40015000!$A$6:$RL$1005,223,))","v":"B129"},null,{"$f":"IF(VLOOKUP($AA$1,INDUK40015000!$A$6:$RL$1005,279,)=0,\"-\",VLOOKUP($AA$1,INDUK40015000!$A$6:$RL$1005,279,))","v":"B184"},null,{"$f":"IF(VLOOKUP($AA$1,INDUK40015000!$A$6:$RL$1005,280,)=0,\"-\",VLOOKUP($AA$1,INDUK40015000!$A$6:$RL$1005,280,))","v":"B185"},null,{"$f":"IF(VLOOKUP($AA$1,INDUK40015000!$A$6:$RL$1005,336,)=0,\"-\",VLOOKUP($AA$1,INDUK40015000!$A$6:$RL$1005,336,))","v":"B240"},null,{"$f":"IF(VLOOKUP($AA$1,INDUK40015000!$A$6:$RL$1005,337,)=0,\"-\",VLOOKUP($AA$1,INDUK40015000!$A$6:$RL$1005,337,))","v":"B241"},null,{"$f":"IF(VLOOKUP($AA$1,INDUK40015000!$A$6:$RL$1005,393,)=0,\"-\",VLOOKUP($AA$1,INDUK40015000!$A$6:$RL$1005,393,))","v":"B296"},null,{"$f":"IF(VLOOKUP($AA$1,INDUK40015000!$A$6:$RL$1005,394,)=0,\"-\",VLOOKUP($AA$1,INDUK40015000!$A$6:$RL$1005,394,))","v":"B297"},{"$f":"IF(VLOOKUP($AA$1,INDUK40015000!$A$6:$RL$1005,467,)=0,\"-\",VLOOKUP($AA$1,INDUK40015000!$A$6:$RL$1005,467,))","v":"B368"},{"$f":"IF(VLOOKUP($AA$1,INDUK40015000!$A$6:$RL$1005,468,)=0,\"-\",VLOOKUP($AA$1,INDUK40015000!$A$6:$RL$1005,468,))","v":"B369"},9]
[6,"Ilmu Pengetahuan Alam",null,null,null,null,{"$f":"IF(VLOOKUP($AA$1,INDUK40015000!$A$6:$RL$1005,110,)=0,\"-\",VLOOKUP($AA$1,INDUK40015000!$A$6:$RL$1005,110,))","v":"B19"},null,{"$f":"IF(VLOOKUP($AA$1,INDUK40015000!$A$6:$RL$1005,111,)=0,\"-\",VLOOKUP($AA$1,INDUK40015000!$A$6:$RL$1005,111,))","v":"B20"},null,{"$f":"IF(VLOOKUP($AA$1,INDUK40015000!$A$6:$RL$1005,167,)=0,\"-\",VLOOKUP($AA$1,INDUK40015000!$A$6:$RL$1005,167,))","v":"B74"},null,{"$f":"IF(VLOOKUP($AA$1,INDUK40015000!$A$6:$RL$1005,168,)=0,\"-\",VLOOKUP($AA$1,INDUK40015000!$A$6:$RL$1005,168,))","v":"B75"},null,{"$f":"IF(VLOOKUP($AA$1,INDUK40015000!$A$6:$RL$1005,224,)=0,\"-\",VLOOKUP($AA$1,INDUK40015000!$A$6:$RL$1005,224,))","v":"B130"},null,{"$f":"IF(VLOOKUP($AA$1,INDUK40015000!$A$6:$RL$1005,225,)=0,\"-\",VLOOKUP($AA$1,INDUK40015000!$A$6:$RL$1005,225,))","v":"B131"},null,{"$f":"IF(VLOOKUP($AA$1,INDUK40015000!$A$6:$RL$1005,281,)=0,\"-\",VLOOKUP($AA$1,INDUK40015000!$A$6:$RL$1005,281,))","v":"B186"},null,{"$f":"IF(VLOOKUP($AA$1,INDUK40015000!$A$6:$RL$1005,282,)=0,\"-\",VLOOKUP($AA$1,INDUK40015000!$A$6:$RL$1005,282,))","v":"B187"},null,{"$f":"IF(VLOOKUP($AA$1,INDUK40015000!$A$6:$RL$1005,338,)=0,\"-\",VLOOKUP($AA$1,INDUK40015000!$A$6:$RL$1005,338,))","v":"B242"},null,{"$f":"IF(VLOOKUP($AA$1,INDUK40015000!$A$6:$RL$1005,339,)=0,\"-\",VLOOKUP($AA$1,INDUK40015000!$A$6:$RL$1005,339,))","v":"B243"},null,{"$f":"IF(VLOOKUP($AA$1,INDUK40015000!$A$6:$RL$1005,395,)=0,\"-\",VLOOKUP($AA$1,INDUK40015000!$A$6:$RL$1005,395,))","v":"B298"},null,{"$f":"IF(VLOOKUP($AA$1,INDUK40015000!$A$6:$RL$1005,396,)=0,\"-\",VLOOKUP($AA$1,INDUK40015000!$A$6:$RL$1005,396,))","v":"B299"},{"$f":"IF(VLOOKUP($AA$1,INDUK40015000!$A$6:$RL$1005,469,)=0,\"-\",VLOOKUP($AA$1,INDUK40015000!$A$6:$RL$1005,469,))","v":"B370"},{"$f":"IF(VLOOKUP($AA$1,INDUK40015000!$A$6:$RL$1005,470,)=0,\"-\",VLOOKUP($AA$1,INDUK40015000!$A$6:$RL$1005,470,))","v":"B371"},10]
[7,"Ilmu Pengetahuan Sosial",null,null,null,null,{"$f":"IF(VLOOKUP($AA$1,INDUK40015000!$A$6:$RL$1005,112,)=0,\"-\",VLOOKUP($AA$1,INDUK40015000!$A$6:$RL$1005,112,))","v":"B21"},null,{"$f":"IF(VLOOKUP($AA$1,INDUK40015000!$A$6:$RL$1005,113,)=0,\"-\",VLOOKUP($AA$1,INDUK40015000!$A$6:$RL$1005,113,))","v":"B22"},null,{"$f":"IF(VLOOKUP($AA$1,INDUK40015000!$A$6:$RL$1005,169,)=0,\"-\",VLOOKUP($AA$1,INDUK40015000!$A$6:$RL$1005,169,))","v":"B76"},null,{"$f":"IF(VLOOKUP($AA$1,INDUK40015000!$A$6:$RL$1005,170,)=0,\"-\",VLOOKUP($AA$1,INDUK40015000!$A$6:$RL$1005,170,))","v":"B77"},null,{"$f":"IF(VLOOKUP($AA$1,INDUK40015000!$A$6:$RL$1005,226,)=0,\"-\",VLOOKUP($AA$1,INDUK40015000!$A$6:$RL$1005,226,))","v":"B132"},null,{"$f":"IF(VLOOKUP($AA$1,INDUK40015000!$A$6:$RL$1005,227,)=0,\"-\",VLOOKUP($AA$1,INDUK40015000!$A$6:$RL$1005,227,))","v":"B133"},null,{"$f":"IF(VLOOKUP($AA$1,INDUK40015000!$A$6:$RL$1005,283,)=0,\"-\",VLOOKUP($AA$1,INDUK40015000!$A$6:$RL$1005,283,))","v":"B188"},null,{"$f":"IF(VLOOKUP($AA$1,INDUK40015000!$A$6:$RL$1005,284,)=0,\"-\",VLOOKUP($AA$1,INDUK40015000!$A$6:$RL$1005,284,))","v":"B189"},null,{"$f":"IF(VLOOKUP($AA$1,INDUK40015000!$A$6:$RL$1005,340,)=0,\"-\",VLOOKUP($AA$1,INDUK40015000!$A$6:$RL$1005,340,))","v":"B244"},null,{"$f":"IF(VLOOKUP($AA$1,INDUK40015000!$A$6:$RL$1005,341,)=0,\"-\",VLOOKUP($AA$1,INDUK40015000!$A$6:$RL$1005,341,))","v":"B245"},null,{"$f":"IF(VLOOKUP($AA$1,INDUK40015000!$A$6:$RL$1005,397,)=0,\"-\",VLOOKUP($AA$1,INDUK40015000!$A$6:$RL$1005,397,))","v":"B300"},null,{"$f":"IF(VLOOKUP($AA$1,INDUK40015000!$A$6:$RL$1005,398,)=0,\"-\",VLOOKUP($AA$1,INDUK40015000!$A$6:$RL$1005,398,))","v":"B301"},{"$f":"IF(VLOOKUP($AA$1,INDUK40015000!$A$6:$RL$1005,471,)=0,\"-\",VLOOKUP($AA$1,INDUK40015000!$A$6:$RL$1005,471,))","v":"B372"},{"$f":"IF(VLOOKUP($AA$1,INDUK40015000!$A$6:$RL$1005,472,)=0,\"-\",VLOOKUP($AA$1,INDUK40015000!$A$6:$RL$1005,472,))","v":"B373"},11]
[8,"Seni Budaya dan Keterampilan",null,null,null,null,{"$f":"IF(VLOOKUP($AA$1,INDUK40015000!$A$6:$RL$1005,114,)=0,\"-\",VLOOKUP($AA$1,INDUK40015000!$A$6:$RL$1005,114,))","v":"B23"},null,{"$f":"IF(VLOOKUP($AA$1,INDUK40015000!$A$6:$RL$1005,115,)=0,\"-\",VLOOKUP($AA$1,INDUK40015000!$A$6:$RL$1005,115,))","v":"B24"},null,{"$f":"IF(VLOOKUP($AA$1,INDUK40015000!$A$6:$RL$1005,171,)=0,\"-\",VLOOKUP($AA$1,INDUK40015000!$A$6:$RL$1005,171,))","v":"B78"},null,{"$f":"IF(VLOOKUP($AA$1,INDUK40015000!$A$6:$RL$1005,172,)=0,\"-\",VLOOKUP($AA$1,INDUK40015000!$A$6:$RL$1005,172,))","v":"B79"},null,{"$f":"IF(VLOOKUP($AA$1,INDUK40015000!$A$6:$RL$1005,228,)=0,\"-\",VLOOKUP($AA$1,INDUK40015000!$A$6:$RL$1005,228,))","v":"B134"},null,{"$f":"IF(VLOOKUP($AA$1,INDUK40015000!$A$6:$RL$1005,229,)=0,\"-\",VLOOKUP($AA$1,INDUK40015000!$A$6:$RL$1005,229,))","v":"B135"},null,{"$f":"IF(VLOOKUP($AA$1,INDUK40015000!$A$6:$RL$1005,285,)=0,\"-\",VLOOKUP($AA$1,INDUK40015000!$A$6:$RL$1005,285,))","v":"B190"},null,{"$f":"IF(VLOOKUP($AA$1,INDUK40015000!$A$6:$RL$1005,286,)=0,\"-\",VLOOKUP($AA$1,INDUK40015000!$A$6:$RL$1005,286,))","v":"B191"},null,{"$f":"IF(VLOOKUP($AA$1,INDUK40015000!$A$6:$RL$1005,342,)=0,\"-\",VLOOKUP($AA$1,INDUK40015000!$A$6:$RL$1005,342,))","v":"B246"},null,{"$f":"IF(VLOOKUP($AA$1,INDUK40015000!$A$6:$RL$1005,343,)=0,\"-\",VLOOKUP($AA$1,INDUK40015000!$A$6:$RL$1005,343,))","v":"B247"},null,{"$f":"IF(VLOOKUP($AA$1,INDUK40015000!$A$6:$RL$1005,399,)=0,\"-\",VLOOKUP($AA$1,INDUK40015000!$A$6:$RL$1005,399,))","v":"B302"},null,{"$f":"IF(VLOOKUP($AA$1,INDUK40015000!$A$6:$RL$1005,400,)=0,\"-\",VLOOKUP($AA$1,INDUK40015000!$A$6:$RL$1005,400,))","v":"B303"},{"$f":"IF(VLOOKUP($AA$1,INDUK40015000!$A$6:$RL$1005,473,)=0,\"-\",VLOOKUP($AA$1,INDUK40015000!$A$6:$RL$1005,473,))","v":"B374"},{"$f":"IF(VLOOKUP($AA$1,INDUK40015000!$A$6:$RL$1005,474,)=0,\"-\",VLOOKUP($AA$1,INDUK40015000!$A$6:$RL$1005,474,))","v":"B375"},12]
[9,"Pend. Jasmani, Olah Raga dan Kesehatan",null,null,null,null,{"$f":"IF(VLOOKUP($AA$1,INDUK40015000!$A$6:$RL$1005,116,)=0,\"-\",VLOOKUP($AA$1,INDUK40015000!$A$6:$RL$1005,116,))","v":"B25"},null,{"$f":"IF(VLOOKUP($AA$1,INDUK40015000!$A$6:$RL$1005,117,)=0,\"-\",VLOOKUP($AA$1,INDUK40015000!$A$6:$RL$1005,117,))","v":"B26"},null,{"$f":"IF(VLOOKUP($AA$1,INDUK40015000!$A$6:$RL$1005,173,)=0,\"-\",VLOOKUP($AA$1,INDUK40015000!$A$6:$RL$1005,173,))","v":"B80"},null,{"$f":"IF(VLOOKUP($AA$1,INDUK40015000!$A$6:$RL$1005,174,)=0,\"-\",VLOOKUP($AA$1,INDUK40015000!$A$6:$RL$1005,174,))","v":"B81"},null,{"$f":"IF(VLOOKUP($AA$1,INDUK40015000!$A$6:$RL$1005,230,)=0,\"-\",VLOOKUP($AA$1,INDUK40015000!$A$6:$RL$1005,230,))","v":"B136"},null,{"$f":"IF(VLOOKUP($AA$1,INDUK40015000!$A$6:$RL$1005,231,)=0,\"-\",VLOOKUP($AA$1,INDUK40015000!$A$6:$RL$1005,231,))","v":"B137"},null,{"$f":"IF(VLOOKUP($AA$1,INDUK40015000!$A$6:$RL$1005,287,)=0,\"-\",VLOOKUP($AA$1,INDUK40015000!$A$6:$RL$1005,287,))","v":"B192"},null,{"$f":"IF(VLOOKUP($AA$1,INDUK40015000!$A$6:$RL$1005,288,)=0,\"-\",VLOOKUP($AA$1,INDUK40015000!$A$6:$RL$1005,288,))","v":"B193"},null,{"$f":"IF(VLOOKUP($AA$1,INDUK40015000!$A$6:$RL$1005,344,)=0,\"-\",VLOOKUP($AA$1,INDUK40015000!$A$6:$RL$1005,344,))","v":"B248"},null,{"$f":"IF(VLOOKUP($AA$1,INDUK40015000!$A$6:$RL$1005,345,)=0,\"-\",VLOOKUP($AA$1,INDUK40015000!$A$6:$RL$1005,345,))","v":"B249"},null,{"$f":"IF(VLOOKUP($AA$1,INDUK40015000!$A$6:$RL$1005,401,)=0,\"-\",VLOOKUP($AA$1,INDUK40015000!$A$6:$RL$1005,401,))","v":"B304"},null,{"$f":"IF(VLOOKUP($AA$1,INDUK40015000!$A$6:$RL$1005,402,)=0,\"-\",VLOOKUP($AA$1,INDUK40015000!$A$6:$RL$1005,402,))","v":"B305"},{"$f":"IF(VLOOKUP($AA$1,INDUK40015000!$A$6:$RL$1005,475,)=0,\"-\",VLOOKUP($AA$1,INDUK40015000!$A$6:$RL$1005,475,))","v":"B376"},{"$f":"IF(VLOOKUP($AA$1,INDUK40015000!$A$6:$RL$1005,476,)=0,\"-\",VLOOKUP($AA$1,INDUK40015000!$A$6:$RL$1005,476,))","v":"B377"},13]
[10,"Muatan Lokal"]
[null,"a.","Bahasa Jawa",null,null,null,{"$f":"IF(VLOOKUP($AA$1,INDUK40015000!$A$6:$RL$1005,118,)=0,\"-\",VLOOKUP($AA$1,INDUK40015000!$A$6:$RL$1005,118,))","v":"B27"},null,{"$f":"IF(VLOOKUP($AA$1,INDUK40015000!$A$6:$RL$1005,119,)=0,\"-\",VLOOKUP($AA$1,INDUK40015000!$A$6:$RL$1005,119,))","v":"B28"},null,{"$f":"IF(VLOOKUP($AA$1,INDUK40015000!$A$6:$RL$1005,175,)=0,\"-\",VLOOKUP($AA$1,INDUK40015000!$A$6:$RL$1005,175,))","v":"B82"},null,{"$f":"IF(VLOOKUP($AA$1,INDUK40015000!$A$6:$RL$1005,176,)=0,\"-\",VLOOKUP($AA$1,INDUK40015000!$A$6:$RL$1005,176,))","v":"B83"},null,{"$f":"IF(VLOOKUP($AA$1,INDUK40015000!$A$6:$RL$1005,232,)=0,\"-\",VLOOKUP($AA$1,INDUK40015000!$A$6:$RL$1005,232,))","v":"B138"},null,{"$f":"IF(VLOOKUP($AA$1,INDUK40015000!$A$6:$RL$1005,233,)=0,\"-\",VLOOKUP($AA$1,INDUK40015000!$A$6:$RL$1005,233,))","v":"B139"},null,{"$f":"IF(VLOOKUP($AA$1,INDUK40015000!$A$6:$RL$1005,289,)=0,\"-\",VLOOKUP($AA$1,INDUK40015000!$A$6:$RL$1005,289,))","v":"B194"},null,{"$f":"IF(VLOOKUP($AA$1,INDUK40015000!$A$6:$RL$1005,290,)=0,\"-\",VLOOKUP($AA$1,INDUK40015000!$A$6:$RL$1005,290,))","v":"B195"},null,{"$f":"IF(VLOOKUP($AA$1,INDUK40015000!$A$6:$RL$1005,346,)=0,\"-\",VLOOKUP($AA$1,INDUK40015000!$A$6:$RL$1005,346,))","v":"B250"},null,{"$f":"IF(VLOOKUP($AA$1,INDUK40015000!$A$6:$RL$1005,347,)=0,\"-\",VLOOKUP($AA$1,INDUK40015000!$A$6:$RL$1005,347,))","v":"B251"},null,{"$f":"IF(VLOOKUP($AA$1,INDUK40015000!$A$6:$RL$1005,403,)=0,\"-\",VLOOKUP($AA$1,INDUK40015000!$A$6:$RL$1005,403,))","v":"B306"},null,{"$f":"IF(VLOOKUP($AA$1,INDUK40015000!$A$6:$RL$1005,404,)=0,\"-\",VLOOKUP($AA$1,INDUK40015000!$A$6:$RL$1005,404,))","v":"B307"},{"$f":"IF(VLOOKUP($AA$1,INDUK40015000!$A$6:$RL$1005,477,)=0,\"-\",VLOOKUP($AA$1,INDUK40015000!$A$6:$RL$1005,477,))","v":"B378"},{"$f":"IF(VLOOKUP($AA$1,INDUK40015000!$A$6:$RL$1005,478,)=0,\"-\",VLOOKUP($AA$1,INDUK40015000!$A$6:$RL$1005,478,))","v":"B379"},14]
[null,"b.","Bahasa Inggris",null,null,null,{"$f":"IF(VLOOKUP($AA$1,INDUK40015000!$A$6:$RL$1005,120,)=0,\"-\",VLOOKUP($AA$1,INDUK40015000!$A$6:$RL$1005,120,))","v":"B29"},null,{"$f":"IF(VLOOKUP($AA$1,INDUK40015000!$A$6:$RL$1005,121,)=0,\"-\",VLOOKUP($AA$1,INDUK40015000!$A$6:$RL$1005,121,))","v":"B30"},null,{"$f":"IF(VLOOKUP($AA$1,INDUK40015000!$A$6:$RL$1005,177,)=0,\"-\",VLOOKUP($AA$1,INDUK40015000!$A$6:$RL$1005,177,))","v":"B84"},null,{"$f":"IF(VLOOKUP($AA$1,INDUK40015000!$A$6:$RL$1005,178,)=0,\"-\",VLOOKUP($AA$1,INDUK40015000!$A$6:$RL$1005,178,))","v":"B85"},null,{"$f":"IF(VLOOKUP($AA$1,INDUK40015000!$A$6:$RL$1005,234,)=0,\"-\",VLOOKUP($AA$1,INDUK40015000!$A$6:$RL$1005,234,))","v":"B140"},null,{"$f":"IF(VLOOKUP($AA$1,INDUK40015000!$A$6:$RL$1005,235,)=0,\"-\",VLOOKUP($AA$1,INDUK40015000!$A$6:$RL$1005,235,))","v":"B141"},null,{"$f":"IF(VLOOKUP($AA$1,INDUK40015000!$A$6:$RL$1005,291,)=0,\"-\",VLOOKUP($AA$1,INDUK40015000!$A$6:$RL$1005,291,))","v":"B196"},null,{"$f":"IF(VLOOKUP($AA$1,INDUK40015000!$A$6:$RL$1005,292,)=0,\"-\",VLOOKUP($AA$1,INDUK40015000!$A$6:$RL$1005,292,))","v":"B197"},null,{"$f":"IF(VLOOKUP($AA$1,INDUK40015000!$A$6:$RL$1005,348,)=0,\"-\",VLOOKUP($AA$1,INDUK40015000!$A$6:$RL$1005,348,))","v":"B252"},null,{"$f":"IF(VLOOKUP($AA$1,INDUK40015000!$A$6:$RL$1005,349,)=0,\"-\",VLOOKUP($AA$1,INDUK40015000!$A$6:$RL$1005,349,))","v":"B253"},null,{"$f":"IF(VLOOKUP($AA$1,INDUK40015000!$A$6:$RL$1005,405,)=0,\"-\",VLOOKUP($AA$1,INDUK40015000!$A$6:$RL$1005,405,))","v":"B308"},null,{"$f":"IF(VLOOKUP($AA$1,INDUK40015000!$A$6:$RL$1005,406,)=0,\"-\",VLOOKUP($AA$1,INDUK40015000!$A$6:$RL$1005,406,))","v":"B309"},{"$f":"IF(VLOOKUP($AA$1,INDUK40015000!$A$6:$RL$1005,451,)=0,\"-\",VLOOKUP($AA$1,INDUK40015000!$A$6:$RL$1005,451,))","v":"B352"},{"$f":"IF(VLOOKUP($AA$1,INDUK40015000!$A$6:$RL$1005,451,)=0,\"-\",VLOOKUP($AA$1,INDUK40015000!$A$6:$RL$1005,451,))","v":"B352"},1]
[null,"c.","Ke-NU-an / Aswaja",null,null,null,{"$f":"IF(VLOOKUP($AA$1,INDUK40015000!$A$6:$RL$1005,100,)=0,\"-\",VLOOKUP($AA$1,INDUK40015000!$A$6:$RL$1005,100,))","v":"B9"},null,{"$f":"IF(VLOOKUP($AA$1,INDUK40015000!$A$6:$RL$1005,101,)=0,\"-\",VLOOKUP($AA$1,INDUK40015000!$A$6:$RL$1005,101,))","v":"B10"},null,{"$f":"IF(VLOOKUP($AA$1,INDUK40015000!$A$6:$RL$1005,157,)=0,\"-\",VLOOKUP($AA$1,INDUK40015000!$A$6:$RL$1005,157,))","v":"B64"},null,{"$f":"IF(VLOOKUP($AA$1,INDUK40015000!$A$6:$RL$1005,158,)=0,\"-\",VLOOKUP($AA$1,INDUK40015000!$A$6:$RL$1005,158,))","v":"B65"},null,{"$f":"IF(VLOOKUP($AA$1,INDUK40015000!$A$6:$RL$1005,214,)=0,\"-\",VLOOKUP($AA$1,INDUK40015000!$A$6:$RL$1005,214,))","v":"B120"},null,{"$f":"IF(VLOOKUP($AA$1,INDUK40015000!$A$6:$RL$1005,215,)=0,\"-\",VLOOKUP($AA$1,INDUK40015000!$A$6:$RL$1005,215,))","v":"B121"},null,{"$f":"IF(VLOOKUP($AA$1,INDUK40015000!$A$6:$RL$1005,271,)=0,\"-\",VLOOKUP($AA$1,INDUK40015000!$A$6:$RL$1005,271,))","v":"B176"},null,{"$f":"IF(VLOOKUP($AA$1,INDUK40015000!$A$6:$RL$1005,272,)=0,\"-\",VLOOKUP($AA$1,INDUK40015000!$A$6:$RL$1005,272,))","v":"B177"},null,{"$f":"IF(VLOOKUP($AA$1,INDUK40015000!$A$6:$RL$1005,328,)=0,\"-\",VLOOKUP($AA$1,INDUK40015000!$A$6:$RL$1005,328,))","v":"B232"},null,{"$f":"IF(VLOOKUP($AA$1,INDUK40015000!$A$6:$RL$1005,329,)=0,\"-\",VLOOKUP($AA$1,INDUK40015000!$A$6:$RL$1005,329,))","v":"B233"},null,{"$f":"IF(VLOOKUP($AA$1,INDUK40015000!$A$6:$RL$1005,385,)=0,\"-\",VLOOKUP($AA$1,INDUK40015000!$A$6:$RL$1005,385,))","v":"B288"},null,{"$f":"IF(VLOOKUP($AA$1,INDUK40015000!$A$6:$RL$1005,386,)=0,\"-\",VLOOKUP($AA$1,INDUK40015000!$A$6:$RL$1005,386,))","v":"B289"},{"$f":"IF(VLOOKUP($AA$1,INDUK40015000!$A$6:$RL$1005,459,)=0,\"-\",VLOOKUP($AA$1,INDUK40015000!$A$6:$RL$1005,459,))","v":"B360"},{"$f":"IF(VLOOKUP($AA$1,INDUK40015000!$A$6:$RL$1005,460,)=0,\"-\",VLOOKUP($AA$1,INDUK40015000!$A$6:$RL$1005,460,))","v":"B361"},5]
["Pengembangan diri :"]
["1.","PRAMUKA",null,null,null,{"$f":"IF(VLOOKUP($AA$1,INDUK40015000!$A$6:$RL$1005,134,)=0,\"-\",VLOOKUP($AA$1,INDUK40015000!$A$6:$RL$1005,134,))","v":"B43"},null,{"$f":"IF(VLOOKUP($AA$1,INDUK40015000!$A$6:$RL$1005,135,)=0,\"-\",VLOOKUP($AA$1,INDUK40015000!$A$6:$RL$1005,135,))","v":"B44"},null,{"$f":"IF(VLOOKUP($AA$1,INDUK40015000!$A$6:$RL$1005,191,)=0,\"-\",VLOOKUP($AA$1,INDUK40015000!$A$6:$RL$1005,191,))","v":"B98"},null,{"$f":"IF(VLOOKUP($AA$1,INDUK40015000!$A$6:$RL$1005,192,)=0,\"-\",VLOOKUP($AA$1,INDUK40015000!$A$6:$RL$1005,192,))","v":"B99"},null,{"$f":"IF(VLOOKUP($AA$1,INDUK40015000!$A$6:$RL$1005,248,)=0,\"-\",VLOOKUP($AA$1,INDUK40015000!$A$6:$RL$1005,248,))","v":"B154"},null,{"$f":"IF(VLOOKUP($AA$1,INDUK40015000!$A$6:$RL$1005,249,)=0,\"-\",VLOOKUP($AA$1,INDUK40015000!$A$6:$RL$1005,249,))","v":"B155"},null,{"$f":"IF(VLOOKUP($AA$1,INDUK40015000!$A$6:$RL$1005,305,)=0,\"-\",VLOOKUP($AA$1,INDUK40015000!$A$6:$RL$1005,305,))","v":"B210"},null,{"$f":"IF(VLOOKUP($AA$1,INDUK40015000!$A$6:$RL$1005,306,)=0,\"-\",VLOOKUP($AA$1,INDUK40015000!$A$6:$RL$1005,306,))","v":"B211"},null,{"$f":"IF(VLOOKUP($AA$1,INDUK40015000!$A$6:$RL$1005,362,)=0,\"-\",VLOOKUP($AA$1,INDUK40015000!$A$6:$RL$1005,362,))","v":"B266"},null,{"$f":"IF(VLOOKUP($AA$1,INDUK40015000!$A$6:$RL$1005,363,)=0,\"-\",VLOOKUP($AA$1,INDUK40015000!$A$6:$RL$1005,363,))","v":"B267"},null,{"$f":"IF(VLOOKUP($AA$1,INDUK40015000!$A$6:$RL$1005,419,)=0,\"-\",VLOOKUP($AA$1,INDUK40015000!$A$6:$RL$1005,419,))","v":"B322"},null,{"$f":"IF(VLOOKUP($AA$1,INDUK40015000!$A$6:$RL$1005,420,)=0,\"-\",VLOOKUP($AA$1,INDUK40015000!$A$6:$RL$1005,420,))","v":"B323"},null,null,null,8]
["2.","EKSTRA 1",null,null,null,{"$f":"IF(VLOOKUP($AA$1,INDUK40015000!$A$6:$RL$1005,136,)=0,\"-\",VLOOKUP($AA$1,INDUK40015000!$A$6:$RL$1005,136,))","v":"B45"},null,{"$f":"IF(VLOOKUP($AA$1,INDUK40015000!$A$6:$RL$1005,137,)=0,\"-\",VLOOKUP($AA$1,INDUK40015000!$A$6:$RL$1005,137,))","v":"B46"},null,{"$f":"IF(VLOOKUP($AA$1,INDUK40015000!$A$6:$RL$1005,193,)=0,\"-\",VLOOKUP($AA$1,INDUK40015000!$A$6:$RL$1005,193,))","v":"B100"},null,{"$f":"IF(VLOOKUP($AA$1,INDUK40015000!$A$6:$RL$1005,194,)=0,\"-\",VLOOKUP($AA$1,INDUK40015000!$A$6:$RL$1005,194,))","v":"B101"},null,{"$f":"IF(VLOOKUP($AA$1,INDUK40015000!$A$6:$RL$1005,250,)=0,\"-\",VLOOKUP($AA$1,INDUK40015000!$A$6:$RL$1005,250,))","v":"B156"},null,{"$f":"IF(VLOOKUP($AA$1,INDUK40015000!$A$6:$RL$1005,251,)=0,\"-\",VLOOKUP($AA$1,INDUK40015000!$A$6:$RL$1005,251,))","v":"B157"},null,{"$f":"IF(VLOOKUP($AA$1,INDUK40015000!$A$6:$RL$1005,307,)=0,\"-\",VLOOKUP($AA$1,INDUK40015000!$A$6:$RL$1005,307,))","v":"B212"},null,{"$f":"IF(VLOOKUP($AA$1,INDUK40015000!$A$6:$RL$1005,308,)=0,\"-\",VLOOKUP($AA$1,INDUK40015000!$A$6:$RL$1005,308,))","v":"B213"},null,{"$f":"IF(VLOOKUP($AA$1,INDUK40015000!$A$6:$RL$1005,364,)=0,\"-\",VLOOKUP($AA$1,INDUK40015000!$A$6:$RL$1005,364,))","v":"B268"},null,{"$f":"IF(VLOOKUP($AA$1,INDUK40015000!$A$6:$RL$1005,365,)=0,\"-\",VLOOKUP($AA$1,INDUK40015000!$A$6:$RL$1005,365,))","v":"B269"},null,{"$f":"IF(VLOOKUP($AA$1,INDUK40015000!$A$6:$RL$1005,421,)=0,\"-\",VLOOKUP($AA$1,INDUK40015000!$A$6:$RL$1005,421,))","v":"B324"},null,{"$f":"IF(VLOOKUP($AA$1,INDUK40015000!$A$6:$RL$1005,422,)=0,\"-\",VLOOKUP($AA$1,INDUK40015000!$A$6:$RL$1005,422,))","v":"B325"},null,null,null,9]
["3.","EKSTRA 2",null,null,null,{"$f":"IF(VLOOKUP($AA$1,INDUK40015000!$A$6:$RL$1005,138,)=0,\"-\",VLOOKUP($AA$1,INDUK40015000!$A$6:$RL$1005,138,))","v":"B47"},null,{"$f":"IF(VLOOKUP($AA$1,INDUK40015000!$A$6:$RL$1005,139,)=0,\"-\",VLOOKUP($AA$1,INDUK40015000!$A$6:$RL$1005,139,))","v":"B48"},null,{"$f":"IF(VLOOKUP($AA$1,INDUK40015000!$A$6:$RL$1005,195,)=0,\"-\",VLOOKUP($AA$1,INDUK40015000!$A$6:$RL$1005,195,))","v":"B102"},null,{"$f":"IF(VLOOKUP($AA$1,INDUK40015000!$A$6:$RL$1005,196,)=0,\"-\",VLOOKUP($AA$1,INDUK40015000!$A$6:$RL$1005,196,))","v":"B103"},null,{"$f":"IF(VLOOKUP($AA$1,INDUK40015000!$A$6:$RL$1005,252,)=0,\"-\",VLOOKUP($AA$1,INDUK40015000!$A$6:$RL$1005,252,))","v":"B158"},null,{"$f":"IF(VLOOKUP($AA$1,INDUK40015000!$A$6:$RL$1005,253,)=0,\"-\",VLOOKUP($AA$1,INDUK40015000!$A$6:$RL$1005,253,))","v":"B159"},null,{"$f":"IF(VLOOKUP($AA$1,INDUK40015000!$A$6:$RL$1005,309,)=0,\"-\",VLOOKUP($AA$1,INDUK40015000!$A$6:$RL$1005,309,))","v":"B214"},null,{"$f":"IF(VLOOKUP($AA$1,INDUK40015000!$A$6:$RL$1005,310,)=0,\"-\",VLOOKUP($AA$1,INDUK40015000!$A$6:$RL$1005,310,))","v":"B215"},null,{"$f":"IF(VLOOKUP($AA$1,INDUK40015000!$A$6:$RL$1005,366,)=0,\"-\",VLOOKUP($AA$1,INDUK40015000!$A$6:$RL$1005,366,))","v":"B270"},null,{"$f":"IF(VLOOKUP($AA$1,INDUK40015000!$A$6:$RL$1005,367,)=0,\"-\",VLOOKUP($AA$1,INDUK40015000!$A$6:$RL$1005,367,))","v":"B271"},null,{"$f":"IF(VLOOKUP($AA$1,INDUK40015000!$A$6:$RL$1005,423,)=0,\"-\",VLOOKUP($AA$1,INDUK40015000!$A$6:$RL$1005,423,))","v":"B326"},null,{"$f":"IF(VLOOKUP($AA$1,INDUK40015000!$A$6:$RL$1005,424,)=0,\"-\",VLOOKUP($AA$1,INDUK40015000!$A$6:$RL$1005,424,))","v":"B327"},null,null,null,10]
["Jumlah Nilai",null,null,null,null,{"$f":"IF(VLOOKUP($AA$1,INDUK40015000!$A$6:$RL$1005,122,)=0,\"-\",VLOOKUP($AA$1,INDUK40015000!$A$6:$RL$1005,122,))","v":"B31"},null,{"$f":"IF(VLOOKUP($AA$1,INDUK40015000!$A$6:$RL$1005,123,)=0,\"-\",VLOOKUP($AA$1,INDUK40015000!$A$6:$RL$1005,123,))","v":"B32"},null,{"$f":"IF(VLOOKUP($AA$1,INDUK40015000!$A$6:$RL$1005,179,)=0,\"-\",VLOOKUP($AA$1,INDUK40015000!$A$6:$RL$1005,179,))","v":"B86"},null,{"$f":"IF(VLOOKUP($AA$1,INDUK40015000!$A$6:$RL$1005,180,)=0,\"-\",VLOOKUP($AA$1,INDUK40015000!$A$6:$RL$1005,180,))","v":"B87"},null,{"$f":"IF(VLOOKUP($AA$1,INDUK40015000!$A$6:$RL$1005,236,)=0,\"-\",VLOOKUP($AA$1,INDUK40015000!$A$6:$RL$1005,236,))","v":"B142"},null,{"$f":"IF(VLOOKUP($AA$1,INDUK40015000!$A$6:$RL$1005,237,)=0,\"-\",VLOOKUP($AA$1,INDUK40015000!$A$6:$RL$1005,237,))","v":"B143"},null,{"$f":"IF(VLOOKUP($AA$1,INDUK40015000!$A$6:$RL$1005,293,)=0,\"-\",VLOOKUP($AA$1,INDUK40015000!$A$6:$RL$1005,293,))","v":"B198"},null,{"$f":"IF(VLOOKUP($AA$1,INDUK40015000!$A$6:$RL$1005,294,)=0,\"-\",VLOOKUP($AA$1,INDUK40015000!$A$6:$RL$1005,294,))","v":"B199"},null,{"$f":"IF(VLOOKUP($AA$1,INDUK40015000!$A$6:$RL$1005,350,)=0,\"-\",VLOOKUP($AA$1,INDUK40015000!$A$6:$RL$1005,350,))","v":"B254"},null,{"$f":"IF(VLOOKUP($AA$1,INDUK40015000!$A$6:$RL$1005,351,)=0,\"-\",VLOOKUP($AA$1,INDUK40015000!$A$6:$RL$1005,351,))","v":"B255"},null,{"$f":"IF(VLOOKUP($AA$1,INDUK40015000!$A$6:$RL$1005,407,)=0,\"-\",VLOOKUP($AA$1,INDUK40015000!$A$6:$RL$1005,407,))","v":"B310"},null,{"$f":"IF(VLOOKUP($AA$1,INDUK40015000!$A$6:$RL$1005,408,)=0,\"-\",VLOOKUP($AA$1,INDUK40015000!$A$6:$RL$1005,408,))","v":"B311"},null,null,null,2]
["Rata - Rata",null,null,null,null,{"$f":"IF(VLOOKUP($AA$1,INDUK40015000!$A$6:$RL$1005,124,)=0,\"-\",VLOOKUP($AA$1,INDUK40015000!$A$6:$RL$1005,124,))","v":"B33"},null,{"$f":"IF(VLOOKUP($AA$1,INDUK40015000!$A$6:$RL$1005,125,)=0,\"-\",VLOOKUP($AA$1,INDUK40015000!$A$6:$RL$1005,125,))","v":"B34"},null,{"$f":"IF(VLOOKUP($AA$1,INDUK40015000!$A$6:$RL$1005,181,)=0,\"-\",VLOOKUP($AA$1,INDUK40015000!$A$6:$RL$1005,181,))","v":"B88"},null,{"$f":"IF(VLOOKUP($AA$1,INDUK40015000!$A$6:$RL$1005,182,)=0,\"-\",VLOOKUP($AA$1,INDUK40015000!$A$6:$RL$1005,182,))","v":"B89"},null,{"$f":"IF(VLOOKUP($AA$1,INDUK40015000!$A$6:$RL$1005,238,)=0,\"-\",VLOOKUP($AA$1,INDUK40015000!$A$6:$RL$1005,238,))","v":"B144"},null,{"$f":"IF(VLOOKUP($AA$1,INDUK40015000!$A$6:$RL$1005,239,)=0,\"-\",VLOOKUP($AA$1,INDUK40015000!$A$6:$RL$1005,239,))","v":"B145"},null,{"$f":"IF(VLOOKUP($AA$1,INDUK40015000!$A$6:$RL$1005,295,)=0,\"-\",VLOOKUP($AA$1,INDUK40015000!$A$6:$RL$1005,295,))","v":"B200"},null,{"$f":"IF(VLOOKUP($AA$1,INDUK40015000!$A$6:$RL$1005,296,)=0,\"-\",VLOOKUP($AA$1,INDUK40015000!$A$6:$RL$1005,296,))","v":"B201"},null,{"$f":"IF(VLOOKUP($AA$1,INDUK40015000!$A$6:$RL$1005,352,)=0,\"-\",VLOOKUP($AA$1,INDUK40015000!$A$6:$RL$1005,352,))","v":"B256"},null,{"$f":"IF(VLOOKUP($AA$1,INDUK40015000!$A$6:$RL$1005,353,)=0,\"-\",VLOOKUP($AA$1,INDUK40015000!$A$6:$RL$1005,353,))","v":"B257"},null,{"$f":"IF(VLOOKUP($AA$1,INDUK40015000!$A$6:$RL$1005,409,)=0,\"-\",VLOOKUP($AA$1,INDUK40015000!$A$6:$RL$1005,409,))","v":"B312"},null,{"$f":"IF(VLOOKUP($AA$1,INDUK40015000!$A$6:$RL$1005,410,)=0,\"-\",VLOOKUP($AA$1,INDUK40015000!$A$6:$RL$1005,410,))","v":"B313"},null,null,null,3]
["Peringkat Kelas Ke :",null,null,null,null,{"$f":"IF(VLOOKUP($AA$1,INDUK40015000!$A$6:$RL$1005,126,)=0,\"-\",VLOOKUP($AA$1,INDUK40015000!$A$6:$RL$1005,126,))","v":"B35"},null,{"$f":"IF(VLOOKUP($AA$1,INDUK40015000!$A$6:$RL$1005,127,)=0,\"-\",VLOOKUP($AA$1,INDUK40015000!$A$6:$RL$1005,127,))","v":"B36"},null,{"$f":"IF(VLOOKUP($AA$1,INDUK40015000!$A$6:$RL$1005,183,)=0,\"-\",VLOOKUP($AA$1,INDUK40015000!$A$6:$RL$1005,183,))","v":"B90"},null,{"$f":"IF(VLOOKUP($AA$1,INDUK40015000!$A$6:$RL$1005,184,)=0,\"-\",VLOOKUP($AA$1,INDUK40015000!$A$6:$RL$1005,184,))","v":"B91"},null,{"$f":"IF(VLOOKUP($AA$1,INDUK40015000!$A$6:$RL$1005,240,)=0,\"-\",VLOOKUP($AA$1,INDUK40015000!$A$6:$RL$1005,240,))","v":"B146"},null,{"$f":"IF(VLOOKUP($AA$1,INDUK40015000!$A$6:$RL$1005,241,)=0,\"-\",VLOOKUP($AA$1,INDUK40015000!$A$6:$RL$1005,241,))","v":"B147"},null,{"$f":"IF(VLOOKUP($AA$1,INDUK40015000!$A$6:$RL$1005,297,)=0,\"-\",VLOOKUP($AA$1,INDUK40015000!$A$6:$RL$1005,297,))","v":"B202"},null,{"$f":"IF(VLOOKUP($AA$1,INDUK40015000!$A$6:$RL$1005,298,)=0,\"-\",VLOOKUP($AA$1,INDUK40015000!$A$6:$RL$1005,298,))","v":"B203"},null,{"$f":"IF(VLOOKUP($AA$1,INDUK40015000!$A$6:$RL$1005,354,)=0,\"-\",VLOOKUP($AA$1,INDUK40015000!$A$6:$RL$1005,354,))","v":"B258"},null,{"$f":"IF(VLOOKUP($AA$1,INDUK40015000!$A$6:$RL$1005,355,)=0,\"-\",VLOOKUP($AA$1,INDUK40015000!$A$6:$RL$1005,355,))","v":"B259"},null,{"$f":"IF(VLOOKUP($AA$1,INDUK40015000!$A$6:$RL$1005,411,)=0,\"-\",VLOOKUP($AA$1,INDUK40015000!$A$6:$RL$1005,411,))","v":"B314"},null,{"$f":"IF(VLOOKUP($AA$1,INDUK40015000!$A$6:$RL$1005,412,)=0,\"-\",VLOOKUP($AA$1,INDUK40015000!$A$6:$RL$1005,412,))","v":"B315"},null,null,null,4]
["Perilaku Kepribadian"]
["1.","Kelakuan",null,null,null,{"$f":"IF(VLOOKUP($AA$1,INDUK40015000!$A$6:$RL$1005,140,)=0,\"-\",VLOOKUP($AA$1,INDUK40015000!$A$6:$RL$1005,140,))","v":"B49"},null,{"$f":"IF(VLOOKUP($AA$1,INDUK40015000!$A$6:$RL$1005,141,)=0,\"-\",VLOOKUP($AA$1,INDUK40015000!$A$6:$RL$1005,141,))","v":"B50"},null,{"$f":"IF(VLOOKUP($AA$1,INDUK40015000!$A$6:$RL$1005,197,)=0,\"-\",VLOOKUP($AA$1,INDUK40015000!$A$6:$RL$1005,197,))","v":"B104"},null,{"$f":"IF(VLOOKUP($AA$1,INDUK40015000!$A$6:$RL$1005,198,)=0,\"-\",VLOOKUP($AA$1,INDUK40015000!$A$6:$RL$1005,198,))","v":"B105"},null,{"$f":"IF(VLOOKUP($AA$1,INDUK40015000!$A$6:$RL$1005,254,)=0,\"-\",VLOOKUP($AA$1,INDUK40015000!$A$6:$RL$1005,254,))","v":"B160"},null,{"$f":"IF(VLOOKUP($AA$1,INDUK40015000!$A$6:$RL$1005,255,)=0,\"-\",VLOOKUP($AA$1,INDUK40015000!$A$6:$RL$1005,255,))","v":"B161"},null,{"$f":"IF(VLOOKUP($AA$1,INDUK40015000!$A$6:$RL$1005,311,)=0,\"-\",VLOOKUP($AA$1,INDUK40015000!$A$6:$RL$1005,311,))","v":"B216"},null,{"$f":"IF(VLOOKUP($AA$1,INDUK40015000!$A$6:$RL$1005,312,)=0,\"-\",VLOOKUP($AA$1,INDUK40015000!$A$6:$RL$1005,312,))","v":"B217"},null,{"$f":"IF(VLOOKUP($AA$1,INDUK40015000!$A$6:$RL$1005,368,)=0,\"-\",VLOOKUP($AA$1,INDUK40015000!$A$6:$RL$1005,368,))","v":"B272"},null,{"$f":"IF(VLOOKUP($AA$1,INDUK40015000!$A$6:$RL$1005,369,)=0,\"-\",VLOOKUP($AA$1,INDUK40015000!$A$6:$RL$1005,369,))","v":"B273"},null,{"$f":"IF(VLOOKUP($AA$1,INDUK40015000!$A$6:$RL$1005,425,)=0,\"-\",VLOOKUP($AA$1,INDUK40015000!$A$6:$RL$1005,425,))","v":"B328"},null,{"$f":"IF(VLOOKUP($AA$1,INDUK40015000!$A$6:$RL$1005,426,)=0,\"-\",VLOOKUP($AA$1,INDUK40015000!$A$6:$RL$1005,426,))","v":"B329"},null,null,null,11]
["2.","Kerajinan",null,null,null,{"$f":"IF(VLOOKUP($AA$1,INDUK40015000!$A$6:$RL$1005,142,)=0,\"-\",VLOOKUP($AA$1,INDUK40015000!$A$6:$RL$1005,142,))","v":"B51"},null,{"$f":"IF(VLOOKUP($AA$1,INDUK40015000!$A$6:$RL$1005,143,)=0,\"-\",VLOOKUP($AA$1,INDUK40015000!$A$6:$RL$1005,143,))","v":"B52"},null,{"$f":"IF(VLOOKUP($AA$1,INDUK40015000!$A$6:$RL$1005,199,)=0,\"-\",VLOOKUP($AA$1,INDUK40015000!$A$6:$RL$1005,199,))","v":"B106"},null,{"$f":"IF(VLOOKUP($AA$1,INDUK40015000!$A$6:$RL$1005,200,)=0,\"-\",VLOOKUP($AA$1,INDUK40015000!$A$6:$RL$1005,200,))","v":"B107"},null,{"$f":"IF(VLOOKUP($AA$1,INDUK40015000!$A$6:$RL$1005,256,)=0,\"-\",VLOOKUP($AA$1,INDUK40015000!$A$6:$RL$1005,256,))","v":"B162"},null,{"$f":"IF(VLOOKUP($AA$1,INDUK40015000!$A$6:$RL$1005,257,)=0,\"-\",VLOOKUP($AA$1,INDUK40015000!$A$6:$RL$1005,257,))","v":"B163"},null,{"$f":"IF(VLOOKUP($AA$1,INDUK40015000!$A$6:$RL$1005,313,)=0,\"-\",VLOOKUP($AA$1,INDUK40015000!$A$6:$RL$1005,313,))","v":"B218"},null,{"$f":"IF(VLOOKUP($AA$1,INDUK40015000!$A$6:$RL$1005,314,)=0,\"-\",VLOOKUP($AA$1,INDUK40015000!$A$6:$RL$1005,314,))","v":"B219"},null,{"$f":"IF(VLOOKUP($AA$1,INDUK40015000!$A$6:$RL$1005,370,)=0,\"-\",VLOOKUP($AA$1,INDUK40015000!$A$6:$RL$1005,370,))","v":"B274"},null,{"$f":"IF(VLOOKUP($AA$1,INDUK40015000!$A$6:$RL$1005,371,)=0,\"-\",VLOOKUP($AA$1,INDUK40015000!$A$6:$RL$1005,371,))","v":"B275"},null,{"$f":"IF(VLOOKUP($AA$1,INDUK40015000!$A$6:$RL$1005,427,)=0,\"-\",VLOOKUP($AA$1,INDUK40015000!$A$6:$RL$1005,427,))","v":"B330"},null,{"$f":"IF(VLOOKUP($AA$1,INDUK40015000!$A$6:$RL$1005,428,)=0,\"-\",VLOOKUP($AA$1,INDUK40015000!$A$6:$RL$1005,428,))","v":"B331"},null,null,null,12]
["3.","Kebersihan dan Kerapian",null,null,null,{"$f":"IF(VLOOKUP($AA$1,INDUK40015000!$A$6:$RL$1005,144,)=0,\"-\",VLOOKUP($AA$1,INDUK40015000!$A$6:$RL$1005,144,))","v":"B53"},null,{"$f":"IF(VLOOKUP($AA$1,INDUK40015000!$A$6:$RL$1005,145,)=0,\"-\",VLOOKUP($AA$1,INDUK40015000!$A$6:$RL$1005,145,))","v":"B54"},null,{"$f":"IF(VLOOKUP($AA$1,INDUK40015000!$A$6:$RL$1005,201,)=0,\"-\",VLOOKUP($AA$1,INDUK40015000!$A$6:$RL$1005,201,))","v":"B108"},null,{"$f":"IF(VLOOKUP($AA$1,INDUK40015000!$A$6:$RL$1005,202,)=0,\"-\",VLOOKUP($AA$1,INDUK40015000!$A$6:$RL$1005,202,))","v":"B109"},null,{"$f":"IF(VLOOKUP($AA$1,INDUK40015000!$A$6:$RL$1005,258,)=0,\"-\",VLOOKUP($AA$1,INDUK40015000!$A$6:$RL$1005,258,))","v":"B164"},null,{"$f":"IF(VLOOKUP($AA$1,INDUK40015000!$A$6:$RL$1005,259,)=0,\"-\",VLOOKUP($AA$1,INDUK40015000!$A$6:$RL$1005,259,))","v":"B165"},null,{"$f":"IF(VLOOKUP($AA$1,INDUK40015000!$A$6:$RL$1005,315,)=0,\"-\",VLOOKUP($AA$1,INDUK40015000!$A$6:$RL$1005,315,))","v":"B220"},null,{"$f":"IF(VLOOKUP($AA$1,INDUK40015000!$A$6:$RL$1005,316,)=0,\"-\",VLOOKUP($AA$1,INDUK40015000!$A$6:$RL$1005,316,))","v":"B221"},null,{"$f":"IF(VLOOKUP($AA$1,INDUK40015000!$A$6:$RL$1005,372,)=0,\"-\",VLOOKUP($AA$1,INDUK40015000!$A$6:$RL$1005,372,))","v":"B276"},null,{"$f":"IF(VLOOKUP($AA$1,INDUK40015000!$A$6:$RL$1005,373,)=0,\"-\",VLOOKUP($AA$1,INDUK40015000!$A$6:$RL$1005,373,))","v":"B277"},null,{"$f":"IF(VLOOKUP($AA$1,INDUK40015000!$A$6:$RL$1005,429,)=0,\"-\",VLOOKUP($AA$1,INDUK40015000!$A$6:$RL$1005,429,))","v":"B332"},null,{"$f":"IF(VLOOKUP($AA$1,INDUK40015000!$A$6:$RL$1005,430,)=0,\"-\",VLOOKUP($AA$1,INDUK40015000!$A$6:$RL$1005,430,))","v":"B333"},null,null,null,13]
["Ketidakhadiran"]
["1.","Sakit",null,null,"( Hari )",{"$f":"IF(VLOOKUP($AA$1,INDUK40015000!$A$6:$RL$1005,128,)=0,\"-\",VLOOKUP($AA$1,INDUK40015000!$A$6:$RL$1005,128,))","v":"B37"},null,{"$f":"IF(VLOOKUP($AA$1,INDUK40015000!$A$6:$RL$1005,129,)=0,\"-\",VLOOKUP($AA$1,INDUK40015000!$A$6:$RL$1005,129,))","v":"B38"},null,{"$f":"IF(VLOOKUP($AA$1,INDUK40015000!$A$6:$RL$1005,185,)=0,\"-\",VLOOKUP($AA$1,INDUK40015000!$A$6:$RL$1005,185,))","v":"B92"},null,{"$f":"IF(VLOOKUP($AA$1,INDUK40015000!$A$6:$RL$1005,186,)=0,\"-\",VLOOKUP($AA$1,INDUK40015000!$A$6:$RL$1005,186,))","v":"B93"},null,{"$f":"IF(VLOOKUP($AA$1,INDUK40015000!$A$6:$RL$1005,242,)=0,\"-\",VLOOKUP($AA$1,INDUK40015000!$A$6:$RL$1005,242,))","v":"B148"},null,{"$f":"IF(VLOOKUP($AA$1,INDUK40015000!$A$6:$RL$1005,243,)=0,\"-\",VLOOKUP($AA$1,INDUK40015000!$A$6:$RL$1005,243,))","v":"B149"},null,{"$f":"IF(VLOOKUP($AA$1,INDUK40015000!$A$6:$RL$1005,299,)=0,\"-\",VLOOKUP($AA$1,INDUK40015000!$A$6:$RL$1005,299,))","v":"B204"},null,{"$f":"IF(VLOOKUP($AA$1,INDUK40015000!$A$6:$RL$1005,300,)=0,\"-\",VLOOKUP($AA$1,INDUK40015000!$A$6:$RL$1005,300,))","v":"B205"},null,{"$f":"IF(VLOOKUP($AA$1,INDUK40015000!$A$6:$RL$1005,356,)=0,\"-\",VLOOKUP($AA$1,INDUK40015000!$A$6:$RL$1005,356,))","v":"B260"},null,{"$f":"IF(VLOOKUP($AA$1,INDUK40015000!$A$6:$RL$1005,357,)=0,\"-\",VLOOKUP($AA$1,INDUK40015000!$A$6:$RL$1005,357,))","v":"B261"},null,{"$f":"IF(VLOOKUP($AA$1,INDUK40015000!$A$6:$RL$1005,413,)=0,\"-\",VLOOKUP($AA$1,INDUK40015000!$A$6:$RL$1005,413,))","v":"B316"},null,{"$f":"IF(VLOOKUP($AA$1,INDUK40015000!$A$6:$RL$1005,414,)=0,\"-\",VLOOKUP($AA$1,INDUK40015000!$A$6:$RL$1005,414,))","v":"B317"},null,"Catatan :",null,5]
["2.","Izin",null,null,"( Hari )",{"$f":"IF(VLOOKUP($AA$1,INDUK40015000!$A$6:$RL$1005,130,)=0,\"-\",VLOOKUP($AA$1,INDUK40015000!$A$6:$RL$1005,130,))","v":"B39"},null,{"$f":"IF(VLOOKUP($AA$1,INDUK40015000!$A$6:$RL$1005,131,)=0,\"-\",VLOOKUP($AA$1,INDUK40015000!$A$6:$RL$1005,131,))","v":"B40"},null,{"$f":"IF(VLOOKUP($AA$1,INDUK40015000!$A$6:$RL$1005,187,)=0,\"-\",VLOOKUP($AA$1,INDUK40015000!$A$6:$RL$1005,187,))","v":"B94"},null,{"$f":"IF(VLOOKUP($AA$1,INDUK40015000!$A$6:$RL$1005,188,)=0,\"-\",VLOOKUP($AA$1,INDUK40015000!$A$6:$RL$1005,188,))","v":"B95"},null,{"$f":"IF(VLOOKUP($AA$1,INDUK40015000!$A$6:$RL$1005,244,)=0,\"-\",VLOOKUP($AA$1,INDUK40015000!$A$6:$RL$1005,244,))","v":"B150"},null,{"$f":"IF(VLOOKUP($AA$1,INDUK40015000!$A$6:$RL$1005,245,)=0,\"-\",VLOOKUP($AA$1,INDUK40015000!$A$6:$RL$1005,245,))","v":"B151"},null,{"$f":"IF(VLOOKUP($AA$1,INDUK40015000!$A$6:$RL$1005,301,)=0,\"-\",VLOOKUP($AA$1,INDUK40015000!$A$6:$RL$1005,301,))","v":"B206"},null,{"$f":"IF(VLOOKUP($AA$1,INDUK40015000!$A$6:$RL$1005,302,)=0,\"-\",VLOOKUP($AA$1,INDUK40015000!$A$6:$RL$1005,302,))","v":"B207"},null,{"$f":"IF(VLOOKUP($AA$1,INDUK40015000!$A$6:$RL$1005,358,)=0,\"-\",VLOOKUP($AA$1,INDUK40015000!$A$6:$RL$1005,358,))","v":"B262"},null,{"$f":"IF(VLOOKUP($AA$1,INDUK40015000!$A$6:$RL$1005,359,)=0,\"-\",VLOOKUP($AA$1,INDUK40015000!$A$6:$RL$1005,359,))","v":"B263"},null,{"$f":"IF(VLOOKUP($AA$1,INDUK40015000!$A$6:$RL$1005,415,)=0,\"-\",VLOOKUP($AA$1,INDUK40015000!$A$6:$RL$1005,415,))","v":"B318"},null,{"$f":"IF(VLOOKUP($AA$1,INDUK40015000!$A$6:$RL$1005,416,)=0,\"-\",VLOOKUP($AA$1,INDUK40015000!$A$6:$RL$1005,416,))","v":"B319"},null,null,null,6]
["3.","Tanpa Keterangan",null,null,"( Hari )",{"$f":"IF(VLOOKUP($AA$1,INDUK40015000!$A$6:$RL$1005,132,)=0,\"-\",VLOOKUP($AA$1,INDUK40015000!$A$6:$RL$1005,132,))","v":"B41"},null,{"$f":"IF(VLOOKUP($AA$1,INDUK40015000!$A$6:$RL$1005,133,)=0,\"-\",VLOOKUP($AA$1,INDUK40015000!$A$6:$RL$1005,133,))","v":"B42"},null,{"$f":"IF(VLOOKUP($AA$1,INDUK40015000!$A$6:$RL$1005,189,)=0,\"-\",VLOOKUP($AA$1,INDUK40015000!$A$6:$RL$1005,189,))","v":"B96"},null,{"$f":"IF(VLOOKUP($AA$1,INDUK40015000!$A$6:$RL$1005,190,)=0,\"-\",VLOOKUP($AA$1,INDUK40015000!$A$6:$RL$1005,190,))","v":"B97"},null,{"$f":"IF(VLOOKUP($AA$1,INDUK40015000!$A$6:$RL$1005,246,)=0,\"-\",VLOOKUP($AA$1,INDUK40015000!$A$6:$RL$1005,246,))","v":"B152"},null,{"$f":"IF(VLOOKUP($AA$1,INDUK40015000!$A$6:$RL$1005,247,)=0,\"-\",VLOOKUP($AA$1,INDUK40015000!$A$6:$RL$1005,247,))","v":"B153"},null,{"$f":"IF(VLOOKUP($AA$1,INDUK40015000!$A$6:$RL$1005,303,)=0,\"-\",VLOOKUP($AA$1,INDUK40015000!$A$6:$RL$1005,303,))","v":"B208"},null,{"$f":"IF(VLOOKUP($AA$1,INDUK40015000!$A$6:$RL$1005,304,)=0,\"-\",VLOOKUP($AA$1,INDUK40015000!$A$6:$RL$1005,304,))","v":"B209"},null,{"$f":"IF(VLOOKUP($AA$1,INDUK40015000!$A$6:$RL$1005,360,)=0,\"-\",VLOOKUP($AA$1,INDUK40015000!$A$6:$RL$1005,360,))","v":"B264"},null,{"$f":"IF(VLOOKUP($AA$1,INDUK40015000!$A$6:$RL$1005,361,)=0,\"-\",VLOOKUP($AA$1,INDUK40015000!$A$6:$RL$1005,361,))","v":"B265"},null,{"$f":"IF(VLOOKUP($AA$1,INDUK40015000!$A$6:$RL$1005,417,)=0,\"-\",VLOOKUP($AA$1,INDUK40015000!$A$6:$RL$1005,417,))","v":"B320"},null,{"$f":"IF(VLOOKUP($AA$1,INDUK40015000!$A$6:$RL$1005,418,)=0,\"-\",VLOOKUP($AA$1,INDUK40015000!$A$6:$RL$1005,418,))","v":"B321"},null,null,null,7]
["NAIK / TIDAK NAIK KELAS",null,null,null,null,{"$f":"IF(VLOOKUP($AA$1,INDUK40015000!$A$6:$RL$1005,146,)=0,\"-\",VLOOKUP($AA$1,INDUK40015000!$A$6:$RL$1005,146,))","v":"B55"},null,null,null,{"$f":"IF(VLOOKUP($AA$1,INDUK40015000!$A$6:$RL$1005,203,)=0,\"-\",VLOOKUP($AA$1,INDUK40015000!$A$6:$RL$1005,203,))","v":"B110"},null,null,null,{"$f":"IF(VLOOKUP($AA$1,INDUK40015000!$A$6:$RL$1005,260,)=0,\"-\",VLOOKUP($AA$1,INDUK40015000!$A$6:$RL$1005,260,))","v":"B166"},null,null,null,{"$f":"IF(VLOOKUP($AA$1,INDUK40015000!$A$6:$RL$1005,317,)=0,\"-\",VLOOKUP($AA$1,INDUK40015000!$A$6:$RL$1005,317,))","v":"B222"},null,null,null,{"$f":"IF(VLOOKUP($AA$1,INDUK40015000!$A$6:$RL$1005,374,)=0,\"-\",VLOOKUP($AA$1,INDUK40015000!$A$6:$RL$1005,374,))","v":"B278"},null,null,null,{"$f":"IF(VLOOKUP($AA$1,INDUK40015000!$A$6:$RL$1005,431,)=0,\"-\",VLOOKUP($AA$1,INDUK40015000!$A$6:$RL$1005,431,))","v":"LOELOES"},null,null,null,null,null,14]
["VI.","STTB / IJAZAH :"]
[null,"21.","Nomor :",{"$f":"IF(VLOOKUP($AA$1,INDUK40015000!$A$6:$RL$1005,434,)=0,\"-\",VLOOKUP($AA$1,INDUK40015000!$A$6:$RL$1005,434,))","v":"B336"},null,null,null,null,null,null,null,null,null,"Tempat",null,null,{"$f":"IF(VLOOKUP($AA$1,INDUK40015000!$A$6:$RL$1005,435,)=0,\"-\",VLOOKUP($AA$1,INDUK40015000!$A$6:$RL$1005,435,))","v":"B337"},null,null,null,null,null,"22. Diberikan Tanggal :",null,null,null,null,null,{"$f":"IF(VLOOKUP($AA$1,INDUK40015000!$A$6:$RL$1005,436,)=0,\"-\",VLOOKUP($AA$1,INDUK40015000!$A$6:$RL$1005,436,))","v":"B338"}]
["VII.","PENGHARGAAN"]
[null,"23.","Piagam Penghargaan yang pernah diterima :"]
[]
[null,null,"a. Bidang",{"$f":"IF(VLOOKUP($AA$1,INDUK40015000!$A$6:$RL$105,437,)=0,\"-\",VLOOKUP($AA$1,INDUK40015000!$A$6:$RL$105,437,))","v":"B339"},null,null,null,null,null,null,null,null,null,"Nomor",null,":",{"$f":"IF(VLOOKUP($AA$1,INDUK40015000!$A$6:$RL$105,438,)=0,\"-\",VLOOKUP($AA$1,INDUK40015000!$A$6:$RL$105,438,))","v":"B340"},null,null,null,null,null,null,null,"Tanggal",null,":",{"$f":"IF(VLOOKUP($AA$1,INDUK40015000!$A$6:$RL$105,439,)=0,\"-\",VLOOKUP($AA$1,INDUK40015000!$A$6:$RL$105,439,))","v":"B341"}]
[]
[null,null,"b. Bidang",{"$f":"IF(VLOOKUP($AA$1,INDUK40015000!$A$6:$RL$105,440,)=0,\"-\",VLOOKUP($AA$1,INDUK40015000!$A$6:$RL$105,440,))","v":"B342"},null,null,null,null,null,null,null,null,null,"Nomor",null,":",{"$f":"IF(VLOOKUP($AA$1,INDUK40015000!$A$6:$RL$105,441,)=0,\"-\",VLOOKUP($AA$1,INDUK40015000!$A$6:$RL$105,441,))","v":"B343"},null,null,null,null,null,null,null,"Tanggal",null,":",{"$f":"IF(VLOOKUP($AA$1,INDUK40015000!$A$6:$RL$105,442,)=0,\"-\",VLOOKUP($AA$1,INDUK40015000!$A$6:$RL$105,442,))","v":"B344"}]
[]
["VIII. ","KETERANGAN"]
[null,"24.","Surat Keterangan yang pernah diberikan oleh Madrasah ini :"]
[]
[null,null,"a. Tentang",":",{"$f":"IF(VLOOKUP($AA$1,INDUK40015000!$A$6:$RL$105,443,)=0,\"-\",VLOOKUP($AA$1,INDUK40015000!$A$6:$RL$105,443,))","v":"B345"},null,null,null,null,null,null,null,null,"Nomor",null,":",{"$f":"IF(VLOOKUP($AA$1,INDUK40015000!$A$6:$RL$105,444,)=0,\"-\",VLOOKUP($AA$1,INDUK40015000!$A$6:$RL$105,444,))","v":"B346"},null,null,null,null,null,null,null,"Tanggal",null,":",{"$f":"IF(VLOOKUP($AA$1,INDUK40015000!$A$6:$RL$105,445,)=0,\"-\",VLOOKUP($AA$1,INDUK40015000!$A$6:$RL$105,445,))","v":"B347"}]
[]
[null,null,"b. Tentang",":",{"$f":"IF(VLOOKUP($AA$1,INDUK40015000!$A$6:$RL$105,446,)=0,\"-\",VLOOKUP($AA$1,INDUK40015000!$A$6:$RL$105,446,))","v":"B348"},null,null,null,null,null,null,null,null,"Nomor",null,":",{"$f":"IF(VLOOKUP($AA$1,INDUK40015000!$A$6:$RL$105,447,)=0,\"-\",VLOOKUP($AA$1,INDUK40015000!$A$6:$RL$105,447,))","v":"B349"},null,null,null,null,null,null,null,"Tanggal",null,":",{"$f":"IF(VLOOKUP($AA$1,INDUK40015000!$A$6:$RL$105,448,)=0,\"-\",VLOOKUP($AA$1,INDUK40015000!$A$6:$RL$105,448,))","v":"B350"}]