{"text_format":"1","workbook":"xlsx","n_sheets":25,"sheets":["T1","T2","T3","T4","T5","T6","RTM","MTK","PJOK","BD","BIG","ASWJ","AA","AH","FQ","SKI","BA","MLK1","MLK2","MLK3","REKAP","SW","RAPORT","MN","AB"],"not_rendered":{"charts":0,"images":5,"macros":0,"external_links":0,"defined_names":5,"comments":0,"pivot_tables":0},"unopened":[],"bounds":{"document_bytes":16777216,"sheet_cells":100000,"rows_first":2000,"rows_last":500,"rows_between":2000,"halvings":0,"cell_chars":16384,"cell_head_chars":4096},"cells_cut":0,"cells_raw":0,"read":"whole","date_system":"1900"}

{"sheet":"T1","index":0,"n_rows":100,"n_cols":47,"rows_kept":100,"cut":false,"hidden":false,"merged":[[4,23,5,24],[4,26,5,27],[4,29,5,30],[4,32,5,33],[1,1,1,46],[3,6,3,18],[3,42,5,45],[4,35,5,36],[4,38,5,40],[4,20,5,21],[8,41,9,46],[8,35,9,40],[8,23,8,34],[9,23,9,24],[9,25,9,26],[9,27,9,28],[9,29,9,30],[9,31,9,32],[9,33,9,34],[8,1,10,1],[8,4,10,4],[4,6,4,18],[5,6,5,18],[9,11,9,12],[9,13,9,14],[9,15,9,16],[8,5,8,16],[8,17,9,22],[9,5,9,6],[9,7,9,8],[9,9,9,10]]}
[]
[null,"D A F T A R   N I L A I"]
[]
[null,"MATA PELAJARAN",null,null,null,":",{"$f":"RTM!X5","v":"TEMA 1"},null,null,null,null,null,null,null,null,null,null,null,null,null,null,null,null,null,null,null,null,null,null,null,null,null,null,null,null,null,null,null,null,null,null,null,"۩MENU↗"]
[null,"KELAS",null,null,null,":",{"$f":"UPPER(MN!D22)","v":"V B"},null,null,null,null,null,null,null,null,null,null,null,null,null,"TEMA 1",null,null,"TEMA 2",null,null,"TEMA 3",null,null,"TEMA 4",null,null,"TEMA 5",null,null,"TEMA 6",null,null,"REKAP"]
[null,"TAHUN PELAJARAN",null,null,null,":",{"$f":"MN!D18","v":"2019 - 2020"}]
[]
[]
[null,"No",null,null,"Nama Siswa","NILAI PG",null,null,null,null,null,null,null,null,null,null,null,0.5,null,null,null,null,null,"NILAI ESSAY",null,null,null,null,null,null,null,null,null,null,null,{"$f":"100%-R9","v":0.5},null,null,null,null,null,"JUMLAH"]
[null,null,"No. Induk","NISN",null,"BIN",null,"MTK",null,"IPA",null,"PPKn",null,"IPS",null,"SBDP",null,null,null,null,null,null,null,"BIN",null,"MTK",null,"IPA",null,"PPKn",null,"IPS",null,"SBDP"]
[null,null,null,null,null,"Naskah 1","Naskah 2","Naskah 1","Naskah 2","Naskah 1","Naskah 2","Naskah 1","Naskah 2","Naskah 1","Naskah 2","Naskah 1","Naskah 2","BIN","MTK","IPA","PPKn","IPS","SBDP","Naskah 1","Naskah 2","Naskah 1","Naskah 2","Naskah 1","Naskah 2","Naskah 1","Naskah 2","Naskah 1","Naskah 2","Naskah 1","Naskah 2","BIN","MTK","IPA","PPKn","IPS","SBDP","BIN","MTK","IPA","PPKn","IPS","SBDP"]
[null,1,null,null,{"$f":"SW!G10","v":"ABD. ROCHMAN NAJA FATLAN PRATAMA"},23,60,null,null,23,60,23,60,23,60,23,60,{"$f":"IFERROR(ROUND(AVERAGE(F12:G12)*$R$9,0),\"\")","v":21},{"$f":"IFERROR(ROUND(AVERAGE(H12:I12)*$R$9,0),\"\")","v":""},{"$f":"IFERROR(ROUND(AVERAGE(J12:K12)*$R$9,0),\"\")","v":21},{"$f":"IFERROR(ROUND(AVERAGE(L12:M12)*$R$9,0),\"\")","v":21},{"$f":"IFERROR(ROUND(AVERAGE(N12:O12)*$R$9,0),\"\")","v":21},{"$f":"IFERROR(ROUND(AVERAGE(P12:Q12)*$R$9,0),\"\")","v":21},51,85,null,null,51,85,51,85,51,85,51,85,{"$f":"IFERROR(ROUND(AVERAGE(X12:Y12)*$AJ$9,0),\"\")","v":34},{"$f":"IFERROR(ROUND(AVERAGE(Z12:AA12)*$AJ$9,0),\"\")","v":""},{"$f":"IFERROR(ROUND(AVERAGE(AB12:AC12)*$AJ$9,0),\"\")","v":34},{"$f":"IFERROR(ROUND(AVERAGE(AD12:AE12)*$AJ$9,0),\"\")","v":34},{"$f":"IFERROR(ROUND(AVERAGE(AF12:AG12)*$AJ$9,0),\"\")","v":34},{"$f":"IFERROR(ROUND(AVERAGE(AH12:AI12)*$AJ$9,0),\"\")","v":34},{"$f":"IFERROR(ROUND(AVERAGE(R12+AJ12),0),\"\")","v":55},{"$f":"IFERROR(ROUND(AVERAGE(S12+AK12),0),\"\")","v":""},55,55,55,55]
[null,2,null,null,{"$f":"SW!G11","v":"ABDURRAHMAN FAQIH"},37,25,null,null,37,25,37,25,37,25,37,25,16,"",{"$f":"IFERROR(ROUND(AVERAGE(J13:K13)*$R$9,0),\"\")","v":16},{"$f":"IFERROR(ROUND(AVERAGE(L13:M13)*$R$9,0),\"\")","v":16},{"$f":"IFERROR(ROUND(AVERAGE(N13:O13)*$R$9,0),\"\")","v":16},{"$f":"IFERROR(ROUND(AVERAGE(P13:Q13)*$R$9,0),\"\")","v":16},59,70,null,null,59,70,59,70,59,70,59,70,{"$f":"IFERROR(ROUND(AVERAGE(X13:Y13)*$AJ$9,0),\"\")","v":32},"",{"$f":"IFERROR(ROUND(AVERAGE(AB13:AC13)*$AJ$9,0),\"\")","v":32},{"$f":"IFERROR(ROUND(AVERAGE(AD13:AE13)*$AJ$9,0),\"\")","v":32},{"$f":"IFERROR(ROUND(AVERAGE(AF13:AG13)*$AJ$9,0),\"\")","v":32},{"$f":"IFERROR(ROUND(AVERAGE(AH13:AI13)*$AJ$9,0),\"\")","v":32},{"$f":"IFERROR(ROUND(AVERAGE(R13+AJ13),0),\"\")","v":48},{"$f":"IFERROR(ROUND(AVERAGE(S13+AK13),0),\"\")","v":""},{"$f":"IFERROR(ROUND(AVERAGE(T13+AL13),0),\"\")","v":48},{"$f":"IFERROR(ROUND(AVERAGE(U13+AM13),0),\"\")","v":48},{"$f":"IFERROR(ROUND(AVERAGE(V13+AN13),0),\"\")","v":48},{"$f":"IFERROR(ROUND(AVERAGE(W13+AO13),0),\"\")","v":48}]
[null,3,null,null,{"$f":"SW!G12","v":"ACHMAD FARROIHUN MUSHOBIRONILLAH"},47,25,null,null,47,25,47,25,47,25,47,25,18,"",18,18,18,18,62,70,null,null,62,70,62,70,62,70,62,70,33,"",33,33,33,33,51,"",51,51,51,51]
[null,4,null,null,{"$f":"SW!G13","v":"ACHMAD HASBI ASSIDDIQI"},43,50,null,null,43,50,43,50,43,50,43,50,23,"",23,23,23,23,48,42,null,null,48,42,48,42,48,42,48,42,23,"",23,23,23,23,46,"",46,46,46,46]
[null,5,null,null,{"$f":"SW!G14","v":"ACHMAD REZA AKRAM ALAUDDIN"},47,50,null,null,47,50,47,50,47,50,47,50,24,"",24,24,24,24,78,100,null,null,78,100,78,100,78,100,78,100,45,"",45,45,45,45,69,"",69,69,69,69]
[null,6,null,null,{"$f":"SW!G15","v":"ACHMAD YANI"},27,15,null,null,27,15,27,15,27,15,27,15,11,"",11,11,11,11,78,60,null,null,78,60,78,60,78,60,78,60,35,"",35,35,35,35,46,"",46,46,46,46]
[null,7,null,null,{"$f":"SW!G16","v":"AKHMAD RIDWAN"},53,60,null,null,53,60,53,60,53,60,53,60,28,"",28,28,28,28,51,70,null,null,51,70,51,70,51,70,51,70,30,"",30,30,30,30,58,"",58,58,58,58]
[null,8,null,null,{"$f":"SW!G17","v":"ANDREAN DWI YULIANO"},40,30,null,null,40,30,40,30,40,30,40,30,18,"",18,18,18,18,51,70,null,null,51,70,51,70,51,70,51,70,30,"",30,30,30,30,48,"",48,48,48,48]
[null,9,null,null,{"$f":"SW!G18","v":"ASFAN FAKHRI BARANI"},63,55,null,null,63,55,63,55,63,55,63,55,30,"",30,30,30,30,59,85,null,null,59,85,59,85,59,85,59,85,36,"",36,36,36,36,66,"",66,66,66,66]
[null,10,null,null,{"$f":"SW!G19","v":"DEVAN ADITYA SAPUTRA"},40,50,null,null,40,50,40,50,40,50,40,50,23,"",23,23,23,23,56,70,null,null,56,70,56,70,56,70,56,70,32,"",32,32,32,32,55,"",55,55,55,55]
[null,11,null,null,{"$f":"SW!G20","v":"FAHRUL AHMAD FAHREZA"},57,45,null,null,57,45,57,45,57,45,57,45,26,"",26,26,26,26,51,57,null,null,51,57,51,57,51,57,51,57,27,"",27,27,27,27,53,"",53,53,53,53]
[null,12,null,null,{"$f":"SW!G21","v":"FAUZIA AMELIA PUTRI"},47,45,null,null,47,45,47,45,47,45,47,45,23,"",23,23,23,23,68,70,null,null,68,70,68,70,68,70,68,70,35,"",35,35,35,35,58,"",58,58,58,58]
[null,13,null,null,{"$f":"SW!G22","v":"FAZA AZIFAH SALSABILA"},47,50,null,null,47,50,47,50,47,50,47,50,24,"",24,24,24,24,56,57,null,null,56,57,56,57,56,57,56,57,28,"",28,28,28,28,52,"",52,52,52,52]
[null,14,null,null,{"$f":"SW!G23","v":"HABIBIE NURUSSALAM"},47,50,null,null,47,50,47,50,47,50,47,50,24,"",24,24,24,24,59,70,null,null,59,70,59,70,59,70,59,70,32,"",32,32,32,32,56,"",56,56,56,56]
[null,15,null,null,{"$f":"SW!G24","v":"HIMATURROSYIDAH"},40,55,null,null,40,55,40,55,40,55,40,55,24,"",24,24,24,24,40,85,null,null,40,85,40,85,40,85,40,85,31,"",31,31,31,31,55,"",55,55,55,55]
[null,16,null,null,{"$f":"SW!G25","v":"IFKARINA NAILA SAUQYA"},50,55,null,null,50,55,50,55,50,55,50,55,26,"",26,26,26,26,68,100,null,null,68,100,68,100,68,100,68,100,42,"",42,42,42,42,68,"",68,68,68,68]
[null,17,null,null,{"$f":"SW!G26","v":"KEISA AYU SASKIYAH"},40,40,null,null,40,40,40,40,40,40,40,40,20,"",20,20,20,20,51,70,null,null,51,70,51,70,51,70,51,70,30,"",30,30,30,30,50,"",50,50,50,50]
[null,18,null,null,{"$f":"SW!G27","v":"MOCHAMMAD RENO FIRMANSYAH"},33,15,null,null,33,15,33,15,33,15,33,15,12,"",12,12,12,12,51,40,null,null,51,40,51,40,51,40,51,40,23,"",23,23,23,23,35,"",35,35,35,35]
[null,19,null,null,{"$f":"SW!G28","v":"MOHAMAD NUR KHAFID KHABIBULLOH"},47,45,null,null,47,45,47,45,47,45,47,45,23,"",23,23,23,23,56,42,null,null,56,42,56,42,56,42,56,42,25,"",25,25,25,25,48,"",48,48,48,48]
[null,20,null,null,{"$f":"SW!G29","v":"MOHAMMAD NAUFAL NAWWARUDDIN"},33,15,null,null,33,15,33,15,33,15,33,15,12,"",12,12,12,12,45,57,null,null,45,57,45,57,45,57,45,57,26,"",26,26,26,26,38,"",38,38,38,38]
[null,21,null,null,{"$f":"SW!G30","v":"MUCHAMAD PRIMA PAMBUDI"},43,25,null,null,43,25,43,25,43,25,43,25,17,"",17,17,17,17,67,72,null,null,67,72,67,72,67,72,67,72,35,"",35,35,35,35,52,"",52,52,52,52]
[null,22,null,null,{"$f":"SW!G31","v":"MUHAMMAD ALFAN FATHONI"},33,35,null,null,33,35,33,35,33,35,33,35,17,"",17,17,17,17,56,70,null,null,56,70,56,70,56,70,56,70,32,"",32,32,32,32,49,"",49,49,49,49]
[null,23,null,null,{"$f":"SW!G32","v":"MUHAMMAD AMINULLAH MAULUDANI"},30,15,null,null,30,15,30,15,30,15,30,15,11,"",11,11,11,11,34,57,null,null,34,57,34,57,34,57,34,57,23,"",23,23,23,23,34,"",34,34,34,34]
[null,24,null,null,{"$f":"SW!G33","v":"MUHAMMAD DAVIN  LEVANTINO"},17,20,null,null,17,20,17,20,17,20,17,20,9,"",9,9,9,9,56,70,null,null,56,70,56,70,56,70,56,70,32,"",32,32,32,32,41,"",41,41,41,41]
[null,25,null,null,{"$f":"SW!G34","v":"MUHAMMAD MAULANA PAHLEVY"},40,50,null,null,40,50,40,50,40,50,40,50,23,"",23,23,23,23,51,72,null,null,51,72,51,72,51,72,51,72,31,"",31,31,31,31,54,"",54,54,54,54]
[null,26,null,null,{"$f":"SW!G35","v":"RADITYA NIRWANSYAH"},20,20,null,null,20,20,20,20,20,20,20,20,10,"",10,10,10,10,60,85,null,null,60,85,60,85,60,85,60,85,36,"",36,36,36,36,46,"",46,46,46,46]
[null,27,null,null,{"$f":"SW!G36","v":"REVINA SRI UTARI"},27,30,null,null,27,30,27,30,27,30,27,30,14,"",14,14,14,14,48,72,null,null,48,72,48,72,48,72,48,72,30,"",30,30,30,30,44,"",44,44,44,44]
[null,28,null,null,{"$f":"SW!G37","v":"REYHAN DWI ANDIKA"},37,30,null,null,37,30,37,30,37,30,37,30,17,"",17,17,17,17,56,57,null,null,56,57,56,57,56,57,56,57,28,"",28,28,28,28,45,"",45,45,45,45]
[null,29,null,null,{"$f":"SW!G38","v":"RISKA LAURA TRIA OCTAVIA"},67,50,null,null,67,50,67,50,67,50,67,50,29,"",29,29,29,29,67,70,null,null,67,70,67,70,67,70,67,70,34,"",34,34,34,34,63,"",63,63,63,63]
[null,30,null,null,{"$f":"SW!G39","v":"ROHMADONA DWI SAFITRI"},57,55,null,null,57,55,57,55,57,55,57,55,28,"",28,28,28,28,70,85,null,null,70,85,70,85,70,85,70,85,39,"",39,39,39,39,67,"",67,67,67,67]
[null,31,null,null,{"$f":"SW!G40","v":"SALMAN ALFARIZI"},30,35,null,null,30,35,30,35,30,35,30,35,16,"",16,16,16,16,67,40,null,null,67,40,67,40,67,40,67,40,27,"",27,27,27,27,43,"",43,43,43,43]
[null,32,null,null,{"$f":"SW!G41","v":"TAUFIQ KURROHMAN"},37,45,null,null,37,45,37,45,37,45,37,45,21,"",21,21,21,21,70,57,null,null,70,57,70,57,70,57,70,57,32,"",32,32,32,32,53,"",53,53,53,53]
[null,33,null,null,{"$f":"SW!G42","v":0},null,null,null,null,null,null,null,null,null,null,null,null,{"$f":"IFERROR(ROUND(AVERAGE(F44:G44)*$R$9,0),\"\")","v":""},{"$f":"IFERROR(ROUND(AVERAGE(H44:I44)*$R$9,0),\"\")","v":""},"","","","",null,null,null,null,null,null,null,null,null,null,null,null,"","","","","","","","","","","",""]
[null,34,null,null,{"$f":"SW!G43","v":0},null,null,null,null,null,null,null,null,null,null,null,null,"","","","","","",null,null,null,null,null,null,null,null,null,null,null,null,"","","","","","","","","","","",""]
[null,35,null,null,{"$f":"SW!G44","v":0},null,null,null,null,null,null,null,null,null,null,null,null,"","","","","","",null,null,null,null,null,null,null,null,null,null,null,null,"","","","","","","","","","","",""]
[null,36,null,null,{"$f":"SW!G45","v":0},null,null,null,null,null,null,null,null,null,null,null,null,"","","","","","",null,null,null,null,null,null,null,null,null,null,null,null,"","","","","","","","","","","",""]
[null,37,null,null,{"$f":"SW!G46","v":0},null,null,null,null,null,null,null,null,null,null,null,null,"","","","","","",null,null,null,null,null,null,null,null,null,null,null,null,"","","","","","","","","","","",""]
[null,38,null,null,{"$f":"SW!G47","v":0},null,null,null,null,null,null,null,null,null,null,null,null,"","","","","","",null,null,null,null,null,null,null,null,null,null,null,null,"","","","","","","","","","","",""]
[null,39,null,null,{"$f":"SW!G48","v":0},null,null,null,null,null,null,null,null,null,null,null,null,"","","","","","",null,null,null,null,null,null,null,null,null,null,null,null,"","","","","","","","","","","",""]
[null,40,null,null,{"$f":"SW!G49","v":0},null,null,null,null,null,null,null,null,null,null,null,null,"","","","","","",null,null,null,null,null,null,null,null,null,null,null,null,"","","","","","","","","","","",""]
[null,41,null,null,{"$f":"SW!G50","v":0},null,null,null,null,null,null,null,null,null,null,null,null,"","","","","","",null,null,null,null,null,null,null,null,null,null,null,null,"","","","","","","","","","","",""]
[null,42,null,null,{"$f":"SW!G51","v":0},null,null,null,null,null,null,null,null,null,null,null,null,"","","","","","",null,null,null,null,null,null,null,null,null,null,null,null,"","","","","","","","","","","",""]
[null,43,null,null,{"$f":"SW!G52","v":0},null,null,null,null,null,null,null,null,null,null,null,null,"","","","","","",null,null,null,null,null,null,null,null,null,null,null,null,"","","","","","","","","","","",""]
[null,44,null,null,{"$f":"SW!G53","v":0},null,null,null,null,null,null,null,null,null,null,null,null,"","","","","","",null,null,null,null,null,null,null,null,null,null,null,null,"","","","","","","","","","","",""]
[null,45,null,null,{"$f":"SW!G54","v":0},null,null,null,null,null,null,null,null,null,null,null,null,"","","","","","",null,null,null,null,null,null,null,null,null,null,null,null,"","","","","","","","","","","",""]
[null,46,null,null,{"$f":"SW!G55","v":0},null,null,null,null,null,null,null,null,null,null,null,null,"","","","","","",null,null,null,null,null,null,null,null,null,null,null,null,"","","","","","","","","","","",""]
[null,47,null,null,{"$f":"SW!G56","v":0},null,null,null,null,null,null,null,null,null,null,null,null,"","","","","","",null,null,null,null,null,null,null,null,null,null,null,null,"","","","","","","","","","","",""]
[null,48,null,null,{"$f":"SW!G57","v":0},null,null,null,null,null,null,null,null,null,null,null,null,"","","","","","",null,null,null,null,null,null,null,null,null,null,null,null,"","","","","","","","","","","",""]
[null,49,null,null,{"$f":"SW!G58","v":0},null,null,null,null,null,null,null,null,null,null,null,null,"","","","","","",null,null,null,null,null,null,null,null,null,null,null,null,"","","","","","","","","","","",""]
[null,50,null,null,{"$f":"SW!G59","v":0},null,null,null,null,null,null,null,null,null,null,null,null,"","","","","","",null,null,null,null,null,null,null,null,null,null,null,null,"","","","","","","","","","","",""]
[null,51,null,null,{"$f":"SW!G60","v":0},null,null,null,null,null,null,null,null,null,null,null,null,"","","","","","",null,null,null,null,null,null,null,null,null,null,null,null,"","","","","","","","","","","",""]
[null,52,null,null,{"$f":"SW!G61","v":0},null,null,null,null,null,null,null,null,null,null,null,null,"","","","","","",null,null,null,null,null,null,null,null,null,null,null,null,"","","","","","","","","","","",""]
[null,53,null,null,{"$f":"SW!G62","v":0},null,null,null,null,null,null,null,null,null,null,null,null,"","","","","","",null,null,null,null,null,null,null,null,null,null,null,null,"","","","","","","","","","","",""]
[null,54,null,null,{"$f":"SW!G63","v":0},null,null,null,null,null,null,null,null,null,null,null,null,"","","","","","",null,null,null,null,null,null,null,null,null,null,null,null,"","","","","","","","","","","",""]
[null,55,null,null,{"$f":"SW!G64","v":0},null,null,null,null,null,null,null,null,null,null,null,null,"","","","","","",null,null,null,null,null,null,null,null,null,null,null,null,"","","","","","","","","","","",""]
[null,56,null,null,{"$f":"SW!G65","v":0},null,null,null,null,null,null,null,null,null,null,null,null,"","","","","","",null,null,null,null,null,null,null,null,null,null,null,null,"","","","","","","","","","","",""]
[null,57,null,null,{"$f":"SW!G66","v":0},null,null,null,null,null,null,null,null,null,null,null,null,"","","","","","",null,null,null,null,null,null,null,null,null,null,null,null,"","","","","","","","","","","",""]
[null,58,null,null,{"$f":"SW!G67","v":0},null,null,null,null,null,null,null,null,null,null,null,null,"","","","","","",null,null,null,null,null,null,null,null,null,null,null,null,"","","","","","","","","","","",""]
[null,59,null,null,{"$f":"SW!G68","v":0},null,null,null,null,null,null,null,null,null,null,null,null,"","","","","","",null,null,null,null,null,null,null,null,null,null,null,null,"","","","","","","","","","","",""]
[null,60,null,null,{"$f":"SW!G69","v":0},null,null,null,null,null,null,null,null,null,null,null,null,"","","","","","",null,null,null,null,null,null,null,null,null,null,null,null,"","","","","","","","","","","",""]
[null,61,null,null,{"$f":"SW!G70","v":0},null,null,null,null,null,null,null,null,null,null,null,null,"","","","","","",null,null,null,null,null,null,null,null,null,null,null,null,"","","","","","","","","","","",""]
[null,62,null,null,{"$f":"SW!G71","v":0},null,null,null,null,null,null,null,null,null,null,null,null,"","","","","","",null,null,null,null,null,null,null,null,null,null,null,null,"","","","","","","","","","","",""]
[null,63,null,null,{"$f":"SW!G72","v":0},null,null,null,null,null,null,null,null,null,null,null,null,"","","","","","",null,null,null,null,null,null,null,null,null,null,null,null,"","","","","","","","","","","",""]
[null,64,null,null,{"$f":"SW!G73","v":0},null,null,null,null,null,null,null,null,null,null,null,null,"","","","","","",null,null,null,null,null,null,null,null,null,null,null,null,"","","","","","","","","","","",""]
[null,65,null,null,{"$f":"SW!G74","v":0},null,null,null,null,null,null,null,null,null,null,null,null,{"$f":"IFERROR(ROUND(AVERAGE(F76:G76)*$R$9,0),\"\")","v":""},{"$f":"IFERROR(ROUND(AVERAGE(H76:I76)*$R$9,0),\"\")","v":""},"","","","",null,null,null,null,null,null,null,null,null,null,null,null,"","","","","","","","","","","",""]
[null,66,null,null,{"$f":"SW!G75","v":0},null,null,null,null,null,null,null,null,null,null,null,null,"","",{"$f":"IFERROR(ROUND(AVERAGE(J77:K77)*$R$9,0),\"\")","v":""},{"$f":"IFERROR(ROUND(AVERAGE(L77:M77)*$R$9,0),\"\")","v":""},{"$f":"IFERROR(ROUND(AVERAGE(N77:O77)*$R$9,0),\"\")","v":""},{"$f":"IFERROR(ROUND(AVERAGE(P77:Q77)*$R$9,0),\"\")","v":""},null,null,null,null,null,null,null,null,null,null,null,null,{"$f":"IFERROR(ROUND(AVERAGE(X77:Y77)*$AJ$9,0),\"\")","v":""},{"$f":"IFERROR(ROUND(AVERAGE(Z77:AA77)*$AJ$9,0),\"\")","v":""},{"$f":"IFERROR(ROUND(AVERAGE(AB77:AC77)*$AJ$9,0),\"\")","v":""},{"$f":"IFERROR(ROUND(AVERAGE(AD77:AE77)*$AJ$9,0),\"\")","v":""},{"$f":"IFERROR(ROUND(AVERAGE(AF77:AG77)*$AJ$9,0),\"\")","v":""},{"$f":"IFERROR(ROUND(AVERAGE(AH77:AI77)*$AJ$9,0),\"\")","v":""},{"$f":"IFERROR(ROUND(AVERAGE(R77+AJ77),0),\"\")","v":""},{"$f":"IFERROR(ROUND(AVERAGE(S77+AK77),0),\"\")","v":""},{"$f":"IFERROR(ROUND(AVERAGE(T77+AL77),0),\"\")","v":""},{"$f":"IFERROR(ROUND(AVERAGE(U77+AM77),0),\"\")","v":""},{"$f":"IFERROR(ROUND(AVERAGE(V77+AN77),0),\"\")","v":""},{"$f":"IFERROR(ROUND(AVERAGE(W77+AO77),0),\"\")","v":""}]
[null,67,null,null,{"$f":"SW!G76","v":0},null,null,null,null,null,null,null,null,null,null,null,null,"","","","","","",null,null,null,null,null,null,null,null,null,null,null,null,"","","","","","","","","","","",""]
[null,68,null,null,{"$f":"SW!G77","v":0},null,null,null,null,null,null,null,null,null,null,null,null,"","","","","","",null,null,null,null,null,null,null,null,null,null,null,null,"","","","","","","","","","","",""]
[null,69,null,null,{"$f":"SW!G78","v":0},null,null,null,null,null,null,null,null,null,null,null,null,"","","","","","",null,null,null,null,null,null,null,null,null,null,null,null,"","","","","","","","","","","",""]
[null,70,null,null,{"$f":"SW!G79","v":0},null,null,null,null,null,null,null,null,null,null,null,null,"","","","","","",null,null,null,null,null,null,null,null,null,null,null,null,"","","","","","","","","","","",""]
[null,71,null,null,{"$f":"SW!G80","v":0},null,null,null,null,null,null,null,null,null,null,null,null,"","","","","","",null,null,null,null,null,null,null,null,null,null,null,null,"","","","","","","","","","","",""]
[null,72,null,null,{"$f":"SW!G81","v":0},null,null,null,null,null,null,null,null,null,null,null,null,"","","","","","",null,null,null,null,null,null,null,null,null,null,null,null,"","","","","","","","","","","",""]
[null,73,null,null,{"$f":"SW!G82","v":0},null,null,null,null,null,null,null,null,null,null,null,null,"","","","","","",null,null,null,null,null,null,null,null,null,null,null,null,"","","","","","","","","","","",""]
[null,74,null,null,{"$f":"SW!G83","v":0},null,null,null,null,null,null,null,null,null,null,null,null,"","","","","","",null,null,null,null,null,null,null,null,null,null,null,null,"","","","","","","","","","","",""]
[null,75,null,null,{"$f":"SW!G84","v":0},null,null,null,null,null,null,null,null,null,null,null,null,"","","","","","",null,null,null,null,null,null,null,null,null,null,null,null,"","","","","","","","","","","",""]
[null,76,null,null,{"$f":"SW!G85","v":0},null,null,null,null,null,null,null,null,null,null,null,null,"","","","","","",null,null,null,null,null,null,null,null,null,null,null,null,"","","","","","","","","","","",""]
[null,77,null,null,{"$f":"SW!G86","v":0},null,null,null,null,null,null,null,null,null,null,null,null,"","","","","","",null,null,null,null,null,null,null,null,null,null,null,null,"","","","","","","","","","","",""]
[null,78,null,null,{"$f":"SW!G87","v":0},null,null,null,null,null,null,null,null,null,null,null,null,"","","","","","",null,null,null,null,null,null,null,null,null,null,null,null,"","","","","","","","","","","",""]
[null,79,null,null,{"$f":"SW!G88","v":0},null,null,null,null,null,null,null,null,null,null,null,null,"","","","","","",null,null,null,null,null,null,null,null,null,null,null,null,"","","","","","","","","","","",""]
[null,80,null,null,{"$f":"SW!G89","v":0},null,null,null,null,null,null,null,null,null,null,null,null,"","","","","","",null,null,null,null,null,null,null,null,null,null,null,null,"","","","","","","","","","","",""]
[null,81,null,null,{"$f":"SW!G90","v":0},null,null,null,null,null,null,null,null,null,null,null,null,"","","","","","",null,null,null,null,null,null,null,null,null,null,null,null,"","","","","","","","","","","",""]
[null,82,null,null,{"$f":"SW!G91","v":0},null,null,null,null,null,null,null,null,null,null,null,null,"","","","","","",null,null,null,null,null,null,null,null,null,null,null,null,"","","","","","","","","","","",""]
[null,83,null,null,{"$f":"SW!G92","v":0},null,null,null,null,null,null,null,null,null,null,null,null,"","","","","","",null,null,null,null,null,null,null,null,null,null,null,null,"","","","","","","","","","","",""]
[null,84,null,null,{"$f":"SW!G93","v":0},null,null,null,null,null,null,null,null,null,null,null,null,"","","","","","",null,null,null,null,null,null,null,null,null,null,null,null,"","","","","","","","","","","",""]
[null,85,null,null,{"$f":"SW!G94","v":0},null,null,null,null,null,null,null,null,null,null,null,null,"","","","","","",null,null,null,null,null,null,null,null,null,null,null,null,"","","","","","","","","","","",""]
[null,86,null,null,{"$f":"SW!G95","v":0},null,null,null,null,null,null,null,null,null,null,null,null,"","","","","","",null,null,null,null,null,null,null,null,null,null,null,null,"","","","","","","","","","","",""]
[null,87,null,null,{"$f":"SW!G96","v":0},null,null,null,null,null,null,null,null,null,null,null,null,"","","","","","",null,null,null,null,null,null,null,null,null,null,null,null,"","","","","","","","","","","",""]
[null,88,null,null,{"$f":"SW!G97","v":0},null,null,null,null,null,null,null,null,null,null,null,null,"","","","","","",null,null,null,null,null,null,null,null,null,null,null,null,"","","","","","","","","","","",""]
[null,89,null,null,{"$f":"SW!G98","v":0},null,null,null,null,null,null,null,null,null,null,null,null,"","","","","","",null,null,null,null,null,null,null,null,null,null,null,null,"","","","","","","","","","","",""]

{"sheet":"T2","index":1,"n_rows":100,"n_cols":47,"rows_kept":100,"cut":false,"hidden":false,"merged":[[4,20,5,21],[4,23,5,24],[4,26,5,27],[4,29,5,30],[4,32,5,33],[9,29,9,30],[9,31,9,32],[9,33,9,34],[4,35,5,36],[4,38,5,40],[9,13,9,14],[9,15,9,16],[9,23,9,24],[9,25,9,26],[9,27,9,28],[8,1,10,1],[8,4,10,4],[8,5,8,16],[8,17,9,22],[1,1,1,46],[3,6,3,18],[3,42,5,45],[4,6,4,18],[5,6,5,18],[8,23,8,34],[8,35,9,40],[8,41,9,46],[9,5,9,6],[9,7,9,8],[9,9,9,10],[9,11,9,12]]}
[]
[null,"D A F T A R   N I L A I"]
[]
[null,"MATA PELAJARAN",null,null,null,":",{"$f":"RTM!AA5","v":"TEMA 2"},null,null,null,null,null,null,null,null,null,null,null,null,null,null,null,null,null,null,null,null,null,null,null,null,null,null,null,null,null,null,null,null,null,null,null,"۩MENU↗"]
[null,"KELAS",null,null,null,":",{"$f":"UPPER(MN!D22)","v":"V B"},null,null,null,null,null,null,null,null,null,null,null,null,null,"TEMA 1",null,null,"TEMA 2",null,null,"TEMA 3",null,null,"TEMA 4",null,null,"TEMA 5",null,null,"TEMA 6",null,null,"REKAP"]
[null,"TAHUN PELAJARAN",null,null,null,":",{"$f":"MN!D18","v":"2019 - 2020"}]
[]
[]
[null,"No",null,null,"Nama Siswa","NILAI PG",null,null,null,null,null,null,null,null,null,null,null,0.5,null,null,null,null,null,"NILAI ESSAY",null,null,null,null,null,null,null,null,null,null,null,{"$f":"100%-R9","v":0.5},null,null,null,null,null,"JUMLAH"]
[null,null,"No. Induk","NISN",null,"BIN",null,"MTK",null,"IPA",null,"PPKn",null,"IPS",null,"SBDP",null,null,null,null,null,null,null,"BIN",null,"MTK",null,"IPA",null,"PPKn",null,"IPS",null,"SBDP"]
[null,null,null,null,null,"Naskah 1","Naskah 2","Naskah 1","Naskah 2","Naskah 1","Naskah 2","Naskah 1","Naskah 2","Naskah 1","Naskah 2","Naskah 1","Naskah 2","BIN","MTK","IPA","PPKn","IPS","SBDP","Naskah 1","Naskah 2","Naskah 1","Naskah 2","Naskah 1","Naskah 2","Naskah 1","Naskah 2","Naskah 1","Naskah 2","Naskah 1","Naskah 2","BIN","MTK","IPA","PPKn","IPS","SBDP","BIN","MTK","IPA","PPKn","IPS","SBDP"]
[null,1,null,null,{"$f":"SW!G10","v":"ABD. ROCHMAN NAJA FATLAN PRATAMA"},40,30,null,null,40,30,40,30,40,30,40,30,{"$f":"IFERROR(ROUND(AVERAGE(F12:G12)*$R$9,0),\"\")","v":18},{"$f":"IFERROR(ROUND(AVERAGE(H12:I12)*$R$9,0),\"\")","v":""},{"$f":"IFERROR(ROUND(AVERAGE(J12:K12)*$R$9,0),\"\")","v":18},{"$f":"IFERROR(ROUND(AVERAGE(L12:M12)*$R$9,0),\"\")","v":18},{"$f":"IFERROR(ROUND(AVERAGE(N12:O12)*$R$9,0),\"\")","v":18},{"$f":"IFERROR(ROUND(AVERAGE(P12:Q12)*$R$9,0),\"\")","v":18},63,40,null,null,63,40,63,40,63,40,63,40,{"$f":"IFERROR(ROUND(AVERAGE(X12:Y12)*$AJ$9,0),\"\")","v":26},{"$f":"IFERROR(ROUND(AVERAGE(Z12:AA12)*$AJ$9,0),\"\")","v":""},{"$f":"IFERROR(ROUND(AVERAGE(AB12:AC12)*$AJ$9,0),\"\")","v":26},{"$f":"IFERROR(ROUND(AVERAGE(AD12:AE12)*$AJ$9,0),\"\")","v":26},{"$f":"IFERROR(ROUND(AVERAGE(AF12:AG12)*$AJ$9,0),\"\")","v":26},{"$f":"IFERROR(ROUND(AVERAGE(AH12:AI12)*$AJ$9,0),\"\")","v":26},{"$f":"IFERROR(ROUND(AVERAGE(R12+AJ12),0),\"\")","v":44},"",44,44,44,44]
[null,2,null,null,{"$f":"SW!G11","v":"ABDURRAHMAN FAQIH"},20,15,null,null,20,15,20,15,20,15,20,15,{"$f":"IFERROR(ROUND(AVERAGE(F13:G13)*$R$9,0),\"\")","v":9},{"$f":"IFERROR(ROUND(AVERAGE(H13:I13)*$R$9,0),\"\")","v":""},{"$f":"IFERROR(ROUND(AVERAGE(J13:K13)*$R$9,0),\"\")","v":9},{"$f":"IFERROR(ROUND(AVERAGE(L13:M13)*$R$9,0),\"\")","v":9},{"$f":"IFERROR(ROUND(AVERAGE(N13:O13)*$R$9,0),\"\")","v":9},{"$f":"IFERROR(ROUND(AVERAGE(P13:Q13)*$R$9,0),\"\")","v":9},45,40,null,null,45,40,45,40,45,40,45,40,{"$f":"IFERROR(ROUND(AVERAGE(X13:Y13)*$AJ$9,0),\"\")","v":21},"",{"$f":"IFERROR(ROUND(AVERAGE(AB13:AC13)*$AJ$9,0),\"\")","v":21},{"$f":"IFERROR(ROUND(AVERAGE(AD13:AE13)*$AJ$9,0),\"\")","v":21},{"$f":"IFERROR(ROUND(AVERAGE(AF13:AG13)*$AJ$9,0),\"\")","v":21},{"$f":"IFERROR(ROUND(AVERAGE(AH13:AI13)*$AJ$9,0),\"\")","v":21},30,"",30,30,30,30]
[null,3,null,null,{"$f":"SW!G12","v":"ACHMAD FARROIHUN MUSHOBIRONILLAH"},67,40,null,null,67,40,67,40,67,40,67,40,27,"",27,27,27,27,63,85,null,null,63,85,63,85,63,85,63,85,37,"",37,37,37,37,64,"",64,64,64,64]
[null,4,null,null,{"$f":"SW!G13","v":"ACHMAD HASBI ASSIDDIQI"},37,30,null,null,37,30,37,30,37,30,37,30,17,"",17,17,17,17,72,40,null,null,72,40,72,40,72,40,72,40,28,"",28,28,28,28,45,"",45,45,45,45]
[null,5,null,null,{"$f":"SW!G14","v":"ACHMAD REZA AKRAM ALAUDDIN"},87,50,null,null,87,50,87,50,87,50,87,50,34,"",34,34,34,34,72,55,null,null,72,55,72,55,72,55,72,55,32,"",32,32,32,32,66,"",66,66,66,66]
[null,6,null,null,{"$f":"SW!G15","v":"ACHMAD YANI"},70,45,null,null,70,45,70,45,70,45,70,45,29,"",29,29,29,29,45,85,null,null,45,85,45,85,45,85,45,85,33,"",33,33,33,33,62,"",62,62,62,62]
[null,7,null,null,{"$f":"SW!G16","v":"AKHMAD RIDWAN"},80,50,null,null,80,50,80,50,80,50,80,50,33,"",33,33,33,33,100,55,null,null,100,55,100,55,100,55,100,55,39,"",39,39,39,39,72,"",72,72,72,72]
[null,8,null,null,{"$f":"SW!G17","v":"ANDREAN DWI YULIANO"},47,30,null,null,47,30,47,30,47,30,47,30,19,"",19,19,19,19,63,55,null,null,63,55,63,55,63,55,63,55,30,"",30,30,30,30,49,"",49,49,49,49]
[null,9,null,null,{"$f":"SW!G18","v":"ASFAN FAKHRI BARANI"},77,20,null,null,77,20,77,20,77,20,77,20,24,"",24,24,24,24,63,70,null,null,63,70,63,70,63,70,63,70,33,"",33,33,33,33,57,"",57,57,57,57]
[null,10,null,null,{"$f":"SW!G19","v":"DEVAN ADITYA SAPUTRA"},50,35,null,null,50,35,50,35,50,35,50,35,21,"",21,21,21,21,100,55,null,null,100,55,100,55,100,55,100,55,39,"",39,39,39,39,60,"",60,60,60,60]
[null,11,null,null,{"$f":"SW!G20","v":"FAHRUL AHMAD FAHREZA"},77,55,null,null,77,55,77,55,77,55,77,55,33,"",33,33,33,33,85,85,null,null,85,85,85,85,85,85,85,85,43,"",43,43,43,43,76,"",76,76,76,76]
[null,12,null,null,{"$f":"SW!G21","v":"FAUZIA AMELIA PUTRI"},77,45,null,null,77,45,77,45,77,45,77,45,31,"",31,31,31,31,76,85,null,null,76,85,76,85,76,85,76,85,40,"",40,40,40,40,71,"",71,71,71,71]
[null,13,null,null,{"$f":"SW!G22","v":"FAZA AZIFAH SALSABILA"},63,50,null,null,63,50,63,50,63,50,63,50,28,"",28,28,28,28,63,55,null,null,63,55,63,55,63,55,63,55,30,"",30,30,30,30,58,"",58,58,58,58]
[null,14,null,null,{"$f":"SW!G23","v":"HABIBIE NURUSSALAM"},73,50,null,null,73,50,73,50,73,50,73,50,31,"",31,31,31,31,63,55,null,null,63,55,63,55,63,55,63,55,30,"",30,30,30,30,61,"",61,61,61,61]
[null,15,null,null,{"$f":"SW!G24","v":"HIMATURROSYIDAH"},77,35,null,null,77,35,77,35,77,35,77,35,28,"",28,28,28,28,76,100,null,null,76,100,76,100,76,100,76,100,44,"",44,44,44,44,72,"",72,72,72,72]
[null,16,null,null,{"$f":"SW!G25","v":"IFKARINA NAILA SAUQYA"},73,60,null,null,73,60,73,60,73,60,73,60,33,"",33,33,33,33,85,70,null,null,85,70,85,70,85,70,85,70,39,"",39,39,39,39,72,"",72,72,72,72]
[null,17,null,null,{"$f":"SW!G26","v":"KEISA AYU SASKIYAH"},63,20,null,null,63,20,63,20,63,20,63,20,21,"",21,21,21,21,85,40,null,null,85,40,85,40,85,40,85,40,31,"",31,31,31,31,{"$f":"IFERROR(ROUND(AVERAGE(R28+AJ28),0),\"\")","v":52},"",52,52,52,52]
[null,18,null,null,{"$f":"SW!G27","v":"MOCHAMMAD RENO FIRMANSYAH"},20,35,null,null,20,35,20,35,20,35,20,35,14,"",14,14,14,14,45,40,null,null,45,40,45,40,45,40,45,40,21,"",21,21,21,21,35,"",35,35,35,35]
[null,19,null,null,{"$f":"SW!G28","v":"MOHAMAD NUR KHAFID KHABIBULLOH"},80,35,null,null,80,35,80,35,80,35,80,35,29,"",29,29,29,29,85,70,null,null,85,70,85,70,85,70,85,70,39,"",39,39,39,39,68,"",68,68,68,68]
[null,20,null,null,{"$f":"SW!G29","v":"MOHAMMAD NAUFAL NAWWARUDDIN"},33,40,null,null,33,40,33,40,33,40,33,40,18,"",18,18,18,18,45,55,null,null,45,55,45,55,45,55,45,55,25,"",25,25,25,25,43,"",43,43,43,43]
[null,21,null,null,{"$f":"SW!G30","v":"MUCHAMAD PRIMA PAMBUDI"},43,25,null,null,43,25,43,25,43,25,43,25,17,"",17,17,17,17,85,70,null,null,85,70,85,70,85,70,85,70,39,"",39,39,39,39,56,"",56,56,56,56]
[null,22,null,null,{"$f":"SW!G31","v":"MUHAMMAD ALFAN FATHONI"},60,35,null,null,60,35,60,35,60,35,60,35,24,"",24,24,24,24,72,40,null,null,72,40,72,40,72,40,72,40,28,"",28,28,28,28,52,"",52,52,52,52]
[null,23,null,null,{"$f":"SW!G32","v":"MUHAMMAD AMINULLAH MAULUDANI"},37,20,null,null,37,20,37,20,37,20,37,20,14,"",14,14,14,14,85,40,null,null,85,40,85,40,85,40,85,40,31,"",31,31,31,31,45,"",45,45,45,45]
[null,24,null,null,{"$f":"SW!G33","v":"MUHAMMAD DAVIN  LEVANTINO"},80,15,null,null,80,15,80,15,80,15,80,15,24,"",24,24,24,24,85,40,null,null,85,40,85,40,85,40,85,40,31,"",31,31,31,31,55,"",55,55,55,55]
[null,25,null,null,{"$f":"SW!G34","v":"MUHAMMAD MAULANA PAHLEVY"},50,30,null,null,50,30,50,30,50,30,50,30,20,"",20,20,20,20,85,40,null,null,85,40,85,40,85,40,85,40,31,"",31,31,31,31,51,"",51,51,51,51]
[null,26,null,null,{"$f":"SW!G35","v":"RADITYA NIRWANSYAH"},30,25,null,null,30,25,30,25,30,25,30,25,14,"",14,14,14,14,45,40,null,null,45,40,45,40,45,40,45,40,21,"",21,21,21,21,35,"",35,35,35,35]
[null,27,null,null,{"$f":"SW!G36","v":"REVINA SRI UTARI"},60,25,null,null,60,25,60,25,60,25,60,25,21,"",21,21,21,21,63,70,null,null,63,70,63,70,63,70,63,70,33,"",33,33,33,33,54,"",54,54,54,54]
[null,28,null,null,{"$f":"SW!G37","v":"REYHAN DWI ANDIKA"},37,20,null,null,37,20,37,20,37,20,37,20,14,"",14,14,14,14,72,55,null,null,72,55,72,55,72,55,72,55,32,"",32,32,32,32,46,"",46,46,46,46]
[null,29,null,null,{"$f":"SW!G38","v":"RISKA LAURA TRIA OCTAVIA"},87,35,null,null,87,35,87,35,87,35,87,35,31,"",31,31,31,31,72,70,null,null,72,70,72,70,72,70,72,70,36,"",36,36,36,36,67,"",67,67,67,67]
[null,30,null,null,{"$f":"SW!G39","v":"ROHMADONA DWI SAFITRI"},77,60,null,null,77,60,77,60,77,60,77,60,34,"",34,34,34,34,100,85,null,null,100,85,100,85,100,85,100,85,46,"",46,46,46,46,80,"",80,80,80,80]
[null,31,null,null,{"$f":"SW!G40","v":"SALMAN ALFARIZI"},47,20,null,null,47,20,47,20,47,20,47,20,17,"",17,17,17,17,63,55,null,null,63,55,63,55,63,55,63,55,30,"",30,30,30,30,47,"",47,47,47,47]
[null,32,null,null,{"$f":"SW!G41","v":"TAUFIQ KURROHMAN"},43,15,null,null,43,15,43,15,43,15,43,15,15,"",15,15,15,15,72,70,null,null,72,70,72,70,72,70,72,70,36,"",36,36,36,36,51,"",51,51,51,51]
[null,33,null,null,{"$f":"SW!G42","v":0},null,null,null,null,null,null,null,null,null,null,null,null,"","","","","","",null,null,null,null,null,null,null,null,null,null,null,null,"","","","","","","","","","","",""]
[null,34,null,null,{"$f":"SW!G43","v":0},null,null,null,null,null,null,null,null,null,null,null,null,"","","","","","",null,null,null,null,null,null,null,null,null,null,null,null,"","","","","","","","","","","",""]
[null,35,null,null,{"$f":"SW!G44","v":0},null,null,null,null,null,null,null,null,null,null,null,null,"","","","","","",null,null,null,null,null,null,null,null,null,null,null,null,"","","","","","","","","","","",""]
[null,36,null,null,{"$f":"SW!G45","v":0},null,null,null,null,null,null,null,null,null,null,null,null,"","","","","","",null,null,null,null,null,null,null,null,null,null,null,null,"","","","","","","","","","","",""]
[null,37,null,null,{"$f":"SW!G46","v":0},null,null,null,null,null,null,null,null,null,null,null,null,"","","","","","",null,null,null,null,null,null,null,null,null,null,null,null,"","","","","","","","","","","",""]
[null,38,null,null,{"$f":"SW!G47","v":0},null,null,null,null,null,null,null,null,null,null,null,null,"","","","","","",null,null,null,null,null,null,null,null,null,null,null,null,"","","","","","","","","","","",""]
[null,39,null,null,{"$f":"SW!G48","v":0},null,null,null,null,null,null,null,null,null,null,null,null,"","","","","","",null,null,null,null,null,null,null,null,null,null,null,null,"","","","","","","","","","","",""]
[null,40,null,null,{"$f":"SW!G49","v":0},null,null,null,null,null,null,null,null,null,null,null,null,"","","","","","",null,null,null,null,null,null,null,null,null,null,null,null,"","","","","","","","","","","",""]
[null,41,null,null,{"$f":"SW!G50","v":0},null,null,null,null,null,null,null,null,null,null,null,null,"","","","","","",null,null,null,null,null,null,null,null,null,null,null,null,"","","","","","","","","","","",""]
[null,42,null,null,{"$f":"SW!G51","v":0},null,null,null,null,null,null,null,null,null,null,null,null,"","","","","","",null,null,null,null,null,null,null,null,null,null,null,null,"","","","","","","","","","","",""]
[null,43,null,null,{"$f":"SW!G52","v":0},null,null,null,null,null,null,null,null,null,null,null,null,"","","","","","",null,null,null,null,null,null,null,null,null,null,null,null,"","","","","","","","","","","",""]
[null,44,null,null,{"$f":"SW!G53","v":0},null,null,null,null,null,null,null,null,null,null,null,null,"","","","","","",null,null,null,null,null,null,null,null,null,null,null,null,"","","","","","","","","","","",""]
[null,45,null,null,{"$f":"SW!G54","v":0},null,null,null,null,null,null,null,null,null,null,null,null,"","","","","","",null,null,null,null,null,null,null,null,null,null,null,null,"","","","","","","","","","","",""]
[null,46,null,null,{"$f":"SW!G55","v":0},null,null,null,null,null,null,null,null,null,null,null,null,"","","","","","",null,null,null,null,null,null,null,null,null,null,null,null,"","","","","","","","","","","",""]
[null,47,null,null,{"$f":"SW!G56","v":0},null,null,null,null,null,null,null,null,null,null,null,null,"","","","","","",null,null,null,null,null,null,null,null,null,null,null,null,"","","","","","","","","","","",""]
[null,48,null,null,{"$f":"SW!G57","v":0},null,null,null,null,null,null,null,null,null,null,null,null,"","","","","","",null,null,null,null,null,null,null,null,null,null,null,null,"","","","","","","","","","","",""]
[null,49,null,null,{"$f":"SW!G58","v":0},null,null,null,null,null,null,null,null,null,null,null,null,"","","","","","",null,null,null,null,null,null,null,null,null,null,null,null,"","","","","","","","","","","",""]
[null,50,null,null,{"$f":"SW!G59","v":0},null,null,null,null,null,null,null,null,null,null,null,null,"","","","","","",null,null,null,null,null,null,null,null,null,null,null,null,"","","","","","","","","","","",""]
[null,51,null,null,{"$f":"SW!G60","v":0},null,null,null,null,null,null,null,null,null,null,null,null,"","","","","","",null,null,null,null,null,null,null,null,null,null,null,null,"","","","","","","","","","","",""]
[null,52,null,null,{"$f":"SW!G61","v":0},null,null,null,null,null,null,null,null,null,null,null,null,"","","","","","",null,null,null,null,null,null,null,null,null,null,null,null,"","","","","","","","","","","",""]
[null,53,null,null,{"$f":"SW!G62","v":0},null,null,null,null,null,null,null,null,null,null,null,null,"","","","","","",null,null,null,null,null,null,null,null,null,null,null,null,"","","","","","","","","","","",""]
[null,54,null,null,{"$f":"SW!G63","v":0},null,null,null,null,null,null,null,null,null,null,null,null,"","","","","","",null,null,null,null,null,null,null,null,null,null,null,null,"","","","","","","","","","","",""]
[null,55,null,null,{"$f":"SW!G64","v":0},null,null,null,null,null,null,null,null,null,null,null,null,"","","","","","",null,null,null,null,null,null,null,null,null,null,null,null,"","","","","","","","","","","",""]
[null,56,null,null,{"$f":"SW!G65","v":0},null,null,null,null,null,null,null,null,null,null,null,null,"","","","","","",null,null,null,null,null,null,null,null,null,null,null,null,"","","","","","","","","","","",""]
[null,57,null,null,{"$f":"SW!G66","v":0},null,null,null,null,null,null,null,null,null,null,null,null,"","","","","","",null,null,null,null,null,null,null,null,null,null,null,null,"","","","","","","","","","","",""]
[null,58,null,null,{"$f":"SW!G67","v":0},null,null,null,null,null,null,null,null,null,null,null,null,"","","","","","",null,null,null,null,null,null,null,null,null,null,null,null,"","","","","","","","","","","",""]
[null,59,null,null,{"$f":"SW!G68","v":0},null,null,null,null,null,null,null,null,null,null,null,null,"","","","","","",null,null,null,null,null,null,null,null,null,null,null,null,"","","","","","","","","",{"$f":"IFERROR(ROUND(AVERAGE(U70+AM70),0),\"\")","v":""},"",""]
[null,60,null,null,{"$f":"SW!G69","v":0},null,null,null,null,null,null,null,null,null,null,null,null,"","","","","","",null,null,null,null,null,null,null,null,null,null,null,null,"","","","","","",{"$f":"IFERROR(ROUND(AVERAGE(R71+AJ71),0),\"\")","v":""},"","","","",""]
[null,61,null,null,{"$f":"SW!G70","v":0},null,null,null,null,null,null,null,null,null,null,null,null,"","","","","","",null,null,null,null,null,null,null,null,null,null,null,null,"","","","","","","","","","","",""]
[null,62,null,null,{"$f":"SW!G71","v":0},null,null,null,null,null,null,null,null,null,null,null,null,"","","","","","",null,null,null,null,null,null,null,null,null,null,null,null,"","","","","","","","","","","",""]
[null,63,null,null,{"$f":"SW!G72","v":0},null,null,null,null,null,null,null,null,null,null,null,null,"","","","","","",null,null,null,null,null,null,null,null,null,null,null,null,"","","","","","","","","","","",""]
[null,64,null,null,{"$f":"SW!G73","v":0},null,null,null,null,null,null,null,null,null,null,null,null,"","","","","","",null,null,null,null,null,null,null,null,null,null,null,null,"","","","","","","","","","","",""]
[null,65,null,null,{"$f":"SW!G74","v":0},null,null,null,null,null,null,null,null,null,null,null,null,"","","","","","",null,null,null,null,null,null,null,null,null,null,null,null,"","","","","","","","","","","",""]
[null,66,null,null,{"$f":"SW!G75","v":0},null,null,null,null,null,null,null,null,null,null,null,null,{"$f":"IFERROR(ROUND(AVERAGE(F77:G77)*$R$9,0),\"\")","v":""},{"$f":"IFERROR(ROUND(AVERAGE(H77:I77)*$R$9,0),\"\")","v":""},{"$f":"IFERROR(ROUND(AVERAGE(J77:K77)*$R$9,0),\"\")","v":""},{"$f":"IFERROR(ROUND(AVERAGE(L77:M77)*$R$9,0),\"\")","v":""},{"$f":"IFERROR(ROUND(AVERAGE(N77:O77)*$R$9,0),\"\")","v":""},{"$f":"IFERROR(ROUND(AVERAGE(P77:Q77)*$R$9,0),\"\")","v":""},null,null,null,null,null,null,null,null,null,null,null,null,{"$f":"IFERROR(ROUND(AVERAGE(X77:Y77)*$AJ$9,0),\"\")","v":""},{"$f":"IFERROR(ROUND(AVERAGE(Z77:AA77)*$AJ$9,0),\"\")","v":""},{"$f":"IFERROR(ROUND(AVERAGE(AB77:AC77)*$AJ$9,0),\"\")","v":""},{"$f":"IFERROR(ROUND(AVERAGE(AD77:AE77)*$AJ$9,0),\"\")","v":""},{"$f":"IFERROR(ROUND(AVERAGE(AF77:AG77)*$AJ$9,0),\"\")","v":""},{"$f":"IFERROR(ROUND(AVERAGE(AH77:AI77)*$AJ$9,0),\"\")","v":""},"","","","","",""]
[null,67,null,null,{"$f":"SW!G76","v":0},null,null,null,null,null,null,null,null,null,null,null,null,"","","","","","",null,null,null,null,null,null,null,null,null,null,null,null,"","","","","","","","","","","",""]
[null,68,null,null,{"$f":"SW!G77","v":0},null,null,null,null,null,null,null,null,null,null,null,null,"","","","","","",null,null,null,null,null,null,null,null,null,null,null,null,"","","","","","","","","","","",""]
[null,69,null,null,{"$f":"SW!G78","v":0},null,null,null,null,null,null,null,null,null,null,null,null,"","","","","","",null,null,null,null,null,null,null,null,null,null,null,null,"","","","","","","","","","","",""]
[null,70,null,null,{"$f":"SW!G79","v":0},null,null,null,null,null,null,null,null,null,null,null,null,"","","","","","",null,null,null,null,null,null,null,null,null,null,null,null,"","","","","","","","","","","",""]
[null,71,null,null,{"$f":"SW!G80","v":0},null,null,null,null,null,null,null,null,null,null,null,null,"","","","","","",null,null,null,null,null,null,null,null,null,null,null,null,"","","","","","","","","","","",""]
[null,72,null,null,{"$f":"SW!G81","v":0},null,null,null,null,null,null,null,null,null,null,null,null,"","","","","","",null,null,null,null,null,null,null,null,null,null,null,null,"","","","","","","","","","","",""]
[null,73,null,null,{"$f":"SW!G82","v":0},null,null,null,null,null,null,null,null,null,null,null,null,"","","","","","",null,null,null,null,null,null,null,null,null,null,null,null,"","","","","","","","","","","",""]
[null,74,null,null,{"$f":"SW!G83","v":0},null,null,null,null,null,null,null,null,null,null,null,null,"","","","","","",null,null,null,null,null,null,null,null,null,null,null,null,"","","","","","","","","","","",""]
[null,75,null,null,{"$f":"SW!G84","v":0},null,null,null,null,null,null,null,null,null,null,null,null,"","","","","","",null,null,null,null,null,null,null,null,null,null,null,null,"","","","","","","","","","","",""]
[null,76,null,null,{"$f":"SW!G85","v":0},null,null,null,null,null,null,null,null,null,null,null,null,"","","","","","",null,null,null,null,null,null,null,null,null,null,null,null,"","","","","","","","","","","",""]
[null,77,null,null,{"$f":"SW!G86","v":0},null,null,null,null,null,null,null,null,null,null,null,null,"","","","","","",null,null,null,null,null,null,null,null,null,null,null,null,"","","","","","","","","","","",""]
[null,78,null,null,{"$f":"SW!G87","v":0},null,null,null,null,null,null,null,null,null,null,null,null,"","","","","","",null,null,null,null,null,null,null,null,null,null,null,null,"","","","","","","","","","","",""]
[null,79,null,null,{"$f":"SW!G88","v":0},null,null,null,null,null,null,null,null,null,null,null,null,"","","","","","",null,null,null,null,null,null,null,null,null,null,null,null,"","","","","","","","","","","",""]
[null,80,null,null,{"$f":"SW!G89","v":0},null,null,null,null,null,null,null,null,null,null,null,null,"","","","","","",null,null,null,null,null,null,null,null,null,null,null,null,"","","","","","","","","","","",""]
[null,81,null,null,{"$f":"SW!G90","v":0},null,null,null,null,null,null,null,null,null,null,null,null,"","","","","","",null,null,null,null,null,null,null,null,null,null,null,null,"","","","","","","","","","","",""]
[null,82,null,null,{"$f":"SW!G91","v":0},null,null,null,null,null,null,null,null,null,null,null,null,"","","","","","",null,null,null,null,null,null,null,null,null,null,null,null,"","","","","","","","","","","",""]
[null,83,null,null,{"$f":"SW!G92","v":0},null,null,null,null,null,null,null,null,null,null,null,null,"","","","","","",null,null,null,null,null,null,null,null,null,null,null,null,"","","","","","","","","","","",""]
[null,84,null,null,{"$f":"SW!G93","v":0},null,null,null,null,null,null,null,null,null,null,null,null,"","","","","","",null,null,null,null,null,null,null,null,null,null,null,null,"","","","","","","","","","","",""]
[null,85,null,null,{"$f":"SW!G94","v":0},null,null,null,null,null,null,null,null,null,null,null,null,"","","","","","",null,null,null,null,null,null,null,null,null,null,null,null,"","","","","","","","","","","",""]
[null,86,null,null,{"$f":"SW!G95","v":0},null,null,null,null,null,null,null,null,null,null,null,null,"","","","","","",null,null,null,null,null,null,null,null,null,null,null,null,"","","","","","","","","","","",""]
[null,87,null,null,{"$f":"SW!G96","v":0},null,null,null,null,null,null,null,null,null,null,null,null,"","","","","","",null,null,null,null,null,null,null,null,null,null,null,null,"","","","","","","","","","","",""]
[null,88,null,null,{"$f":"SW!G97","v":0},null,null,null,null,null,null,null,null,null,null,null,null,"","","","","","",null,null,null,null,null,null,null,null,null,null,null,null,"","","","","","","","","","","",""]
[null,89,null,null,{"$f":"SW!G98","v":0},null,null,null,null,null,null,null,null,null,null,null,null,"","","","","","",null,null,null,null,null,null,null,null,null,null,null,null,"","","","","","","","","","","",""]

{"sheet":"T3","index":2,"n_rows":100,"n_cols":47,"rows_kept":100,"cut":false,"hidden":false,"merged":[[8,35,9,40],[8,41,9,46],[9,5,9,6],[9,7,9,8],[9,9,9,10],[9,11,9,12],[9,13,9,14],[9,31,9,32],[9,33,9,34],[9,15,9,16],[9,23,9,24],[9,25,9,26],[9,27,9,28],[9,29,9,30],[8,1,10,1],[8,4,10,4],[8,5,8,16],[8,17,9,22],[8,23,8,34],[1,1,1,46],[3,6,3,18],[3,42,5,45],[4,6,4,18],[5,6,5,18],[4,20,5,21],[4,23,5,24],[4,26,5,27],[4,29,5,30],[4,32,5,33],[4,35,5,36],[4,38,5,40]]}
[]
[null,"D A F T A R   N I L A I"]
[]
[null,"MATA PELAJARAN",null,null,null,":",{"$f":"RTM!AD5","v":"TEMA 3"},null,null,null,null,null,null,null,null,null,null,null,null,null,null,null,null,null,null,null,null,null,null,null,null,null,null,null,null,null,null,null,null,null,null,null,"۩MENU↗"]
[null,"KELAS",null,null,null,":",{"$f":"UPPER(MN!D22)","v":"V B"},null,null,null,null,null,null,null,null,null,null,null,null,null,"TEMA 1",null,null,"TEMA 2",null,null,"TEMA 3",null,null,"TEMA 4",null,null,"TEMA 5",null,null,"TEMA 6",null,null,"REKAP"]
[null,"TAHUN PELAJARAN",null,null,null,":",{"$f":"MN!D18","v":"2019 - 2020"}]
[]
[]
[null,"No",null,null,"Nama Siswa","NILAI PG",null,null,null,null,null,null,null,null,null,null,null,0.5,null,null,null,null,null,"NILAI ESSAY",null,null,null,null,null,null,null,null,null,null,null,{"$f":"100%-R9","v":0.5},null,null,null,null,null,"JUMLAH"]
[null,null,"No. Induk","NISN",null,"BIN",null,"MTK",null,"IPA",null,"PPKn",null,"IPS",null,"SBDP",null,null,null,null,null,null,null,"BIN",null,"MTK",null,"IPA",null,"PPKn",null,"IPS",null,"SBDP"]
[null,null,null,null,null,"Naskah 1","Naskah 2","Naskah 1","Naskah 2","Naskah 1","Naskah 2","Naskah 1","Naskah 2","Naskah 1","Naskah 2","Naskah 1","Naskah 2","BIN","MTK","IPA","PPKn","IPS","SBDP","Naskah 1","Naskah 2","Naskah 1","Naskah 2","Naskah 1","Naskah 2","Naskah 1","Naskah 2","Naskah 1","Naskah 2","Naskah 1","Naskah 2","BIN","MTK","IPA","PPKn","IPS","SBDP","BIN","MTK","IPA","PPKn","IPS","SBDP"]
[null,1,null,null,{"$f":"SW!G10","v":"ABD. ROCHMAN NAJA FATLAN PRATAMA"},17,30,null,null,17,30,17,30,17,30,17,30,{"$f":"IFERROR(ROUND(AVERAGE(F12:G12)*$R$9,0),\"\")","v":12},{"$f":"IFERROR(ROUND(AVERAGE(H12:I12)*$R$9,0),\"\")","v":""},{"$f":"IFERROR(ROUND(AVERAGE(J12:K12)*$R$9,0),\"\")","v":12},{"$f":"IFERROR(ROUND(AVERAGE(L12:M12)*$R$9,0),\"\")","v":12},{"$f":"IFERROR(ROUND(AVERAGE(N12:O12)*$R$9,0),\"\")","v":12},{"$f":"IFERROR(ROUND(AVERAGE(P12:Q12)*$R$9,0),\"\")","v":12},37,30,null,null,37,30,37,30,37,30,37,30,{"$f":"IFERROR(ROUND(AVERAGE(X12:Y12)*$AJ$9,0),\"\")","v":17},{"$f":"IFERROR(ROUND(AVERAGE(Z12:AA12)*$AJ$9,0),\"\")","v":""},{"$f":"IFERROR(ROUND(AVERAGE(AB12:AC12)*$AJ$9,0),\"\")","v":17},{"$f":"IFERROR(ROUND(AVERAGE(AD12:AE12)*$AJ$9,0),\"\")","v":17},{"$f":"IFERROR(ROUND(AVERAGE(AF12:AG12)*$AJ$9,0),\"\")","v":17},{"$f":"IFERROR(ROUND(AVERAGE(AH12:AI12)*$AJ$9,0),\"\")","v":17},{"$f":"IFERROR(ROUND(AVERAGE(R12+AJ12),0),\"\")","v":29},"",29,29,29,29]
[null,2,null,null,{"$f":"SW!G11","v":"ABDURRAHMAN FAQIH"},33,25,null,null,33,25,33,25,33,25,33,25,{"$f":"IFERROR(ROUND(AVERAGE(F13:G13)*$R$9,0),\"\")","v":15},{"$f":"IFERROR(ROUND(AVERAGE(H13:I13)*$R$9,0),\"\")","v":""},{"$f":"IFERROR(ROUND(AVERAGE(J13:K13)*$R$9,0),\"\")","v":15},{"$f":"IFERROR(ROUND(AVERAGE(L13:M13)*$R$9,0),\"\")","v":15},{"$f":"IFERROR(ROUND(AVERAGE(N13:O13)*$R$9,0),\"\")","v":15},{"$f":"IFERROR(ROUND(AVERAGE(P13:Q13)*$R$9,0),\"\")","v":15},56,20,null,null,56,20,56,20,56,20,56,20,{"$f":"IFERROR(ROUND(AVERAGE(X13:Y13)*$AJ$9,0),\"\")","v":19},"",{"$f":"IFERROR(ROUND(AVERAGE(AB13:AC13)*$AJ$9,0),\"\")","v":19},{"$f":"IFERROR(ROUND(AVERAGE(AD13:AE13)*$AJ$9,0),\"\")","v":19},{"$f":"IFERROR(ROUND(AVERAGE(AF13:AG13)*$AJ$9,0),\"\")","v":19},{"$f":"IFERROR(ROUND(AVERAGE(AH13:AI13)*$AJ$9,0),\"\")","v":19},34,"",34,34,34,34]
[null,3,null,null,{"$f":"SW!G12","v":"ACHMAD FARROIHUN MUSHOBIRONILLAH"},40,40,null,null,40,40,40,40,40,40,40,40,20,"",20,20,20,20,48,30,null,null,48,30,48,30,48,30,48,30,20,"",20,20,20,20,40,"",40,40,40,40]
[null,4,null,null,{"$f":"SW!G13","v":"ACHMAD HASBI ASSIDDIQI"},37,35,null,null,37,35,37,35,37,35,37,35,18,"",18,18,18,18,25,20,null,null,25,20,25,20,25,20,25,20,11,"",11,11,11,11,29,"",29,29,29,29]
[null,5,null,null,{"$f":"SW!G14","v":"ACHMAD REZA AKRAM ALAUDDIN"},73,70,null,null,73,70,73,70,73,70,73,70,36,"",36,36,36,36,59,40,null,null,59,40,59,40,59,40,59,40,25,"",25,25,25,25,61,"",61,61,61,61]
[null,6,null,null,{"$f":"SW!G15","v":"ACHMAD YANI"},60,40,null,null,60,40,60,40,60,40,60,40,25,"",25,25,25,25,70,30,null,null,70,30,70,30,70,30,70,30,25,"",25,25,25,25,50,"",50,50,50,50]
[null,7,null,null,{"$f":"SW!G16","v":"AKHMAD RIDWAN"},50,55,null,null,50,55,50,55,50,55,50,55,26,"",26,26,26,26,48,60,null,null,48,60,48,60,48,60,48,60,27,"",27,27,27,27,53,"",53,53,53,53]
[null,8,null,null,{"$f":"SW!G17","v":"ANDREAN DWI YULIANO"},33,30,null,null,33,30,33,30,33,30,33,30,16,"",16,16,16,16,30,60,null,null,30,60,30,60,30,60,30,60,23,"",23,23,23,23,39,"",39,39,39,39]
[null,9,null,null,{"$f":"SW!G18","v":"ASFAN FAKHRI BARANI"},53,55,null,null,53,55,53,55,53,55,53,55,27,"",27,27,27,27,56,30,null,null,56,30,56,30,56,30,56,30,22,"",22,22,22,22,49,"",49,49,49,49]
[null,10,null,null,{"$f":"SW!G19","v":"DEVAN ADITYA SAPUTRA"},53,35,null,null,53,35,53,35,53,35,53,35,22,"",22,22,22,22,60,78,null,null,60,78,60,78,60,78,60,78,35,"",35,35,35,35,57,"",57,57,57,57]
[null,11,null,null,{"$f":"SW!G20","v":"FAHRUL AHMAD FAHREZA"},53,50,null,null,53,50,53,50,53,50,53,50,26,"",26,26,26,26,84,20,null,null,84,20,84,20,84,20,84,20,26,"",26,26,26,26,52,"",52,52,52,52]
[null,12,null,null,{"$f":"SW!G21","v":"FAUZIA AMELIA PUTRI"},47,45,null,null,47,45,47,45,47,45,47,45,23,"",23,23,23,23,60,40,null,null,60,40,60,40,60,40,60,40,25,"",25,25,25,25,48,"",48,48,48,48]
[null,13,null,null,{"$f":"SW!G22","v":"FAZA AZIFAH SALSABILA"},47,40,null,null,47,40,47,40,47,40,47,40,22,"",22,22,22,22,48,40,null,null,48,40,48,40,48,40,48,40,22,"",22,22,22,22,44,"",44,44,{"$f":"IFERROR(ROUND(AVERAGE(V24+AN24),0),\"\")","v":44},44]
[null,14,null,null,{"$f":"SW!G23","v":"HABIBIE NURUSSALAM"},53,65,null,null,53,65,53,65,53,65,53,65,30,"",30,30,30,30,59,30,null,null,59,30,59,30,59,30,59,30,22,"",22,22,22,22,52,"",52,52,52,52]
[null,15,null,null,{"$f":"SW!G24","v":"HIMATURROSYIDAH"},53,55,null,null,53,55,53,55,53,55,53,55,27,"",27,27,27,27,56,40,null,null,56,40,56,40,56,40,56,40,24,"",24,24,24,24,51,"",51,51,51,51]
[null,16,null,null,{"$f":"SW!G25","v":"IFKARINA NAILA SAUQYA"},53,65,null,null,53,65,53,65,53,65,53,65,30,"",30,30,30,30,78,40,null,null,78,40,78,40,78,40,78,40,30,"",30,30,30,30,60,"",60,60,60,60]
[null,17,null,null,{"$f":"SW!G26","v":"KEISA AYU SASKIYAH"},33,30,null,null,33,30,33,30,33,30,33,30,16,"",16,16,16,16,48,40,null,null,48,40,48,40,48,40,48,40,22,"",22,22,22,22,{"$f":"IFERROR(ROUND(AVERAGE(R28+AJ28),0),\"\")","v":38},"",38,38,38,38]
[null,18,null,null,{"$f":"SW!G27","v":"MOCHAMMAD RENO FIRMANSYAH"},27,30,null,null,27,30,27,30,27,30,27,30,14,"",14,14,14,14,30,40,null,null,30,40,30,40,30,40,30,40,18,"",18,18,18,18,32,"",32,32,32,32]
[null,19,null,null,{"$f":"SW!G28","v":"MOHAMAD NUR KHAFID KHABIBULLOH"},57,65,null,null,57,65,57,65,57,65,57,65,31,"",31,31,31,31,51,40,null,null,51,40,51,40,51,40,51,40,23,"",23,23,23,23,54,"",54,54,54,54]
[null,20,null,null,{"$f":"SW!G29","v":"MOHAMMAD NAUFAL NAWWARUDDIN"},33,40,null,null,33,40,33,40,33,40,33,40,18,"",18,18,18,18,30,40,null,null,30,40,30,40,30,40,30,40,18,"",18,18,18,18,36,"",36,36,36,36]
[null,21,null,null,{"$f":"SW!G30","v":"MUCHAMAD PRIMA PAMBUDI"},30,15,null,null,30,15,30,15,30,15,30,15,11,"",11,11,11,11,40,70,null,null,40,70,40,70,40,70,40,70,28,"",28,28,28,28,39,"",39,39,39,39]
[null,22,null,null,{"$f":"SW!G31","v":"MUHAMMAD ALFAN FATHONI"},30,30,null,null,30,30,30,30,30,30,30,30,15,"",15,15,15,15,45,55,null,null,45,55,45,55,45,55,45,55,25,"",25,25,25,25,40,"",40,40,40,40]
[null,23,null,null,{"$f":"SW!G32","v":"MUHAMMAD AMINULLAH MAULUDANI"},30,35,null,null,30,35,30,35,30,35,30,35,16,"",16,16,16,16,40,20,null,null,40,20,40,20,40,20,40,20,15,"",15,15,15,15,31,"",31,31,31,31]
[null,24,null,null,{"$f":"SW!G33","v":"MUHAMMAD DAVIN  LEVANTINO"},50,35,null,null,50,35,50,35,50,35,50,35,21,"",21,21,21,21,70,60,null,null,70,60,70,60,70,60,70,60,33,"",33,33,33,33,54,"",54,54,54,54]
[null,25,null,null,{"$f":"SW!G34","v":"MUHAMMAD MAULANA PAHLEVY"},30,15,null,null,30,15,30,15,30,15,30,15,11,"",11,11,11,11,54,60,null,null,54,60,54,60,54,60,54,60,29,"",29,29,29,29,40,"",40,40,40,40]
[null,26,null,null,{"$f":"SW!G35","v":"RADITYA NIRWANSYAH"},23,30,null,null,23,30,23,30,23,30,23,30,13,"",13,13,13,13,60,20,null,null,60,20,60,20,60,20,60,20,20,"",20,20,20,20,33,"",33,33,33,33]
[null,27,null,null,{"$f":"SW!G36","v":"REVINA SRI UTARI"},17,40,null,null,17,40,17,40,17,40,17,40,14,"",14,14,14,14,70,40,null,null,70,40,70,40,70,40,70,40,28,"",28,28,28,28,42,"",42,42,42,42]
[null,28,null,null,{"$f":"SW!G37","v":"REYHAN DWI ANDIKA"},20,10,null,null,20,10,20,10,20,10,20,10,8,"",8,8,8,8,37,30,null,null,37,30,37,30,37,30,37,30,17,"",17,17,17,17,25,"",25,25,25,25]
[null,29,null,null,{"$f":"SW!G38","v":"RISKA LAURA TRIA OCTAVIA"},null,null,null,null,null,null,null,null,null,null,null,null,"","","","","","",84,70,null,null,84,70,84,70,84,70,84,70,39,"",39,39,39,39,"","","","","",""]
[null,30,null,null,{"$f":"SW!G39","v":"ROHMADONA DWI SAFITRI"},50,50,null,null,50,50,50,50,50,50,50,50,25,"",25,25,25,25,70,40,null,null,70,40,70,40,70,40,70,40,28,"",28,28,28,28,53,"",53,53,53,53]
[null,31,null,null,{"$f":"SW!G40","v":"SALMAN ALFARIZI"},30,25,null,null,30,25,30,25,30,25,30,25,14,"",14,14,14,14,59,30,null,null,59,30,59,30,59,30,59,30,22,"",22,22,22,22,36,"",36,36,36,36]
[null,32,null,null,{"$f":"SW!G41","v":"TAUFIQ KURROHMAN"},43,35,null,null,43,35,43,35,43,35,43,35,20,"",20,20,20,20,62,20,null,null,62,20,62,20,62,20,62,20,21,"",21,21,21,21,41,"",41,41,41,41]
[null,33,null,null,{"$f":"SW!G42","v":0},null,null,null,null,null,null,null,null,null,null,null,null,"","","","","","",null,null,null,null,null,null,null,null,null,null,null,null,"","","","","","","","","","","",""]
[null,34,null,null,{"$f":"SW!G43","v":0},null,null,null,null,null,null,null,null,null,null,null,null,"","","","","","",null,null,null,null,null,null,null,null,null,null,null,null,"","","","","","","","","","","",""]
[null,35,null,null,{"$f":"SW!G44","v":0},null,null,null,null,null,null,null,null,null,null,null,null,"","","","","","",null,null,null,null,null,null,null,null,null,null,null,null,"","","","","","","","","","","",""]
[null,36,null,null,{"$f":"SW!G45","v":0},null,null,null,null,null,null,null,null,null,null,null,null,"","","","","","",null,null,null,null,null,null,null,null,null,null,null,null,"","","","","","","","","","","",""]
[null,37,null,null,{"$f":"SW!G46","v":0},null,null,null,null,null,null,null,null,null,null,null,null,"","","","","","",null,null,null,null,null,null,null,null,null,null,null,null,"","","","","","","","","","","",""]
[null,38,null,null,{"$f":"SW!G47","v":0},null,null,null,null,null,null,null,null,null,null,null,null,"","","","","","",null,null,null,null,null,null,null,null,null,null,null,null,"","","","","","","","","","","",""]
[null,39,null,null,{"$f":"SW!G48","v":0},null,null,null,null,null,null,null,null,null,null,null,null,"","","","","","",null,null,null,null,null,null,null,null,null,null,null,null,"","","","","","","","","","","",""]
[null,40,null,null,{"$f":"SW!G49","v":0},null,null,null,null,null,null,null,null,null,null,null,null,"","","","","","",null,null,null,null,null,null,null,null,null,null,null,null,"","","","","","","","","","","",""]
[null,41,null,null,{"$f":"SW!G50","v":0},null,null,null,null,null,null,null,null,null,null,null,null,"","","","","","",null,null,null,null,null,null,null,null,null,null,null,null,"","","","","","","","","","","",""]
[null,42,null,null,{"$f":"SW!G51","v":0},null,null,null,null,null,null,null,null,null,null,null,null,"","","","","","",null,null,null,null,null,null,null,null,null,null,null,null,"","","","","","","","","","","",""]
[null,43,null,null,{"$f":"SW!G52","v":0},null,null,null,null,null,null,null,null,null,null,null,null,"","","","","","",null,null,null,null,null,null,null,null,null,null,null,null,"","","","","","","","","","","",""]
[null,44,null,null,{"$f":"SW!G53","v":0},null,null,null,null,null,null,null,null,null,null,null,null,"","","","","","",null,null,null,null,null,null,null,null,null,null,null,null,"","","","","","","","","","","",""]
[null,45,null,null,{"$f":"SW!G54","v":0},null,null,null,null,null,null,null,null,null,null,null,null,"","","","","","",null,null,null,null,null,null,null,null,null,null,null,null,"","","","","","","","","","","",""]
[null,46,null,null,{"$f":"SW!G55","v":0},null,null,null,null,null,null,null,null,null,null,null,null,"","","","","","",null,null,null,null,null,null,null,null,null,null,null,null,"","","","","","","","","","","",""]
[null,47,null,null,{"$f":"SW!G56","v":0},null,null,null,null,null,null,null,null,null,null,null,null,"","","","","","",null,null,null,null,null,null,null,null,null,null,null,null,"","","","","","","","","","","",""]
[null,48,null,null,{"$f":"SW!G57","v":0},null,null,null,null,null,null,null,null,null,null,null,null,"","","","","","",null,null,null,null,null,null,null,null,null,null,null,null,"","","","","","","","","","","",""]
[null,49,null,null,{"$f":"SW!G58","v":0},null,null,null,null,null,null,null,null,null,null,null,null,"","","","","","",null,null,null,null,null,null,null,null,null,null,null,null,"","","","","","","","","","","",""]
[null,50,null,null,{"$f":"SW!G59","v":0},null,null,null,null,null,null,null,null,null,null,null,null,"","","","","","",null,null,null,null,null,null,null,null,null,null,null,null,"","","","","","","","","","","",""]
[null,51,null,null,{"$f":"SW!G60","v":0},null,null,null,null,null,null,null,null,null,null,null,null,"","","","","","",null,null,null,null,null,null,null,null,null,null,null,null,"","","","","","","","","","","",""]
[null,52,null,null,{"$f":"SW!G61","v":0},null,null,null,null,null,null,null,null,null,null,null,null,"","","","","","",null,null,null,null,null,null,null,null,null,null,null,null,"","","","","","","","","","","",""]
[null,53,null,null,{"$f":"SW!G62","v":0},null,null,null,null,null,null,null,null,null,null,null,null,"","","","","","",null,null,null,null,null,null,null,null,null,null,null,null,"","","","","","","","","","","",""]
[null,54,null,null,{"$f":"SW!G63","v":0},null,null,null,null,null,null,null,null,null,null,null,null,"","","","","","",null,null,null,null,null,null,null,null,null,null,null,null,"","","","","","","","","","","",""]
[null,55,null,null,{"$f":"SW!G64","v":0},null,null,null,null,null,null,null,null,null,null,null,null,"","","","","","",null,null,null,null,null,null,null,null,null,null,null,null,"","","","","","","","","","","",""]
[null,56,null,null,{"$f":"SW!G65","v":0},null,null,null,null,null,null,null,null,null,null,null,null,"","","","","","",null,null,null,null,null,null,null,null,null,null,null,null,"","","","","","","","","","","",""]
[null,57,null,null,{"$f":"SW!G66","v":0},null,null,null,null,null,null,null,null,null,null,null,null,"","","","","","",null,null,null,null,null,null,null,null,null,null,null,null,"","","","","","","","","","","",""]
[null,58,null,null,{"$f":"SW!G67","v":0},null,null,null,null,null,null,null,null,null,null,null,null,"","","","","","",null,null,null,null,null,null,null,null,null,null,null,null,"","","","","","","","","","","",""]
[null,59,null,null,{"$f":"SW!G68","v":0},null,null,null,null,null,null,null,null,null,null,null,null,"","","","","","",null,null,null,null,null,null,null,null,null,null,null,null,"","","","","","","","","",{"$f":"IFERROR(ROUND(AVERAGE(U70+AM70),0),\"\")","v":""},"",""]
[null,60,null,null,{"$f":"SW!G69","v":0},null,null,null,null,null,null,null,null,null,null,null,null,"","","","","","",null,null,null,null,null,null,null,null,null,null,null,null,"","","","","","",{"$f":"IFERROR(ROUND(AVERAGE(R71+AJ71),0),\"\")","v":""},"","","","",""]
[null,61,null,null,{"$f":"SW!G70","v":0},null,null,null,null,null,null,null,null,null,null,null,null,"","","","","","",null,null,null,null,null,null,null,null,null,null,null,null,"","","","","","","","","","","",""]
[null,62,null,null,{"$f":"SW!G71","v":0},null,null,null,null,null,null,null,null,null,null,null,null,"","","","","","",null,null,null,null,null,null,null,null,null,null,null,null,"","","","","","","","","","","",""]
[null,63,null,null,{"$f":"SW!G72","v":0},null,null,null,null,null,null,null,null,null,null,null,null,"","","","","","",null,null,null,null,null,null,null,null,null,null,null,null,"","","","","","","","","","","",""]
[null,64,null,null,{"$f":"SW!G73","v":0},null,null,null,null,null,null,null,null,null,null,null,null,"","","","","","",null,null,null,null,null,null,null,null,null,null,null,null,"","","","","","","","","","","",""]
[null,65,null,null,{"$f":"SW!G74","v":0},null,null,null,null,null,null,null,null,null,null,null,null,"","","","","","",null,null,null,null,null,null,null,null,null,null,null,null,"","","","","","","","","","","",""]
[null,66,null,null,{"$f":"SW!G75","v":0},null,null,null,null,null,null,null,null,null,null,null,null,{"$f":"IFERROR(ROUND(AVERAGE(F77:G77)*$R$9,0),\"\")","v":""},{"$f":"IFERROR(ROUND(AVERAGE(H77:I77)*$R$9,0),\"\")","v":""},{"$f":"IFERROR(ROUND(AVERAGE(J77:K77)*$R$9,0),\"\")","v":""},{"$f":"IFERROR(ROUND(AVERAGE(L77:M77)*$R$9,0),\"\")","v":""},{"$f":"IFERROR(ROUND(AVERAGE(N77:O77)*$R$9,0),\"\")","v":""},{"$f":"IFERROR(ROUND(AVERAGE(P77:Q77)*$R$9,0),\"\")","v":""},null,null,null,null,null,null,null,null,null,null,null,null,{"$f":"IFERROR(ROUND(AVERAGE(X77:Y77)*$AJ$9,0),\"\")","v":""},{"$f":"IFERROR(ROUND(AVERAGE(Z77:AA77)*$AJ$9,0),\"\")","v":""},{"$f":"IFERROR(ROUND(AVERAGE(AB77:AC77)*$AJ$9,0),\"\")","v":""},{"$f":"IFERROR(ROUND(AVERAGE(AD77:AE77)*$AJ$9,0),\"\")","v":""},{"$f":"IFERROR(ROUND(AVERAGE(AF77:AG77)*$AJ$9,0),\"\")","v":""},{"$f":"IFERROR(ROUND(AVERAGE(AH77:AI77)*$AJ$9,0),\"\")","v":""},"","","","","",""]
[null,67,null,null,{"$f":"SW!G76","v":0},null,null,null,null,null,null,null,null,null,null,null,null,"","","","","","",null,null,null,null,null,null,null,null,null,null,null,null,"","","","","","","","","","","",""]
[null,68,null,null,{"$f":"SW!G77","v":0},null,null,null,null,null,null,null,null,null,null,null,null,"","","","","","",null,null,null,null,null,null,null,null,null,null,null,null,"","","","","","","","","","","",""]
[null,69,null,null,{"$f":"SW!G78","v":0},null,null,null,null,null,null,null,null,null,null,null,null,"","","","","","",null,null,null,null,null,null,null,null,null,null,null,null,"","","","","","","","","","","",""]
[null,70,null,null,{"$f":"SW!G79","v":0},null,null,null,null,null,null,null,null,null,null,null,null,"","","","","","",null,null,null,null,null,null,null,null,null,null,null,null,"","","","","","","","","","","",""]
[null,71,null,null,{"$f":"SW!G80","v":0},null,null,null,null,null,null,null,null,null,null,null,null,"","","","","","",null,null,null,null,null,null,null,null,null,null,null,null,"","","","","","","","","","","",""]
[null,72,null,null,{"$f":"SW!G81","v":0},null,null,null,null,null,null,null,null,null,null,null,null,"","","","","","",null,null,null,null,null,null,null,null,null,null,null,null,"","","","","","","","","","","",""]
[null,73,null,null,{"$f":"SW!G82","v":0},null,null,null,null,null,null,null,null,null,null,null,null,"","","","","","",null,null,null,null,null,null,null,null,null,null,null,null,"","","","","","","","","","","",""]
[null,74,null,null,{"$f":"SW!G83","v":0},null,null,null,null,null,null,null,null,null,null,null,null,"","","","","","",null,null,null,null,null,null,null,null,null,null,null,null,"","","","","","","","","","","",""]
[null,75,null,null,{"$f":"SW!G84","v":0},null,null,null,null,null,null,null,null,null,null,null,null,"","","","","","",null,null,null,null,null,null,null,null,null,null,null,null,"","","","","","","","","","","",""]
[null,76,null,null,{"$f":"SW!G85","v":0},null,null,null,null,null,null,null,null,null,null,null,null,"","","","","","",null,null,null,null,null,null,null,null,null,null,null,null,"","","","","","","","","","","",""]
[null,77,null,null,{"$f":"SW!G86","v":0},null,null,null,null,null,null,null,null,null,null,null,null,"","","","","","",null,null,null,null,null,null,null,null,null,null,null,null,"","","","","","","","","","","",""]
[null,78,null,null,{"$f":"SW!G87","v":0},null,null,null,null,null,null,null,null,null,null,null,null,"","","","","","",null,null,null,null,null,null,null,null,null,null,null,null,"","","","","","","","","","","",""]
[null,79,null,null,{"$f":"SW!G88","v":0},null,null,null,null,null,null,null,null,null,null,null,null,"","","","","","",null,null,null,null,null,null,null,null,null,null,null,null,"","","","","","","","","","","",""]
[null,80,null,null,{"$f":"SW!G89","v":0},null,null,null,null,null,null,null,null,null,null,null,null,"","","","","","",null,null,null,null,null,null,null,null,null,null,null,null,"","","","","","","","","","","",""]
[null,81,null,null,{"$f":"SW!G90","v":0},null,null,null,null,null,null,null,null,null,null,null,null,"","","","","","",null,null,null,null,null,null,null,null,null,null,null,null,"","","","","","","","","","","",""]
[null,82,null,null,{"$f":"SW!G91","v":0},null,null,null,null,null,null,null,null,null,null,null,null,"","","","","","",null,null,null,null,null,null,null,null,null,null,null,null,"","","","","","","","","","","",""]
[null,83,null,null,{"$f":"SW!G92","v":0},null,null,null,null,null,null,null,null,null,null,null,null,"","","","","","",null,null,null,null,null,null,null,null,null,null,null,null,"","","","","","","","","","","",""]
[null,84,null,null,{"$f":"SW!G93","v":0},null,null,null,null,null,null,null,null,null,null,null,null,"","","","","","",null,null,null,null,null,null,null,null,null,null,null,null,"","","","","","","","","","","",""]
[null,85,null,null,{"$f":"SW!G94","v":0},null,null,null,null,null,null,null,null,null,null,null,null,"","","","","","",null,null,null,null,null,null,null,null,null,null,null,null,"","","","","","","","","","","",""]
[null,86,null,null,{"$f":"SW!G95","v":0},null,null,null,null,null,null,null,null,null,null,null,null,"","","","","","",null,null,null,null,null,null,null,null,null,null,null,null,"","","","","","","","","","","",""]
[null,87,null,null,{"$f":"SW!G96","v":0},null,null,null,null,null,null,null,null,null,null,null,null,"","","","","","",null,null,null,null,null,null,null,null,null,null,null,null,"","","","","","","","","","","",""]
[null,88,null,null,{"$f":"SW!G97","v":0},null,null,null,null,null,null,null,null,null,null,null,null,"","","","","","",null,null,null,null,null,null,null,null,null,null,null,null,"","","","","","","","","","","",""]
[null,89,null,null,{"$f":"SW!G98","v":0},null,null,null,null,null,null,null,null,null,null,null,null,"","","","","","",null,null,null,null,null,null,null,null,null,null,null,null,"","","","","","","","","","","",""]

{"sheet":"T4","index":3,"n_rows":100,"n_cols":47,"rows_kept":100,"cut":false,"hidden":false,"merged":[[8,35,9,40],[8,41,9,46],[9,5,9,6],[9,7,9,8],[9,9,9,10],[9,11,9,12],[9,13,9,14],[9,31,9,32],[9,33,9,34],[9,15,9,16],[9,23,9,24],[9,25,9,26],[9,27,9,28],[9,29,9,30],[8,1,10,1],[8,4,10,4],[8,5,8,16],[8,17,9,22],[8,23,8,34],[1,1,1,46],[3,6,3,18],[3,42,5,45],[4,6,4,18],[5,6,5,18],[4,20,5,21],[4,23,5,24],[4,26,5,27],[4,29,5,30],[4,32,5,33],[4,35,5,36],[4,38,5,40]]}
[]
[null,"D A F T A R   N I L A I"]
[]
[null,"MATA PELAJARAN",null,null,null,":",{"$f":"RTM!AG5","v":"TEMA 4"},null,null,null,null,null,null,null,null,null,null,null,null,null,null,null,null,null,null,null,null,null,null,null,null,null,null,null,null,null,null,null,null,null,null,null,"۩MENU↗"]
[null,"KELAS",null,null,null,":",{"$f":"UPPER(MN!D22)","v":"V B"},null,null,null,null,null,null,null,null,null,null,null,null,null,"TEMA 1",null,null,"TEMA 2",null,null,"TEMA 3",null,null,"TEMA 4",null,null,"TEMA 5",null,null,"TEMA 6",null,null,"REKAP"]
[null,"TAHUN PELAJARAN",null,null,null,":",{"$f":"MN!D18","v":"2019 - 2020"}]
[]
[]
[null,"No",null,null,"Nama Siswa","NILAI PG",null,null,null,null,null,null,null,null,null,null,null,0.6,null,null,null,null,null,"NILAI ESSAY",null,null,null,null,null,null,null,null,null,null,null,{"$f":"100%-R9","v":0.4},null,null,null,null,null,"JUMLAH"]
[null,null,"No. Induk","NISN",null,"BIN",null,"MTK",null,"IPA",null,"PPKn",null,"IPS",null,"SBDP",null,null,null,null,null,null,null,"BIN",null,"MTK",null,"IPA",null,"PPKn",null,"IPS",null,"SBDP"]
[null,null,null,null,null,"Naskah 1","Naskah 2","Naskah 1","Naskah 2","Naskah 1","Naskah 2","Naskah 1","Naskah 2","Naskah 1","Naskah 2","Naskah 1","Naskah 2","BIN","MTK","IPA","PPKn","IPS","SBDP","Naskah 1","Naskah 2","Naskah 1","Naskah 2","Naskah 1","Naskah 2","Naskah 1","Naskah 2","Naskah 1","Naskah 2","Naskah 1","Naskah 2","BIN","MTK","IPA","PPKn","IPS","SBDP","BIN","MTK","IPA","PPKn","IPS","SBDP"]
[null,1,null,null,{"$f":"SW!G10","v":"ABD. ROCHMAN NAJA FATLAN PRATAMA"},null,null,null,null,null,null,null,null,null,null,null,null,{"$f":"IFERROR(ROUND(AVERAGE(F12:G12)*$R$9,0),\"\")","v":""},{"$f":"IFERROR(ROUND(AVERAGE(H12:I12)*$R$9,0),\"\")","v":""},{"$f":"IFERROR(ROUND(AVERAGE(J12:K12)*$R$9,0),\"\")","v":""},{"$f":"IFERROR(ROUND(AVERAGE(L12:M12)*$R$9,0),\"\")","v":""},{"$f":"IFERROR(ROUND(AVERAGE(N12:O12)*$R$9,0),\"\")","v":""},{"$f":"IFERROR(ROUND(AVERAGE(P12:Q12)*$R$9,0),\"\")","v":""},null,null,null,null,null,null,null,null,null,null,null,null,{"$f":"IFERROR(ROUND(AVERAGE(X12:Y12)*$AJ$9,0),\"\")","v":""},{"$f":"IFERROR(ROUND(AVERAGE(Z12:AA12)*$AJ$9,0),\"\")","v":""},{"$f":"IFERROR(ROUND(AVERAGE(AB12:AC12)*$AJ$9,0),\"\")","v":""},{"$f":"IFERROR(ROUND(AVERAGE(AD12:AE12)*$AJ$9,0),\"\")","v":""},{"$f":"IFERROR(ROUND(AVERAGE(AF12:AG12)*$AJ$9,0),\"\")","v":""},{"$f":"IFERROR(ROUND(AVERAGE(AH12:AI12)*$AJ$9,0),\"\")","v":""},{"$f":"IFERROR(ROUND(AVERAGE(R12+AJ12),0),\"\")","v":""},"","","","",""]
[null,2,null,null,{"$f":"SW!G11","v":"ABDURRAHMAN FAQIH"},null,null,null,null,null,null,null,null,null,null,null,null,{"$f":"IFERROR(ROUND(AVERAGE(F13:G13)*$R$9,0),\"\")","v":""},{"$f":"IFERROR(ROUND(AVERAGE(H13:I13)*$R$9,0),\"\")","v":""},{"$f":"IFERROR(ROUND(AVERAGE(J13:K13)*$R$9,0),\"\")","v":""},{"$f":"IFERROR(ROUND(AVERAGE(L13:M13)*$R$9,0),\"\")","v":""},{"$f":"IFERROR(ROUND(AVERAGE(N13:O13)*$R$9,0),\"\")","v":""},{"$f":"IFERROR(ROUND(AVERAGE(P13:Q13)*$R$9,0),\"\")","v":""},null,null,null,null,null,null,null,null,null,null,null,null,{"$f":"IFERROR(ROUND(AVERAGE(X13:Y13)*$AJ$9,0),\"\")","v":""},"",{"$f":"IFERROR(ROUND(AVERAGE(AB13:AC13)*$AJ$9,0),\"\")","v":""},{"$f":"IFERROR(ROUND(AVERAGE(AD13:AE13)*$AJ$9,0),\"\")","v":""},{"$f":"IFERROR(ROUND(AVERAGE(AF13:AG13)*$AJ$9,0),\"\")","v":""},{"$f":"IFERROR(ROUND(AVERAGE(AH13:AI13)*$AJ$9,0),\"\")","v":""},"","","","","",""]
[null,3,null,null,{"$f":"SW!G12","v":"ACHMAD FARROIHUN MUSHOBIRONILLAH"},null,null,null,null,null,null,null,null,null,null,null,null,"","","","","","",null,null,null,null,null,null,null,null,null,null,null,null,"","","","","","","","","","","",""]
[null,4,null,null,{"$f":"SW!G13","v":"ACHMAD HASBI ASSIDDIQI"},null,null,null,null,null,null,null,null,null,null,null,null,"","","","","","",null,null,null,null,null,null,null,null,null,null,null,null,"","","","","","","","","","","",""]
[null,5,null,null,{"$f":"SW!G14","v":"ACHMAD REZA AKRAM ALAUDDIN"},null,null,null,null,null,null,null,null,null,null,null,null,"","","","","","",null,null,null,null,null,null,null,null,null,null,null,null,"","","","","","","","","","","",""]
[null,6,null,null,{"$f":"SW!G15","v":"ACHMAD YANI"},null,null,null,null,null,null,null,null,null,null,null,null,"","","","","","",null,null,null,null,null,null,null,null,null,null,null,null,"","","","","","","","","","","",""]
[null,7,null,null,{"$f":"SW!G16","v":"AKHMAD RIDWAN"},null,null,null,null,null,null,null,null,null,null,null,null,"","","","","","",null,null,null,null,null,null,null,null,null,null,null,null,"","","","","","","","","","","",""]
[null,8,null,null,{"$f":"SW!G17","v":"ANDREAN DWI YULIANO"},null,null,null,null,null,null,null,null,null,null,null,null,"","","","","","",null,null,null,null,null,null,null,null,null,null,null,null,"","","","","","","","","","","",""]
[null,9,null,null,{"$f":"SW!G18","v":"ASFAN FAKHRI BARANI"},null,null,null,null,null,null,null,null,null,null,null,null,"","","","","","",null,null,null,null,null,null,null,null,null,null,null,null,"","","","","","","","","","","",""]
[null,10,null,null,{"$f":"SW!G19","v":"DEVAN ADITYA SAPUTRA"},null,null,null,null,null,null,null,null,null,null,null,null,"","","","","","",null,null,null,null,null,null,null,null,null,null,null,null,"","","","","","","","","","","",""]
[null,11,null,null,{"$f":"SW!G20","v":"FAHRUL AHMAD FAHREZA"},null,null,null,null,null,null,null,null,null,null,null,null,"","","","","","",null,null,null,null,null,null,null,null,null,null,null,null,"","","","","","","","","","","",""]
[null,12,null,null,{"$f":"SW!G21","v":"FAUZIA AMELIA PUTRI"},null,null,null,null,null,null,null,null,null,null,null,null,"","","","","","",null,null,null,null,null,null,null,null,null,null,null,null,"","","","","","","","","","","",""]
[null,13,null,null,{"$f":"SW!G22","v":"FAZA AZIFAH SALSABILA"},null,null,null,null,null,null,null,null,null,null,null,null,"","","","","","",null,null,null,null,null,null,null,null,null,null,null,null,"","","","","","","","","","","",""]
[null,14,null,null,{"$f":"SW!G23","v":"HABIBIE NURUSSALAM"},null,null,null,null,null,null,null,null,null,null,null,null,"","","","","","",null,null,null,null,null,null,null,null,null,null,null,null,"","","","","","","","","","","",""]
[null,15,null,null,{"$f":"SW!G24","v":"HIMATURROSYIDAH"},null,null,null,null,null,null,null,null,null,null,null,null,"","","","","","",null,null,null,null,null,null,null,null,null,null,null,null,"","","","","","","","","","","",""]
[null,16,null,null,{"$f":"SW!G25","v":"IFKARINA NAILA SAUQYA"},null,null,null,null,null,null,null,null,null,null,null,null,"","","","","","",null,null,null,null,null,null,null,null,null,null,null,null,"","","","","","","","","","","",""]
[null,17,null,null,{"$f":"SW!G26","v":"KEISA AYU SASKIYAH"},null,null,null,null,null,null,null,null,null,null,null,null,"","","","","","",null,null,null,null,null,null,null,null,null,null,null,null,"","","","","","",{"$f":"IFERROR(ROUND(AVERAGE(R28+AJ28),0),\"\")","v":""},"","","","",""]
[null,18,null,null,{"$f":"SW!G27","v":"MOCHAMMAD RENO FIRMANSYAH"},null,null,null,null,null,null,null,null,null,null,null,null,"","","","","","",null,null,null,null,null,null,null,null,null,null,null,null,"","","","","","","","","","","",""]
[null,19,null,null,{"$f":"SW!G28","v":"MOHAMAD NUR KHAFID KHABIBULLOH"},null,null,null,null,null,null,null,null,null,null,null,null,"","","","","","",null,null,null,null,null,null,null,null,null,null,null,null,"","","","","","","","","","","",""]
[null,20,null,null,{"$f":"SW!G29","v":"MOHAMMAD NAUFAL NAWWARUDDIN"},null,null,null,null,null,null,null,null,null,null,null,null,"","","","","","",null,null,null,null,null,null,null,null,null,null,null,null,"","","","","","","","","","","",""]
[null,21,null,null,{"$f":"SW!G30","v":"MUCHAMAD PRIMA PAMBUDI"},null,null,null,null,null,null,null,null,null,null,null,null,"","","","","","",null,null,null,null,null,null,null,null,null,null,null,null,"","","","","","","","","","","",""]
[null,22,null,null,{"$f":"SW!G31","v":"MUHAMMAD ALFAN FATHONI"},null,null,null,null,null,null,null,null,null,null,null,null,"","","","","","",null,null,null,null,null,null,null,null,null,null,null,null,"","","","","","","","","","","",""]
[null,23,null,null,{"$f":"SW!G32","v":"MUHAMMAD AMINULLAH MAULUDANI"},null,null,null,null,null,null,null,null,null,null,null,null,"","","","","","",null,null,null,null,null,null,null,null,null,null,null,null,"","","","","","","","","","","",""]
[null,24,null,null,{"$f":"SW!G33","v":"MUHAMMAD DAVIN  LEVANTINO"},null,null,null,null,null,null,null,null,null,null,null,null,"","","","","","",null,null,null,null,null,null,null,null,null,null,null,null,"","","","","","","","","","","",""]
[null,25,null,null,{"$f":"SW!G34","v":"MUHAMMAD MAULANA PAHLEVY"},null,null,null,null,null,null,null,null,null,null,null,null,"","","","","","",null,null,null,null,null,null,null,null,null,null,null,null,"","","","","","","","","","","",""]
[null,26,null,null,{"$f":"SW!G35","v":"RADITYA NIRWANSYAH"},null,null,null,null,null,null,null,null,null,null,null,null,"","","","","","",null,null,null,null,null,null,null,null,null,null,null,null,"","","","","","","","","","","",""]
[null,27,null,null,{"$f":"SW!G36","v":"REVINA SRI UTARI"},null,null,null,null,null,null,null,null,null,null,null,null,"","","","","","",null,null,null,null,null,null,null,null,null,null,null,null,"","","","","","","","","","","",""]
[null,28,null,null,{"$f":"SW!G37","v":"REYHAN DWI ANDIKA"},null,null,null,null,null,null,null,null,null,null,null,null,"","","","","","",null,null,null,null,null,null,null,null,null,null,null,null,"","","","","","","","","","","",""]
[null,29,null,null,{"$f":"SW!G38","v":"RISKA LAURA TRIA OCTAVIA"},null,null,null,null,null,null,null,null,null,null,null,null,"","","","","","",null,null,null,null,null,null,null,null,null,null,null,null,"","","","","","","","","","","",""]
[null,30,null,null,{"$f":"SW!G39","v":"ROHMADONA DWI SAFITRI"},null,null,null,null,null,null,null,null,null,null,null,null,"","","","","","",null,null,null,null,null,null,null,null,null,null,null,null,"","","","","","","","","","","",""]
[null,31,null,null,{"$f":"SW!G40","v":"SALMAN ALFARIZI"},null,null,null,null,null,null,null,null,null,null,null,null,"","","","","","",null,null,null,null,null,null,null,null,null,null,null,null,"","","","","","","","","","","",""]
[null,32,null,null,{"$f":"SW!G41","v":"TAUFIQ KURROHMAN"},null,null,null,null,null,null,null,null,null,null,null,null,"","","","","","",null,null,null,null,null,null,null,null,null,null,null,null,"","","","","","","","","","","",""]
[null,33,null,null,{"$f":"SW!G42","v":0},null,null,null,null,null,null,null,null,null,null,null,null,"","","","","","",null,null,null,null,null,null,null,null,null,null,null,null,"","","","","","","","","","","",""]
[null,34,null,null,{"$f":"SW!G43","v":0},null,null,null,null,null,null,null,null,null,null,null,null,"","","","","","",null,null,null,null,null,null,null,null,null,null,null,null,"","","","","","","","","","","",""]
[null,35,null,null,{"$f":"SW!G44","v":0},null,null,null,null,null,null,null,null,null,null,null,null,"","","","","","",null,null,null,null,null,null,null,null,null,null,null,null,"","","","","","","","","","","",""]
[null,36,null,null,{"$f":"SW!G45","v":0},null,null,null,null,null,null,null,null,null,null,null,null,"","","","","","",null,null,null,null,null,null,null,null,null,null,null,null,"","","","","","","","","","","",""]
[null,37,null,null,{"$f":"SW!G46","v":0},null,null,null,null,null,null,null,null,null,null,null,null,"","","","","","",null,null,null,null,null,null,null,null,null,null,null,null,"","","","","","","","","","","",""]
[null,38,null,null,{"$f":"SW!G47","v":0},null,null,null,null,null,null,null,null,null,null,null,null,"","","","","","",null,null,null,null,null,null,null,null,null,null,null,null,"","","","","","","","","","","",""]
[null,39,null,null,{"$f":"SW!G48","v":0},null,null,null,null,null,null,null,null,null,null,null,null,"","","","","","",null,null,null,null,null,null,null,null,null,null,null,null,"","","","","","","","","","","",""]
[null,40,null,null,{"$f":"SW!G49","v":0},null,null,null,null,null,null,null,null,null,null,null,null,"","","","","","",null,null,null,null,null,null,null,null,null,null,null,null,"","","","","","","","","","","",""]
[null,41,null,null,{"$f":"SW!G50","v":0},null,null,null,null,null,null,null,null,null,null,null,null,"","","","","","",null,null,null,null,null,null,null,null,null,null,null,null,"","","","","","","","","","","",""]
[null,42,null,null,{"$f":"SW!G51","v":0},null,null,null,null,null,null,null,null,null,null,null,null,"","","","","","",null,null,null,null,null,null,null,null,null,null,null,null,"","","","","","","","","","","",""]
[null,43,null,null,{"$f":"SW!G52","v":0},null,null,null,null,null,null,null,null,null,null,null,null,"","","","","","",null,null,null,null,null,null,null,null,null,null,null,null,"","","","","","","","","","","",""]
[null,44,null,null,{"$f":"SW!G53","v":0},null,null,null,null,null,null,null,null,null,null,null,null,"","","","","","",null,null,null,null,null,null,null,null,null,null,null,null,"","","","","","","","","","","",""]
[null,45,null,null,{"$f":"SW!G54","v":0},null,null,null,null,null,null,null,null,null,null,null,null,"","","","","","",null,null,null,null,null,null,null,null,null,null,null,null,"","","","","","","","","","","",""]
[null,46,null,null,{"$f":"SW!G55","v":0},null,null,null,null,null,null,null,null,null,null,null,null,"","","","","","",null,null,null,null,null,null,null,null,null,null,null,null,"","","","","","","","","","","",""]
[null,47,null,null,{"$f":"SW!G56","v":0},null,null,null,null,null,null,null,null,null,null,null,null,"","","","","","",null,null,null,null,null,null,null,null,null,null,null,null,"","","","","","","","","","","",""]
[null,48,null,null,{"$f":"SW!G57","v":0},null,null,null,null,null,null,null,null,null,null,null,null,"","","","","","",null,null,null,null,null,null,null,null,null,null,null,null,"","","","","","","","","","","",""]
[null,49,null,null,{"$f":"SW!G58","v":0},null,null,null,null,null,null,null,null,null,null,null,null,"","","","","","",null,null,null,null,null,null,null,null,null,null,null,null,"","","","","","","","","","","",""]
[null,50,null,null,{"$f":"SW!G59","v":0},null,null,null,null,null,null,null,null,null,null,null,null,"","","","","","",null,null,null,null,null,null,null,null,null,null,null,null,"","","","","","","","","","","",""]
[null,51,null,null,{"$f":"SW!G60","v":0},null,null,null,null,null,null,null,null,null,null,null,null,"","","","","","",null,null,null,null,null,null,null,null,null,null,null,null,"","","","","","","","","","","",""]
[null,52,null,null,{"$f":"SW!G61","v":0},null,null,null,null,null,null,null,null,null,null,null,null,"","","","","","",null,null,null,null,null,null,null,null,null,null,null,null,"","","","","","","","","","","",""]
[null,53,null,null,{"$f":"SW!G62","v":0},null,null,null,null,null,null,null,null,null,null,null,null,"","","","","","",null,null,null,null,null,null,null,null,null,null,null,null,"","","","","","","","","","","",""]
[null,54,null,null,{"$f":"SW!G63","v":0},null,null,null,null,null,null,null,null,null,null,null,null,"","","","","","",null,null,null,null,null,null,null,null,null,null,null,null,"","","","","","","","","","","",""]
[null,55,null,null,{"$f":"SW!G64","v":0},null,null,null,null,null,null,null,null,null,null,null,null,"","","","","","",null,null,null,null,null,null,null,null,null,null,null,null,"","","","","","","","","","","",""]
[null,56,null,null,{"$f":"SW!G65","v":0},null,null,null,null,null,null,null,null,null,null,null,null,"","","","","","",null,null,null,null,null,null,null,null,null,null,null,null,"","","","","","","","","","","",""]
[null,57,null,null,{"$f":"SW!G66","v":0},null,null,null,null,null,null,null,null,null,null,null,null,"","","","","","",null,null,null,null,null,null,null,null,null,null,null,null,"","","","","","","","","","","",""]
[null,58,null,null,{"$f":"SW!G67","v":0},null,null,null,null,null,null,null,null,null,null,null,null,"","","","","","",null,null,null,null,null,null,null,null,null,null,null,null,"","","","","","","","","","","",""]
[null,59,null,null,{"$f":"SW!G68","v":0},null,null,null,null,null,null,null,null,null,null,null,null,"","","","","","",null,null,null,null,null,null,null,null,null,null,null,null,"","","","","","","","","",{"$f":"IFERROR(ROUND(AVERAGE(U70+AM70),0),\"\")","v":""},"",""]
[null,60,null,null,{"$f":"SW!G69","v":0},null,null,null,null,null,null,null,null,null,null,null,null,"","","","","","",null,null,null,null,null,null,null,null,null,null,null,null,"","","","","","",{"$f":"IFERROR(ROUND(AVERAGE(R71+AJ71),0),\"\")","v":""},"","","","",""]
[null,61,null,null,{"$f":"SW!G70","v":0},null,null,null,null,null,null,null,null,null,null,null,null,"","","","","","",null,null,null,null,null,null,null,null,null,null,null,null,"","","","","","","","","","","",""]
[null,62,null,null,{"$f":"SW!G71","v":0},null,null,null,null,null,null,null,null,null,null,null,null,"","","","","","",null,null,null,null,null,null,null,null,null,null,null,null,"","","","","","","","","","","",""]
[null,63,null,null,{"$f":"SW!G72","v":0},null,null,null,null,null,null,null,null,null,null,null,null,"","","","","","",null,null,null,null,null,null,null,null,null,null,null,null,"","","","","","","","","","","",""]
[null,64,null,null,{"$f":"SW!G73","v":0},null,null,null,null,null,null,null,null,null,null,null,null,"","","","","","",null,null,null,null,null,null,null,null,null,null,null,null,"","","","","","","","","","","",""]
[null,65,null,null,{"$f":"SW!G74","v":0},null,null,null,null,null,null,null,null,null,null,null,null,"","","","","","",null,null,null,null,null,null,null,null,null,null,null,null,"","","","","","","","","","","",""]
[null,66,null,null,{"$f":"SW!G75","v":0},null,null,null,null,null,null,null,null,null,null,null,null,{"$f":"IFERROR(ROUND(AVERAGE(F77:G77)*$R$9,0),\"\")","v":""},{"$f":"IFERROR(ROUND(AVERAGE(H77:I77)*$R$9,0),\"\")","v":""},{"$f":"IFERROR(ROUND(AVERAGE(J77:K77)*$R$9,0),\"\")","v":""},{"$f":"IFERROR(ROUND(AVERAGE(L77:M77)*$R$9,0),\"\")","v":""},{"$f":"IFERROR(ROUND(AVERAGE(N77:O77)*$R$9,0),\"\")","v":""},{"$f":"IFERROR(ROUND(AVERAGE(P77:Q77)*$R$9,0),\"\")","v":""},null,null,null,null,null,null,null,null,null,null,null,null,{"$f":"IFERROR(ROUND(AVERAGE(X77:Y77)*$AJ$9,0),\"\")","v":""},{"$f":"IFERROR(ROUND(AVERAGE(Z77:AA77)*$AJ$9,0),\"\")","v":""},{"$f":"IFERROR(ROUND(AVERAGE(AB77:AC77)*$AJ$9,0),\"\")","v":""},{"$f":"IFERROR(ROUND(AVERAGE(AD77:AE77)*$AJ$9,0),\"\")","v":""},{"$f":"IFERROR(ROUND(AVERAGE(AF77:AG77)*$AJ$9,0),\"\")","v":""},{"$f":"IFERROR(ROUND(AVERAGE(AH77:AI77)*$AJ$9,0),\"\")","v":""},"","","","","",""]
[null,67,null,null,{"$f":"SW!G76","v":0},null,null,null,null,null,null,null,null,null,null,null,null,"","","","","","",null,null,null,null,null,null,null,null,null,null,null,null,"","","","","","","","","","","",""]
[null,68,null,null,{"$f":"SW!G77","v":0},null,null,null,null,null,null,null,null,null,null,null,null,"","","","","","",null,null,null,null,null,null,null,null,null,null,null,null,"","","","","","","","","","","",""]
[null,69,null,null,{"$f":"SW!G78","v":0},null,null,null,null,null,null,null,null,null,null,null,null,"","","","","","",null,null,null,null,null,null,null,null,null,null,null,null,"","","","","","","","","","","",""]
[null,70,null,null,{"$f":"SW!G79","v":0},null,null,null,null,null,null,null,null,null,null,null,null,"","","","","","",null,null,null,null,null,null,null,null,null,null,null,null,"","","","","","","","","","","",""]
[null,71,null,null,{"$f":"SW!G80","v":0},null,null,null,null,null,null,null,null,null,null,null,null,"","","","","","",null,null,null,null,null,null,null,null,null,null,null,null,"","","","","","","","","","","",""]
[null,72,null,null,{"$f":"SW!G81","v":0},null,null,null,null,null,null,null,null,null,null,null,null,"","","","","","",null,null,null,null,null,null,null,null,null,null,null,null,"","","","","","","","","","","",""]
[null,73,null,null,{"$f":"SW!G82","v":0},null,null,null,null,null,null,null,null,null,null,null,null,"","","","","","",null,null,null,null,null,null,null,null,null,null,null,null,"","","","","","","","","","","",""]
[null,74,null,null,{"$f":"SW!G83","v":0},null,null,null,null,null,null,null,null,null,null,null,null,"","","","","","",null,null,null,null,null,null,null,null,null,null,null,null,"","","","","","","","","","","",""]
[null,75,null,null,{"$f":"SW!G84","v":0},null,null,null,null,null,null,null,null,null,null,null,null,"","","","","","",null,null,null,null,null,null,null,null,null,null,null,null,"","","","","","","","","","","",""]
[null,76,null,null,{"$f":"SW!G85","v":0},null,null,null,null,null,null,null,null,null,null,null,null,"","","","","","",null,null,null,null,null,null,null,null,null,null,null,null,"","","","","","","","","","","",""]
[null,77,null,null,{"$f":"SW!G86","v":0},null,null,null,null,null,null,null,null,null,null,null,null,"","","","","","",null,null,null,null,null,null,null,null,null,null,null,null,"","","","","","","","","","","",""]
[null,78,null,null,{"$f":"SW!G87","v":0},null,null,null,null,null,null,null,null,null,null,null,null,"","","","","","",null,null,null,null,null,null,null,null,null,null,null,null,"","","","","","","","","","","",""]
[null,79,null,null,{"$f":"SW!G88","v":0},null,null,null,null,null,null,null,null,null,null,null,null,"","","","","","",null,null,null,null,null,null,null,null,null,null,null,null,"","","","","","","","","","","",""]
[null,80,null,null,{"$f":"SW!G89","v":0},null,null,null,null,null,null,null,null,null,null,null,null,"","","","","","",null,null,null,null,null,null,null,null,null,null,null,null,"","","","","","","","","","","",""]
[null,81,null,null,{"$f":"SW!G90","v":0},null,null,null,null,null,null,null,null,null,null,null,null,"","","","","","",null,null,null,null,null,null,null,null,null,null,null,null,"","","","","","","","","","","",""]
[null,82,null,null,{"$f":"SW!G91","v":0},null,null,null,null,null,null,null,null,null,null,null,null,"","","","","","",null,null,null,null,null,null,null,null,null,null,null,null,"","","","","","","","","","","",""]
[null,83,null,null,{"$f":"SW!G92","v":0},null,null,null,null,null,null,null,null,null,null,null,null,"","","","","","",null,null,null,null,null,null,null,null,null,null,null,null,"","","","","","","","","","","",""]
[null,84,null,null,{"$f":"SW!G93","v":0},null,null,null,null,null,null,null,null,null,null,null,null,"","","","","","",null,null,null,null,null,null,null,null,null,null,null,null,"","","","","","","","","","","",""]
[null,85,null,null,{"$f":"SW!G94","v":0},null,null,null,null,null,null,null,null,null,null,null,null,"","","","","","",null,null,null,null,null,null,null,null,null,null,null,null,"","","","","","","","","","","",""]
[null,86,null,null,{"$f":"SW!G95","v":0},null,null,null,null,null,null,null,null,null,null,null,null,"","","","","","",null,null,null,null,null,null,null,null,null,null,null,null,"","","","","","","","","","","",""]
[null,87,null,null,{"$f":"SW!G96","v":0},null,null,null,null,null,null,null,null,null,null,null,null,"","","","","","",null,null,null,null,null,null,null,null,null,null,null,null,"","","","","","","","","","","",""]
[null,88,null,null,{"$f":"SW!G97","v":0},null,null,null,null,null,null,null,null,null,null,null,null,"","","","","","",null,null,null,null,null,null,null,null,null,null,null,null,"","","","","","","","","","","",""]
[null,89,null,null,{"$f":"SW!G98","v":0},null,null,null,null,null,null,null,null,null,null,null,null,"","","","","","",null,null,null,null,null,null,null,null,null,null,null,null,"","","","","","","","","","","",""]

{"sheet":"T5","index":4,"n_rows":100,"n_cols":47,"rows_kept":100,"cut":false,"hidden":false,"merged":[[8,35,9,40],[8,41,9,46],[9,5,9,6],[9,7,9,8],[9,9,9,10],[9,11,9,12],[9,13,9,14],[9,31,9,32],[9,33,9,34],[9,15,9,16],[9,23,9,24],[9,25,9,26],[9,27,9,28],[9,29,9,30],[8,1,10,1],[8,4,10,4],[8,5,8,16],[8,17,9,22],[8,23,8,34],[1,1,1,46],[3,6,3,18],[3,42,5,45],[4,6,4,18],[5,6,5,18],[4,20,5,21],[4,23,5,24],[4,26,5,27],[4,29,5,30],[4,32,5,33],[4,35,5,36],[4,38,5,40]]}
[]
[null,"D A F T A R   N I L A I"]
[]
[null,"MATA PELAJARAN",null,null,null,":",{"$f":"RTM!AJ5","v":"TEMA 5"},null,null,null,null,null,null,null,null,null,null,null,null,null,null,null,null,null,null,null,null,null,null,null,null,null,null,null,null,null,null,null,null,null,null,null,"۩MENU↗"]
[null,"KELAS",null,null,null,":",{"$f":"UPPER(MN!D22)","v":"V B"},null,null,null,null,null,null,null,null,null,null,null,null,null,"TEMA 1",null,null,"TEMA 2",null,null,"TEMA 3",null,null,"TEMA 4",null,null,"TEMA 5",null,null,"TEMA 6",null,null,"REKAP"]
[null,"TAHUN PELAJARAN",null,null,null,":",{"$f":"MN!D18","v":"2019 - 2020"}]
[]
[]
[null,"No",null,null,"Nama Siswa","NILAI PG",null,null,null,null,null,null,null,null,null,null,null,0.6,null,null,null,null,null,"NILAI ESSAY",null,null,null,null,null,null,null,null,null,null,null,{"$f":"100%-R9","v":0.4},null,null,null,null,null,"JUMLAH"]
[null,null,"No. Induk","NISN",null,"BIN",null,"MTK",null,"IPA",null,"PPKn",null,"IPS",null,"SBDP",null,null,null,null,null,null,null,"BIN",null,"MTK",null,"IPA",null,"PPKn",null,"IPS",null,"SBDP"]
[null,null,null,null,null,"Naskah 1","Naskah 2","Naskah 1","Naskah 2","Naskah 1","Naskah 2","Naskah 1","Naskah 2","Naskah 1","Naskah 2","Naskah 1","Naskah 2","BIN","MTK","IPA","PPKn","IPS","SBDP","Naskah 1","Naskah 2","Naskah 1","Naskah 2","Naskah 1","Naskah 2","Naskah 1","Naskah 2","Naskah 1","Naskah 2","Naskah 1","Naskah 2","BIN","MTK","IPA","PPKn","IPS","SBDP","BIN","MTK","IPA","PPKn","IPS","SBDP"]
[null,1,null,null,{"$f":"SW!G10","v":"ABD. ROCHMAN NAJA FATLAN PRATAMA"},null,null,null,null,null,null,null,null,null,null,null,null,{"$f":"IFERROR(ROUND(AVERAGE(F12:G12)*$R$9,0),\"\")","v":""},{"$f":"IFERROR(ROUND(AVERAGE(H12:I12)*$R$9,0),\"\")","v":""},{"$f":"IFERROR(ROUND(AVERAGE(J12:K12)*$R$9,0),\"\")","v":""},{"$f":"IFERROR(ROUND(AVERAGE(L12:M12)*$R$9,0),\"\")","v":""},{"$f":"IFERROR(ROUND(AVERAGE(N12:O12)*$R$9,0),\"\")","v":""},{"$f":"IFERROR(ROUND(AVERAGE(P12:Q12)*$R$9,0),\"\")","v":""},null,null,null,null,null,null,null,null,null,null,null,null,{"$f":"IFERROR(ROUND(AVERAGE(X12:Y12)*$AJ$9,0),\"\")","v":""},{"$f":"IFERROR(ROUND(AVERAGE(Z12:AA12)*$AJ$9,0),\"\")","v":""},{"$f":"IFERROR(ROUND(AVERAGE(AB12:AC12)*$AJ$9,0),\"\")","v":""},{"$f":"IFERROR(ROUND(AVERAGE(AD12:AE12)*$AJ$9,0),\"\")","v":""},{"$f":"IFERROR(ROUND(AVERAGE(AF12:AG12)*$AJ$9,0),\"\")","v":""},{"$f":"IFERROR(ROUND(AVERAGE(AH12:AI12)*$AJ$9,0),\"\")","v":""},{"$f":"IFERROR(ROUND(AVERAGE(R12+AJ12),0),\"\")","v":""},"","","","",""]
[null,2,null,null,{"$f":"SW!G11","v":"ABDURRAHMAN FAQIH"},null,null,null,null,null,null,null,null,null,null,null,null,{"$f":"IFERROR(ROUND(AVERAGE(F13:G13)*$R$9,0),\"\")","v":""},{"$f":"IFERROR(ROUND(AVERAGE(H13:I13)*$R$9,0),\"\")","v":""},{"$f":"IFERROR(ROUND(AVERAGE(J13:K13)*$R$9,0),\"\")","v":""},{"$f":"IFERROR(ROUND(AVERAGE(L13:M13)*$R$9,0),\"\")","v":""},{"$f":"IFERROR(ROUND(AVERAGE(N13:O13)*$R$9,0),\"\")","v":""},{"$f":"IFERROR(ROUND(AVERAGE(P13:Q13)*$R$9,0),\"\")","v":""},null,null,null,null,null,null,null,null,null,null,null,null,{"$f":"IFERROR(ROUND(AVERAGE(X13:Y13)*$AJ$9,0),\"\")","v":""},"",{"$f":"IFERROR(ROUND(AVERAGE(AB13:AC13)*$AJ$9,0),\"\")","v":""},{"$f":"IFERROR(ROUND(AVERAGE(AD13:AE13)*$AJ$9,0),\"\")","v":""},{"$f":"IFERROR(ROUND(AVERAGE(AF13:AG13)*$AJ$9,0),\"\")","v":""},{"$f":"IFERROR(ROUND(AVERAGE(AH13:AI13)*$AJ$9,0),\"\")","v":""},"","","","","",""]
[null,3,null,null,{"$f":"SW!G12","v":"ACHMAD FARROIHUN MUSHOBIRONILLAH"},null,null,null,null,null,null,null,null,null,null,null,null,"","","","","","",null,null,null,null,null,null,null,null,null,null,null,null,"","","","","","","","","","","",""]
[null,4,null,null,{"$f":"SW!G13","v":"ACHMAD HASBI ASSIDDIQI"},null,null,null,null,null,null,null,null,null,null,null,null,"","","","","","",null,null,null,null,null,null,null,null,null,null,null,null,"","","","","","","","","","","",""]
[null,5,null,null,{"$f":"SW!G14","v":"ACHMAD REZA AKRAM ALAUDDIN"},null,null,null,null,null,null,null,null,null,null,null,null,"","","","","","",null,null,null,null,null,null,null,null,null,null,null,null,"","","","","","","","","","","",""]
[null,6,null,null,{"$f":"SW!G15","v":"ACHMAD YANI"},null,null,null,null,null,null,null,null,null,null,null,null,"","","","","","",null,null,null,null,null,null,null,null,null,null,null,null,"","","","","","","","","","","",""]
[null,7,null,null,{"$f":"SW!G16","v":"AKHMAD RIDWAN"},null,null,null,null,null,null,null,null,null,null,null,null,"","","","","","",null,null,null,null,null,null,null,null,null,null,null,null,"","","","","","","","","","","",""]
[null,8,null,null,{"$f":"SW!G17","v":"ANDREAN DWI YULIANO"},null,null,null,null,null,null,null,null,null,null,null,null,"","","","","","",null,null,null,null,null,null,null,null,null,null,null,null,"","","","","","","","","","","",""]
[null,9,null,null,{"$f":"SW!G18","v":"ASFAN FAKHRI BARANI"},null,null,null,null,null,null,null,null,null,null,null,null,"","","","","","",null,null,null,null,null,null,null,null,null,null,null,null,"","","","","","","","","","","",""]
[null,10,null,null,{"$f":"SW!G19","v":"DEVAN ADITYA SAPUTRA"},null,null,null,null,null,null,null,null,null,null,null,null,"","","","","","",null,null,null,null,null,null,null,null,null,null,null,null,"","","","","","","","","","","",""]
[null,11,null,null,{"$f":"SW!G20","v":"FAHRUL AHMAD FAHREZA"},null,null,null,null,null,null,null,null,null,null,null,null,"","","","","","",null,null,null,null,null,null,null,null,null,null,null,null,"","","","","","","","","","","",""]
[null,12,null,null,{"$f":"SW!G21","v":"FAUZIA AMELIA PUTRI"},null,null,null,null,null,null,null,null,null,null,null,null,"","","","","","",null,null,null,null,null,null,null,null,null,null,null,null,"","","","","","","","","","","",""]
[null,13,null,null,{"$f":"SW!G22","v":"FAZA AZIFAH SALSABILA"},null,null,null,null,null,null,null,null,null,null,null,null,"","","","","","",null,null,null,null,null,null,null,null,null,null,null,null,"","","","","","","","","","","",""]
[null,14,null,null,{"$f":"SW!G23","v":"HABIBIE NURUSSALAM"},null,null,null,null,null,null,null,null,null,null,null,null,"","","","","","",null,null,null,null,null,null,null,null,null,null,null,null,"","","","","","","","","","","",""]
[null,15,null,null,{"$f":"SW!G24","v":"HIMATURROSYIDAH"},null,null,null,null,null,null,null,null,null,null,null,null,"","","","","","",null,null,null,null,null,null,null,null,null,null,null,null,"","","","","","","","","","","",""]
[null,16,null,null,{"$f":"SW!G25","v":"IFKARINA NAILA SAUQYA"},null,null,null,null,null,null,null,null,null,null,null,null,"","","","","","",null,null,null,null,null,null,null,null,null,null,null,null,"","","","","","","","","","","",""]
[null,17,null,null,{"$f":"SW!G26","v":"KEISA AYU SASKIYAH"},null,null,null,null,null,null,null,null,null,null,null,null,"","","","","","",null,null,null,null,null,null,null,null,null,null,null,null,"","","","","","",{"$f":"IFERROR(ROUND(AVERAGE(R28+AJ28),0),\"\")","v":""},"","","","",""]
[null,18,null,null,{"$f":"SW!G27","v":"MOCHAMMAD RENO FIRMANSYAH"},null,null,null,null,null,null,null,null,null,null,null,null,"","","","","","",null,null,null,null,null,null,null,null,null,null,null,null,"","","","","","","","","","","",""]
[null,19,null,null,{"$f":"SW!G28","v":"MOHAMAD NUR KHAFID KHABIBULLOH"},null,null,null,null,null,null,null,null,null,null,null,null,"","","","","","",null,null,null,null,null,null,null,null,null,null,null,null,"","","","","","","","","","","",""]
[null,20,null,null,{"$f":"SW!G29","v":"MOHAMMAD NAUFAL NAWWARUDDIN"},null,null,null,null,null,null,null,null,null,null,null,null,"","","","","","",null,null,null,null,null,null,null,null,null,null,null,null,"","","","","","","","","","","",""]
[null,21,null,null,{"$f":"SW!G30","v":"MUCHAMAD PRIMA PAMBUDI"},null,null,null,null,null,null,null,null,null,null,null,null,"","","","","","",null,null,null,null,null,null,null,null,null,null,null,null,"","","","","","","","","","","",""]
[null,22,null,null,{"$f":"SW!G31","v":"MUHAMMAD ALFAN FATHONI"},null,null,null,null,null,null,null,null,null,null,null,null,"","","","","","",null,null,null,null,null,null,null,null,null,null,null,null,"","","","","","","","","","","",""]
[null,23,null,null,{"$f":"SW!G32","v":"MUHAMMAD AMINULLAH MAULUDANI"},null,null,null,null,null,null,null,null,null,null,null,null,"","","","","","",null,null,null,null,null,null,null,null,null,null,null,null,"","","","","","","","","","","",""]
[null,24,null,null,{"$f":"SW!G33","v":"MUHAMMAD DAVIN  LEVANTINO"},null,null,null,null,null,null,null,null,null,null,null,null,"","","","","","",null,null,null,null,null,null,null,null,null,null,null,null,"","","","","","","","","","","",""]
[null,25,null,null,{"$f":"SW!G34","v":"MUHAMMAD MAULANA PAHLEVY"},null,null,null,null,null,null,null,null,null,null,null,null,"","","","","","",null,null,null,null,null,null,null,null,null,null,null,null,"","","","","","","","","","","",""]
[null,26,null,null,{"$f":"SW!G35","v":"RADITYA NIRWANSYAH"},null,null,null,null,null,null,null,null,null,null,null,null,"","","","","","",null,null,null,null,null,null,null,null,null,null,null,null,"","","","","","","","","","","",""]
[null,27,null,null,{"$f":"SW!G36","v":"REVINA SRI UTARI"},null,null,null,null,null,null,null,null,null,null,null,null,"","","","","","",null,null,null,null,null,null,null,null,null,null,null,null,"","","","","","","","","","","",""]
[null,28,null,null,{"$f":"SW!G37","v":"REYHAN DWI ANDIKA"},null,null,null,null,null,null,null,null,null,null,null,null,"","","","","","",null,null,null,null,null,null,null,null,null,null,null,null,"","","","","","","","","","","",""]
[null,29,null,null,{"$f":"SW!G38","v":"RISKA LAURA TRIA OCTAVIA"},null,null,null,null,null,null,null,null,null,null,null,null,"","","","","","",null,null,null,null,null,null,null,null,null,null,null,null,"","","","","","","","","","","",""]
[null,30,null,null,{"$f":"SW!G39","v":"ROHMADONA DWI SAFITRI"},null,null,null,null,null,null,null,null,null,null,null,null,"","","","","","",null,null,null,null,null,null,null,null,null,null,null,null,"","","","","","","","","","","",""]
[null,31,null,null,{"$f":"SW!G40","v":"SALMAN ALFARIZI"},null,null,null,null,null,null,null,null,null,null,null,null,"","","","","","",null,null,null,null,null,null,null,null,null,null,null,null,"","","","","","","","","","","",""]
[null,32,null,null,{"$f":"SW!G41","v":"TAUFIQ KURROHMAN"},null,null,null,null,null,null,null,null,null,null,null,null,"","","","","","",null,null,null,null,null,null,null,null,null,null,null,null,"","","","","","","","","","","",""]
[null,33,null,null,{"$f":"SW!G42","v":0},null,null,null,null,null,null,null,null,null,null,null,null,"","","","","","",null,null,null,null,null,null,null,null,null,null,null,null,"","","","","","","","","","","",""]
[null,34,null,null,{"$f":"SW!G43","v":0},null,null,null,null,null,null,null,null,null,null,null,null,"","","","","","",null,null,null,null,null,null,null,null,null,null,null,null,"","","","","","","","","","","",""]
[null,35,null,null,{"$f":"SW!G44","v":0},null,null,null,null,null,null,null,null,null,null,null,null,"","","","","","",null,null,null,null,null,null,null,null,null,null,null,null,"","","","","","","","","","","",""]
[null,36,null,null,{"$f":"SW!G45","v":0},null,null,null,null,null,null,null,null,null,null,null,null,"","","","","","",null,null,null,null,null,null,null,null,null,null,null,null,"","","","","","","","","","","",""]
[null,37,null,null,{"$f":"SW!G46","v":0},null,null,null,null,null,null,null,null,null,null,null,null,"","","","","","",null,null,null,null,null,null,null,null,null,null,null,null,"","","","","","","","","","","",""]
[null,38,null,null,{"$f":"SW!G47","v":0},null,null,null,null,null,null,null,null,null,null,null,null,"","","","","","",null,null,null,null,null,null,null,null,null,null,null,null,"","","","","","","","","","","",""]
[null,39,null,null,{"$f":"SW!G48","v":0},null,null,null,null,null,null,null,null,null,null,null,null,"","","","","","",null,null,null,null,null,null,null,null,null,null,null,null,"","","","","","","","","","","",""]
[null,40,null,null,{"$f":"SW!G49","v":0},null,null,null,null,null,null,null,null,null,null,null,null,"","","","","","",null,null,null,null,null,null,null,null,null,null,null,null,"","","","","","","","","","","",""]
[null,41,null,null,{"$f":"SW!G50","v":0},null,null,null,null,null,null,null,null,null,null,null,null,"","","","","","",null,null,null,null,null,null,null,null,null,null,null,null,"","","","","","","","","","","",""]
[null,42,null,null,{"$f":"SW!G51","v":0},null,null,null,null,null,null,null,null,null,null,null,null,"","","","","","",null,null,null,null,null,null,null,null,null,null,null,null,"","","","","","","","","","","",""]
[null,43,null,null,{"$f":"SW!G52","v":0},null,null,null,null,null,null,null,null,null,null,null,null,"","","","","","",null,null,null,null,null,null,null,null,null,null,null,null,"","","","","","","","","","","",""]
[null,44,null,null,{"$f":"SW!G53","v":0},null,null,null,null,null,null,null,null,null,null,null,null,"","","","","","",null,null,null,null,null,null,null,null,null,null,null,null,"","","","","","","","","","","",""]
[null,45,null,null,{"$f":"SW!G54","v":0},null,null,null,null,null,null,null,null,null,null,null,null,"","","","","","",null,null,null,null,null,null,null,null,null,null,null,null,"","","","","","","","","","","",""]
[null,46,null,null,{"$f":"SW!G55","v":0},null,null,null,null,null,null,null,null,null,null,null,null,"","","","","","",null,null,null,null,null,null,null,null,null,null,null,null,"","","","","","","","","","","",""]
[null,47,null,null,{"$f":"SW!G56","v":0},null,null,null,null,null,null,null,null,null,null,null,null,"","","","","","",null,null,null,null,null,null,null,null,null,null,null,null,"","","","","","","","","","","",""]
[null,48,null,null,{"$f":"SW!G57","v":0},null,null,null,null,null,null,null,null,null,null,null,null,"","","","","","",null,null,null,null,null,null,null,null,null,null,null,null,"","","","","","","","","","","",""]
[null,49,null,null,{"$f":"SW!G58","v":0},null,null,null,null,null,null,null,null,null,null,null,null,"","","","","","",null,null,null,null,null,null,null,null,null,null,null,null,"","","","","","","","","","","",""]
[null,50,null,null,{"$f":"SW!G59","v":0},null,null,null,null,null,null,null,null,null,null,null,null,"","","","","","",null,null,null,null,null,null,null,null,null,null,null,null,"","","","","","","","","","","",""]
[null,51,null,null,{"$f":"SW!G60","v":0},null,null,null,null,null,null,null,null,null,null,null,null,"","","","","","",null,null,null,null,null,null,null,null,null,null,null,null,"","","","","","","","","","","",""]
[null,52,null,null,{"$f":"SW!G61","v":0},null,null,null,null,null,null,null,null,null,null,null,null,"","","","","","",null,null,null,null,null,null,null,null,null,null,null,null,"","","","","","","","","","","",""]
[null,53,null,null,{"$f":"SW!G62","v":0},null,null,null,null,null,null,null,null,null,null,null,null,"","","","","","",null,null,null,null,null,null,null,null,null,null,null,null,"","","","","","","","","","","",""]
[null,54,null,null,{"$f":"SW!G63","v":0},null,null,null,null,null,null,null,null,null,null,null,null,"","","","","","",null,null,null,null,null,null,null,null,null,null,null,null,"","","","","","","","","","","",""]
[null,55,null,null,{"$f":"SW!G64","v":0},null,null,null,null,null,null,null,null,null,null,null,null,"","","","","","",null,null,null,null,null,null,null,null,null,null,null,null,"","","","","","","","","","","",""]
[null,56,null,null,{"$f":"SW!G65","v":0},null,null,null,null,null,null,null,null,null,null,null,null,"","","","","","",null,null,null,null,null,null,null,null,null,null,null,null,"","","","","","","","","","","",""]
[null,57,null,null,{"$f":"SW!G66","v":0},null,null,null,null,null,null,null,null,null,null,null,null,"","","","","","",null,null,null,null,null,null,null,null,null,null,null,null,"","","","","","","","","","","",""]
[null,58,null,null,{"$f":"SW!G67","v":0},null,null,null,null,null,null,null,null,null,null,null,null,"","","","","","",null,null,null,null,null,null,null,null,null,null,null,null,"","","","","","","","","","","",""]
[null,59,null,null,{"$f":"SW!G68","v":0},null,null,null,null,null,null,null,null,null,null,null,null,"","","","","","",null,null,null,null,null,null,null,null,null,null,null,null,"","","","","","","","","",{"$f":"IFERROR(ROUND(AVERAGE(U70+AM70),0),\"\")","v":""},"",""]
[null,60,null,null,{"$f":"SW!G69","v":0},null,null,null,null,null,null,null,null,null,null,null,null,"","","","","","",null,null,null,null,null,null,null,null,null,null,null,null,"","","","","","",{"$f":"IFERROR(ROUND(AVERAGE(R71+AJ71),0),\"\")","v":""},"","","","",""]
[null,61,null,null,{"$f":"SW!G70","v":0},null,null,null,null,null,null,null,null,null,null,null,null,"","","","","","",null,null,null,null,null,null,null,null,null,null,null,null,"","","","","","","","","","","",""]
[null,62,null,null,{"$f":"SW!G71","v":0},null,null,null,null,null,null,null,null,null,null,null,null,"","","","","","",null,null,null,null,null,null,null,null,null,null,null,null,"","","","","","","","","","","",""]
[null,63,null,null,{"$f":"SW!G72","v":0},null,null,null,null,null,null,null,null,null,null,null,null,"","","","","","",null,null,null,null,null,null,null,null,null,null,null,null,"","","","","","","","","","","",""]
[null,64,null,null,{"$f":"SW!G73","v":0},null,null,null,null,null,null,null,null,null,null,null,null,"","","","","","",null,null,null,null,null,null,null,null,null,null,null,null,"","","","","","","","","","","",""]
[null,65,null,null,{"$f":"SW!G74","v":0},null,null,null,null,null,null,null,null,null,null,null,null,"","","","","","",null,null,null,null,null,null,null,null,null,null,null,null,"","","","","","","","","","","",""]
[null,66,null,null,{"$f":"SW!G75","v":0},null,null,null,null,null,null,null,null,null,null,null,null,{"$f":"IFERROR(ROUND(AVERAGE(F77:G77)*$R$9,0),\"\")","v":""},{"$f":"IFERROR(ROUND(AVERAGE(H77:I77)*$R$9,0),\"\")","v":""},{"$f":"IFERROR(ROUND(AVERAGE(J77:K77)*$R$9,0),\"\")","v":""},{"$f":"IFERROR(ROUND(AVERAGE(L77:M77)*$R$9,0),\"\")","v":""},{"$f":"IFERROR(ROUND(AVERAGE(N77:O77)*$R$9,0),\"\")","v":""},{"$f":"IFERROR(ROUND(AVERAGE(P77:Q77)*$R$9,0),\"\")","v":""},null,null,null,null,null,null,null,null,null,null,null,null,{"$f":"IFERROR(ROUND(AVERAGE(X77:Y77)*$AJ$9,0),\"\")","v":""},{"$f":"IFERROR(ROUND(AVERAGE(Z77:AA77)*$AJ$9,0),\"\")","v":""},{"$f":"IFERROR(ROUND(AVERAGE(AB77:AC77)*$AJ$9,0),\"\")","v":""},{"$f":"IFERROR(ROUND(AVERAGE(AD77:AE77)*$AJ$9,0),\"\")","v":""},{"$f":"IFERROR(ROUND(AVERAGE(AF77:AG77)*$AJ$9,0),\"\")","v":""},{"$f":"IFERROR(ROUND(AVERAGE(AH77:AI77)*$AJ$9,0),\"\")","v":""},"","","","","",""]
[null,67,null,null,{"$f":"SW!G76","v":0},null,null,null,null,null,null,null,null,null,null,null,null,"","","","","","",null,null,null,null,null,null,null,null,null,null,null,null,"","","","","","","","","","","",""]
[null,68,null,null,{"$f":"SW!G77","v":0},null,null,null,null,null,null,null,null,null,null,null,null,"","","","","","",null,null,null,null,null,null,null,null,null,null,null,null,"","","","","","","","","","","",""]
[null,69,null,null,{"$f":"SW!G78","v":0},null,null,null,null,null,null,null,null,null,null,null,null,"","","","","","",null,null,null,null,null,null,null,null,null,null,null,null,"","","","","","","","","","","",""]
[null,70,null,null,{"$f":"SW!G79","v":0},null,null,null,null,null,null,null,null,null,null,null,null,"","","","","","",null,null,null,null,null,null,null,null,null,null,null,null,"","","","","","","","","","","",""]
[null,71,null,null,{"$f":"SW!G80","v":0},null,null,null,null,null,null,null,null,null,null,null,null,"","","","","","",null,null,null,null,null,null,null,null,null,null,null,null,"","","","","","","","","","","",""]
[null,72,null,null,{"$f":"SW!G81","v":0},null,null,null,null,null,null,null,null,null,null,null,null,"","","","","","",null,null,null,null,null,null,null,null,null,null,null,null,"","","","","","","","","","","",""]
[null,73,null,null,{"$f":"SW!G82","v":0},null,null,null,null,null,null,null,null,null,null,null,null,"","","","","","",null,null,null,null,null,null,null,null,null,null,null,null,"","","","","","","","","","","",""]
[null,74,null,null,{"$f":"SW!G83","v":0},null,null,null,null,null,null,null,null,null,null,null,null,"","","","","","",null,null,null,null,null,null,null,null,null,null,null,null,"","","","","","","","","","","",""]
[null,75,null,null,{"$f":"SW!G84","v":0},null,null,null,null,null,null,null,null,null,null,null,null,"","","","","","",null,null,null,null,null,null,null,null,null,null,null,null,"","","","","","","","","","","",""]
[null,76,null,null,{"$f":"SW!G85","v":0},null,null,null,null,null,null,null,null,null,null,null,null,"","","","","","",null,null,null,null,null,null,null,null,null,null,null,null,"","","","","","","","","","","",""]
[null,77,null,null,{"$f":"SW!G86","v":0},null,null,null,null,null,null,null,null,null,null,null,null,"","","","","","",null,null,null,null,null,null,null,null,null,null,null,null,"","","","","","","","","","","",""]
[null,78,null,null,{"$f":"SW!G87","v":0},null,null,null,null,null,null,null,null,null,null,null,null,"","","","","","",null,null,null,null,null,null,null,null,null,null,null,null,"","","","","","","","","","","",""]
[null,79,null,null,{"$f":"SW!G88","v":0},null,null,null,null,null,null,null,null,null,null,null,null,"","","","","","",null,null,null,null,null,null,null,null,null,null,null,null,"","","","","","","","","","","",""]
[null,80,null,null,{"$f":"SW!G89","v":0},null,null,null,null,null,null,null,null,null,null,null,null,"","","","","","",null,null,null,null,null,null,null,null,null,null,null,null,"","","","","","","","","","","",""]
[null,81,null,null,{"$f":"SW!G90","v":0},null,null,null,null,null,null,null,null,null,null,null,null,"","","","","","",null,null,null,null,null,null,null,null,null,null,null,null,"","","","","","","","","","","",""]
[null,82,null,null,{"$f":"SW!G91","v":0},null,null,null,null,null,null,null,null,null,null,null,null,"","","","","","",null,null,null,null,null,null,null,null,null,null,null,null,"","","","","","","","","","","",""]
[null,83,null,null,{"$f":"SW!G92","v":0},null,null,null,null,null,null,null,null,null,null,null,null,"","","","","","",null,null,null,null,null,null,null,null,null,null,null,null,"","","","","","","","","","","",""]
[null,84,null,null,{"$f":"SW!G93","v":0},null,null,null,null,null,null,null,null,null,null,null,null,"","","","","","",null,null,null,null,null,null,null,null,null,null,null,null,"","","","","","","","","","","",""]
[null,85,null,null,{"$f":"SW!G94","v":0},null,null,null,null,null,null,null,null,null,null,null,null,"","","","","","",null,null,null,null,null,null,null,null,null,null,null,null,"","","","","","","","","","","",""]
[null,86,null,null,{"$f":"SW!G95","v":0},null,null,null,null,null,null,null,null,null,null,null,null,"","","","","","",null,null,null,null,null,null,null,null,null,null,null,null,"","","","","","","","","","","",""]
[null,87,null,null,{"$f":"SW!G96","v":0},null,null,null,null,null,null,null,null,null,null,null,null,"","","","","","",null,null,null,null,null,null,null,null,null,null,null,null,"","","","","","","","","","","",""]
[null,88,null,null,{"$f":"SW!G97","v":0},null,null,null,null,null,null,null,null,null,null,null,null,"","","","","","",null,null,null,null,null,null,null,null,null,null,null,null,"","","","","","","","","","","",""]
[null,89,null,null,{"$f":"SW!G98","v":0},null,null,null,null,null,null,null,null,null,null,null,null,"","","","","","",null,null,null,null,null,null,null,null,null,null,null,null,"","","","","","","","","","","",""]

{"sheet":"T6","index":5,"n_rows":100,"n_cols":47,"rows_kept":100,"cut":false,"hidden":false,"merged":[[8,35,9,40],[8,41,9,46],[9,5,9,6],[9,7,9,8],[9,9,9,10],[9,11,9,12],[9,13,9,14],[9,31,9,32],[9,33,9,34],[9,15,9,16],[9,23,9,24],[9,25,9,26],[9,27,9,28],[9,29,9,30],[8,1,10,1],[8,4,10,4],[8,5,8,16],[8,17,9,22],[8,23,8,34],[1,1,1,46],[3,6,3,18],[3,42,5,45],[4,6,4,18],[5,6,5,18],[4,20,5,21],[4,23,5,24],[4,26,5,27],[4,29,5,30],[4,32,5,33],[4,35,5,36],[4,38,5,40]]}
[]
[null,"D A F T A R   N I L A I"]
[]
[null,"MATA PELAJARAN",null,null,null,":",{"$f":"RTM!AM5","v":"TEMA 6"},null,null,null,null,null,null,null,null,null,null,null,null,null,null,null,null,null,null,null,null,null,null,null,null,null,null,null,null,null,null,null,null,null,null,null,"۩MENU↗"]
[null,"KELAS",null,null,null,":",{"$f":"UPPER(MN!D22)","v":"V B"},null,null,null,null,null,null,null,null,null,null,null,null,null,"TEMA 1",null,null,"TEMA 2",null,null,"TEMA 3",null,null,"TEMA 4",null,null,"TEMA 5",null,null,"TEMA 6",null,null,"REKAP"]
[null,"TAHUN PELAJARAN",null,null,null,":",{"$f":"MN!D18","v":"2019 - 2020"}]
[]
[]
[null,"No",null,null,"Nama Siswa","NILAI PG",null,null,null,null,null,null,null,null,null,null,null,0.6,null,null,null,null,null,"NILAI ESSAY",null,null,null,null,null,null,null,null,null,null,null,{"$f":"100%-R9","v":0.4},null,null,null,null,null,"JUMLAH"]
[null,null,"No. Induk","NISN",null,"BIN",null,"MTK",null,"IPA",null,"PPKn",null,"IPS",null,"SBDP",null,null,null,null,null,null,null,"BIN",null,"MTK",null,"IPA",null,"PPKn",null,"IPS",null,"SBDP"]
[null,null,null,null,null,"Naskah 1","Naskah 2","Naskah 1","Naskah 2","Naskah 1","Naskah 2","Naskah 1","Naskah 2","Naskah 1","Naskah 2","Naskah 1","Naskah 2","BIN","MTK","IPA","PPKn","IPS","SBDP","Naskah 1","Naskah 2","Naskah 1","Naskah 2","Naskah 1","Naskah 2","Naskah 1","Naskah 2","Naskah 1","Naskah 2","Naskah 1","Naskah 2","BIN","MTK","IPA","PPKn","IPS","SBDP","BIN","MTK","IPA","PPKn","IPS","SBDP"]
[null,1,null,null,{"$f":"SW!G10","v":"ABD. ROCHMAN NAJA FATLAN PRATAMA"},null,null,null,null,null,null,null,null,null,null,null,null,{"$f":"IFERROR(ROUND(AVERAGE(F12:G12)*$R$9,0),\"\")","v":""},{"$f":"IFERROR(ROUND(AVERAGE(H12:I12)*$R$9,0),\"\")","v":""},{"$f":"IFERROR(ROUND(AVERAGE(J12:K12)*$R$9,0),\"\")","v":""},{"$f":"IFERROR(ROUND(AVERAGE(L12:M12)*$R$9,0),\"\")","v":""},{"$f":"IFERROR(ROUND(AVERAGE(N12:O12)*$R$9,0),\"\")","v":""},{"$f":"IFERROR(ROUND(AVERAGE(P12:Q12)*$R$9,0),\"\")","v":""},null,null,null,null,null,null,null,null,null,null,null,null,{"$f":"IFERROR(ROUND(AVERAGE(X12:Y12)*$AJ$9,0),\"\")","v":""},{"$f":"IFERROR(ROUND(AVERAGE(Z12:AA12)*$AJ$9,0),\"\")","v":""},{"$f":"IFERROR(ROUND(AVERAGE(AB12:AC12)*$AJ$9,0),\"\")","v":""},{"$f":"IFERROR(ROUND(AVERAGE(AD12:AE12)*$AJ$9,0),\"\")","v":""},{"$f":"IFERROR(ROUND(AVERAGE(AF12:AG12)*$AJ$9,0),\"\")","v":""},{"$f":"IFERROR(ROUND(AVERAGE(AH12:AI12)*$AJ$9,0),\"\")","v":""},{"$f":"IFERROR(ROUND(AVERAGE(R12+AJ12),0),\"\")","v":""},"","","","",""]
[null,2,null,null,{"$f":"SW!G11","v":"ABDURRAHMAN FAQIH"},null,null,null,null,null,null,null,null,null,null,null,null,{"$f":"IFERROR(ROUND(AVERAGE(F13:G13)*$R$9,0),\"\")","v":""},{"$f":"IFERROR(ROUND(AVERAGE(H13:I13)*$R$9,0),\"\")","v":""},{"$f":"IFERROR(ROUND(AVERAGE(J13:K13)*$R$9,0),\"\")","v":""},{"$f":"IFERROR(ROUND(AVERAGE(L13:M13)*$R$9,0),\"\")","v":""},{"$f":"IFERROR(ROUND(AVERAGE(N13:O13)*$R$9,0),\"\")","v":""},{"$f":"IFERROR(ROUND(AVERAGE(P13:Q13)*$R$9,0),\"\")","v":""},null,null,null,null,null,null,null,null,null,null,null,null,{"$f":"IFERROR(ROUND(AVERAGE(X13:Y13)*$AJ$9,0),\"\")","v":""},"",{"$f":"IFERROR(ROUND(AVERAGE(AB13:AC13)*$AJ$9,0),\"\")","v":""},{"$f":"IFERROR(ROUND(AVERAGE(AD13:AE13)*$AJ$9,0),\"\")","v":""},{"$f":"IFERROR(ROUND(AVERAGE(AF13:AG13)*$AJ$9,0),\"\")","v":""},{"$f":"IFERROR(ROUND(AVERAGE(AH13:AI13)*$AJ$9,0),\"\")","v":""},"","","","","",""]
[null,3,null,null,{"$f":"SW!G12","v":"ACHMAD FARROIHUN MUSHOBIRONILLAH"},null,null,null,null,null,null,null,null,null,null,null,null,"","","","","","",null,null,null,null,null,null,null,null,null,null,null,null,"","","","","","","","","","","",""]
[null,4,null,null,{"$f":"SW!G13","v":"ACHMAD HASBI ASSIDDIQI"},null,null,null,null,null,null,null,null,null,null,null,null,"","","","","","",null,null,null,null,null,null,null,null,null,null,null,null,"","","","","","","","","","","",""]
[null,5,null,null,{"$f":"SW!G14","v":"ACHMAD REZA AKRAM ALAUDDIN"},null,null,null,null,null,null,null,null,null,null,null,null,"","","","","","",null,null,null,null,null,null,null,null,null,null,null,null,"","","","","","","","","","","",""]
[null,6,null,null,{"$f":"SW!G15","v":"ACHMAD YANI"},null,null,null,null,null,null,null,null,null,null,null,null,"","","","","","",null,null,null,null,null,null,null,null,null,null,null,null,"","","","","","","","","","","",""]
[null,7,null,null,{"$f":"SW!G16","v":"AKHMAD RIDWAN"},null,null,null,null,null,null,null,null,null,null,null,null,"","","","","","",null,null,null,null,null,null,null,null,null,null,null,null,"","","","","","","","","","","",""]
[null,8,null,null,{"$f":"SW!G17","v":"ANDREAN DWI YULIANO"},null,null,null,null,null,null,null,null,null,null,null,null,"","","","","","",null,null,null,null,null,null,null,null,null,null,null,null,"","","","","","","","","","","",""]
[null,9,null,null,{"$f":"SW!G18","v":"ASFAN FAKHRI BARANI"},null,null,null,null,null,null,null,null,null,null,null,null,"","","","","","",null,null,null,null,null,null,null,null,null,null,null,null,"","","","","","","","","","","",""]
[null,10,null,null,{"$f":"SW!G19","v":"DEVAN ADITYA SAPUTRA"},null,null,null,null,null,null,null,null,null,null,null,null,"","","","","","",null,null,null,null,null,null,null,null,null,null,null,null,"","","","","","","","","","","",""]
[null,11,null,null,{"$f":"SW!G20","v":"FAHRUL AHMAD FAHREZA"},null,null,null,null,null,null,null,null,null,null,null,null,"","","","","","",null,null,null,null,null,null,null,null,null,null,null,null,"","","","","","","","","","","",""]
[null,12,null,null,{"$f":"SW!G21","v":"FAUZIA AMELIA PUTRI"},null,null,null,null,null,null,null,null,null,null,null,null,"","","","","","",null,null,null,null,null,null,null,null,null,null,null,null,"","","","","","","","","","","",""]
[null,13,null,null,{"$f":"SW!G22","v":"FAZA AZIFAH SALSABILA"},null,null,null,null,null,null,null,null,null,null,null,null,"","","","","","",null,null,null,null,null,null,null,null,null,null,null,null,"","","","","","","","","","","",""]
[null,14,null,null,{"$f":"SW!G23","v":"HABIBIE NURUSSALAM"},null,null,null,null,null,null,null,null,null,null,null,null,"","","","","","",null,null,null,null,null,null,null,null,null,null,null,null,"","","","","","","","","","","",""]
[null,15,null,null,{"$f":"SW!G24","v":"HIMATURROSYIDAH"},null,null,null,null,null,null,null,null,null,null,null,null,"","","","","","",null,null,null,null,null,null,null,null,null,null,null,null,"","","","","","","","","","","",""]
[null,16,null,null,{"$f":"SW!G25","v":"IFKARINA NAILA SAUQYA"},null,null,null,null,null,null,null,null,null,null,null,null,"","","","","","",null,null,null,null,null,null,null,null,null,null,null,null,"","","","","","","","","","","",""]
[null,17,null,null,{"$f":"SW!G26","v":"KEISA AYU SASKIYAH"},null,null,null,null,null,null,null,null,null,null,null,null,"","","","","","",null,null,null,null,null,null,null,null,null,null,null,null,"","","","","","",{"$f":"IFERROR(ROUND(AVERAGE(R28+AJ28),0),\"\")","v":""},"","","","",""]
[null,18,null,null,{"$f":"SW!G27","v":"MOCHAMMAD RENO FIRMANSYAH"},null,null,null,null,null,null,null,null,null,null,null,null,"","","","","","",null,null,null,null,null,null,null,null,null,null,null,null,"","","","","","","","","","","",""]
[null,19,null,null,{"$f":"SW!G28","v":"MOHAMAD NUR KHAFID KHABIBULLOH"},null,null,null,null,null,null,null,null,null,null,null,null,"","","","","","",null,null,null,null,null,null,null,null,null,null,null,null,"","","","","","","","","","","",""]
[null,20,null,null,{"$f":"SW!G29","v":"MOHAMMAD NAUFAL NAWWARUDDIN"},null,null,null,null,null,null,null,null,null,null,null,null,"","","","","","",null,null,null,null,null,null,null,null,null,null,null,null,"","","","","","","","","","","",""]
[null,21,null,null,{"$f":"SW!G30","v":"MUCHAMAD PRIMA PAMBUDI"},null,null,null,null,null,null,null,null,null,null,null,null,"","","","","","",null,null,null,null,null,null,null,null,null,null,null,null,"","","","","","","","","","","",""]
[null,22,null,null,{"$f":"SW!G31","v":"MUHAMMAD ALFAN FATHONI"},null,null,null,null,null,null,null,null,null,null,null,null,"","","","","","",null,null,null,null,null,null,null,null,null,null,null,null,"","","","","","","","","","","",""]
[null,23,null,null,{"$f":"SW!G32","v":"MUHAMMAD AMINULLAH MAULUDANI"},null,null,null,null,null,null,null,null,null,null,null,null,"","","","","","",null,null,null,null,null,null,null,null,null,null,null,null,"","","","","","","","","","","",""]
[null,24,null,null,{"$f":"SW!G33","v":"MUHAMMAD DAVIN  LEVANTINO"},null,null,null,null,null,null,null,null,null,null,null,null,"","","","","","",null,null,null,null,null,null,null,null,null,null,null,null,"","","","","","","","","","","",""]
[null,25,null,null,{"$f":"SW!G34","v":"MUHAMMAD MAULANA PAHLEVY"},null,null,null,null,null,null,null,null,null,null,null,null,"","","","","","",null,null,null,null,null,null,null,null,null,null,null,null,"","","","","","","","","","","",""]
[null,26,null,null,{"$f":"SW!G35","v":"RADITYA NIRWANSYAH"},null,null,null,null,null,null,null,null,null,null,null,null,"","","","","","",null,null,null,null,null,null,null,null,null,null,null,null,"","","","","","","","","","","",""]
[null,27,null,null,{"$f":"SW!G36","v":"REVINA SRI UTARI"},null,null,null,null,null,null,null,null,null,null,null,null,"","","","","","",null,null,null,null,null,null,null,null,null,null,null,null,"","","","","","","","","","","",""]
[null,28,null,null,{"$f":"SW!G37","v":"REYHAN DWI ANDIKA"},null,null,null,null,null,null,null,null,null,null,null,null,"","","","","","",null,null,null,null,null,null,null,null,null,null,null,null,"","","","","","","","","","","",""]
[null,29,null,null,{"$f":"SW!G38","v":"RISKA LAURA TRIA OCTAVIA"},null,null,null,null,null,null,null,null,null,null,null,null,"","","","","","",null,null,null,null,null,null,null,null,null,null,null,null,"","","","","","","","","","","",""]
[null,30,null,null,{"$f":"SW!G39","v":"ROHMADONA DWI SAFITRI"},null,null,null,null,null,null,null,null,null,null,null,null,"","","","","","",null,null,null,null,null,null,null,null,null,null,null,null,"","","","","","","","","","","",""]
[null,31,null,null,{"$f":"SW!G40","v":"SALMAN ALFARIZI"},null,null,null,null,null,null,null,null,null,null,null,null,"","","","","","",null,null,null,null,null,null,null,null,null,null,null,null,"","","","","","","","","","","",""]
[null,32,null,null,{"$f":"SW!G41","v":"TAUFIQ KURROHMAN"},null,null,null,null,null,null,null,null,null,null,null,null,"","","","","","",null,null,null,null,null,null,null,null,null,null,null,null,"","","","","","","","","","","",""]
[null,33,null,null,{"$f":"SW!G42","v":0},null,null,null,null,null,null,null,null,null,null,null,null,"","","","","","",null,null,null,null,null,null,null,null,null,null,null,null,"","","","","","","","","","","",""]
[null,34,null,null,{"$f":"SW!G43","v":0},null,null,null,null,null,null,null,null,null,null,null,null,"","","","","","",null,null,null,null,null,null,null,null,null,null,null,null,"","","","","","","","","","","",""]
[null,35,null,null,{"$f":"SW!G44","v":0},null,null,null,null,null,null,null,null,null,null,null,null,"","","","","","",null,null,null,null,null,null,null,null,null,null,null,null,"","","","","","","","","","","",""]
[null,36,null,null,{"$f":"SW!G45","v":0},null,null,null,null,null,null,null,null,null,null,null,null,"","","","","","",null,null,null,null,null,null,null,null,null,null,null,null,"","","","","","","","","","","",""]
[null,37,null,null,{"$f":"SW!G46","v":0},null,null,null,null,null,null,null,null,null,null,null,null,"","","","","","",null,null,null,null,null,null,null,null,null,null,null,null,"","","","","","","","","","","",""]
[null,38,null,null,{"$f":"SW!G47","v":0},null,null,null,null,null,null,null,null,null,null,null,null,"","","","","","",null,null,null,null,null,null,null,null,null,null,null,null,"","","","","","","","","","","",""]
[null,39,null,null,{"$f":"SW!G48","v":0},null,null,null,null,null,null,null,null,null,null,null,null,"","","","","","",null,null,null,null,null,null,null,null,null,null,null,null,"","","","","","","","","","","",""]
[null,40,null,null,{"$f":"SW!G49","v":0},null,null,null,null,null,null,null,null,null,null,null,null,"","","","","","",null,null,null,null,null,null,null,null,null,null,null,null,"","","","","","","","","","","",""]
[null,41,null,null,{"$f":"SW!G50","v":0},null,null,null,null,null,null,null,null,null,null,null,null,"","","","","","",null,null,null,null,null,null,null,null,null,null,null,null,"","","","","","","","","","","",""]
[null,42,null,null,{"$f":"SW!G51","v":0},null,null,null,null,null,null,null,null,null,null,null,null,"","","","","","",null,null,null,null,null,null,null,null,null,null,null,null,"","","","","","","","","","","",""]
[null,43,null,null,{"$f":"SW!G52","v":0},null,null,null,null,null,null,null,null,null,null,null,null,"","","","","","",null,null,null,null,null,null,null,null,null,null,null,null,"","","","","","","","","","","",""]
[null,44,null,null,{"$f":"SW!G53","v":0},null,null,null,null,null,null,null,null,null,null,null,null,"","","","","","",null,null,null,null,null,null,null,null,null,null,null,null,"","","","","","","","","","","",""]
[null,45,null,null,{"$f":"SW!G54","v":0},null,null,null,null,null,null,null,null,null,null,null,null,"","","","","","",null,null,null,null,null,null,null,null,null,null,null,null,"","","","","","","","","","","",""]
[null,46,null,null,{"$f":"SW!G55","v":0},null,null,null,null,null,null,null,null,null,null,null,null,"","","","","","",null,null,null,null,null,null,null,null,null,null,null,null,"","","","","","","","","","","",""]
[null,47,null,null,{"$f":"SW!G56","v":0},null,null,null,null,null,null,null,null,null,null,null,null,"","","","","","",null,null,null,null,null,null,null,null,null,null,null,null,"","","","","","","","","","","",""]
[null,48,null,null,{"$f":"SW!G57","v":0},null,null,null,null,null,null,null,null,null,null,null,null,"","","","","","",null,null,null,null,null,null,null,null,null,null,null,null,"","","","","","","","","","","",""]
[null,49,null,null,{"$f":"SW!G58","v":0},null,null,null,null,null,null,null,null,null,null,null,null,"","","","","","",null,null,null,null,null,null,null,null,null,null,null,null,"","","","","","","","","","","",""]
[null,50,null,null,{"$f":"SW!G59","v":0},null,null,null,null,null,null,null,null,null,null,null,null,"","","","","","",null,null,null,null,null,null,null,null,null,null,null,null,"","","","","","","","","","","",""]
[null,51,null,null,{"$f":"SW!G60","v":0},null,null,null,null,null,null,null,null,null,null,null,null,"","","","","","",null,null,null,null,null,null,null,null,null,null,null,null,"","","","","","","","","","","",""]
[null,52,null,null,{"$f":"SW!G61","v":0},null,null,null,null,null,null,null,null,null,null,null,null,"","","","","","",null,null,null,null,null,null,null,null,null,null,null,null,"","","","","","","","","","","",""]
[null,53,null,null,{"$f":"SW!G62","v":0},null,null,null,null,null,null,null,null,null,null,null,null,"","","","","","",null,null,null,null,null,null,null,null,null,null,null,null,"","","","","","","","","","","",""]
[null,54,null,null,{"$f":"SW!G63","v":0},null,null,null,null,null,null,null,null,null,null,null,null,"","","","","","",null,null,null,null,null,null,null,null,null,null,null,null,"","","","","","","","","","","",""]
[null,55,null,null,{"$f":"SW!G64","v":0},null,null,null,null,null,null,null,null,null,null,null,null,"","","","","","",null,null,null,null,null,null,null,null,null,null,null,null,"","","","","","","","","","","",""]
[null,56,null,null,{"$f":"SW!G65","v":0},null,null,null,null,null,null,null,null,null,null,null,null,"","","","","","",null,null,null,null,null,null,null,null,null,null,null,null,"","","","","","","","","","","",""]
[null,57,null,null,{"$f":"SW!G66","v":0},null,null,null,null,null,null,null,null,null,null,null,null,"","","","","","",null,null,null,null,null,null,null,null,null,null,null,null,"","","","","","","","","","","",""]
[null,58,null,null,{"$f":"SW!G67","v":0},null,null,null,null,null,null,null,null,null,null,null,null,"","","","","","",null,null,null,null,null,null,null,null,null,null,null,null,"","","","","","","","","","","",""]
[null,59,null,null,{"$f":"SW!G68","v":0},null,null,null,null,null,null,null,null,null,null,null,null,"","","","","","",null,null,null,null,null,null,null,null,null,null,null,null,"","","","","","","","","",{"$f":"IFERROR(ROUND(AVERAGE(U70+AM70),0),\"\")","v":""},"",""]
[null,60,null,null,{"$f":"SW!G69","v":0},null,null,null,null,null,null,null,null,null,null,null,null,"","","","","","",null,null,null,null,null,null,null,null,null,null,null,null,"","","","","","",{"$f":"IFERROR(ROUND(AVERAGE(R71+AJ71),0),\"\")","v":""},"","","","",""]
[null,61,null,null,{"$f":"SW!G70","v":0},null,null,null,null,null,null,null,null,null,null,null,null,"","","","","","",null,null,null,null,null,null,null,null,null,null,null,null,"","","","","","","","","","","",""]
[null,62,null,null,{"$f":"SW!G71","v":0},null,null,null,null,null,null,null,null,null,null,null,null,"","","","","","",null,null,null,null,null,null,null,null,null,null,null,null,"","","","","","","","","","","",""]
[null,63,null,null,{"$f":"SW!G72","v":0},null,null,null,null,null,null,null,null,null,null,null,null,"","","","","","",null,null,null,null,null,null,null,null,null,null,null,null,"","","","","","","","","","","",""]
[null,64,null,null,{"$f":"SW!G73","v":0},null,null,null,null,null,null,null,null,null,null,null,null,"","","","","","",null,null,null,null,null,null,null,null,null,null,null,null,"","","","","","","","","","","",""]
[null,65,null,null,{"$f":"SW!G74","v":0},null,null,null,null,null,null,null,null,null,null,null,null,"","","","","","",null,null,null,null,null,null,null,null,null,null,null,null,"","","","","","","","","","","",""]
[null,66,null,null,{"$f":"SW!G75","v":0},null,null,null,null,null,null,null,null,null,null,null,null,{"$f":"IFERROR(ROUND(AVERAGE(F77:G77)*$R$9,0),\"\")","v":""},{"$f":"IFERROR(ROUND(AVERAGE(H77:I77)*$R$9,0),\"\")","v":""},{"$f":"IFERROR(ROUND(AVERAGE(J77:K77)*$R$9,0),\"\")","v":""},{"$f":"IFERROR(ROUND(AVERAGE(L77:M77)*$R$9,0),\"\")","v":""},{"$f":"IFERROR(ROUND(AVERAGE(N77:O77)*$R$9,0),\"\")","v":""},{"$f":"IFERROR(ROUND(AVERAGE(P77:Q77)*$R$9,0),\"\")","v":""},null,null,null,null,null,null,null,null,null,null,null,null,{"$f":"IFERROR(ROUND(AVERAGE(X77:Y77)*$AJ$9,0),\"\")","v":""},{"$f":"IFERROR(ROUND(AVERAGE(Z77:AA77)*$AJ$9,0),\"\")","v":""},{"$f":"IFERROR(ROUND(AVERAGE(AB77:AC77)*$AJ$9,0),\"\")","v":""},{"$f":"IFERROR(ROUND(AVERAGE(AD77:AE77)*$AJ$9,0),\"\")","v":""},{"$f":"IFERROR(ROUND(AVERAGE(AF77:AG77)*$AJ$9,0),\"\")","v":""},{"$f":"IFERROR(ROUND(AVERAGE(AH77:AI77)*$AJ$9,0),\"\")","v":""},"","","","","",""]
[null,67,null,null,{"$f":"SW!G76","v":0},null,null,null,null,null,null,null,null,null,null,null,null,"","","","","","",null,null,null,null,null,null,null,null,null,null,null,null,"","","","","","","","","","","",""]
[null,68,null,null,{"$f":"SW!G77","v":0},null,null,null,null,null,null,null,null,null,null,null,null,"","","","","","",null,null,null,null,null,null,null,null,null,null,null,null,"","","","","","","","","","","",""]
[null,69,null,null,{"$f":"SW!G78","v":0},null,null,null,null,null,null,null,null,null,null,null,null,"","","","","","",null,null,null,null,null,null,null,null,null,null,null,null,"","","","","","","","","","","",""]
[null,70,null,null,{"$f":"SW!G79","v":0},null,null,null,null,null,null,null,null,null,null,null,null,"","","","","","",null,null,null,null,null,null,null,null,null,null,null,null,"","","","","","","","","","","",""]
[null,71,null,null,{"$f":"SW!G80","v":0},null,null,null,null,null,null,null,null,null,null,null,null,"","","","","","",null,null,null,null,null,null,null,null,null,null,null,null,"","","","","","","","","","","",""]
[null,72,null,null,{"$f":"SW!G81","v":0},null,null,null,null,null,null,null,null,null,null,null,null,"","","","","","",null,null,null,null,null,null,null,null,null,null,null,null,"","","","","","","","","","","",""]
[null,73,null,null,{"$f":"SW!G82","v":0},null,null,null,null,null,null,null,null,null,null,null,null,"","","","","","",null,null,null,null,null,null,null,null,null,null,null,null,"","","","","","","","","","","",""]
[null,74,null,null,{"$f":"SW!G83","v":0},null,null,null,null,null,null,null,null,null,null,null,null,"","","","","","",null,null,null,null,null,null,null,null,null,null,null,null,"","","","","","","","","","","",""]
[null,75,null,null,{"$f":"SW!G84","v":0},null,null,null,null,null,null,null,null,null,null,null,null,"","","","","","",null,null,null,null,null,null,null,null,null,null,null,null,"","","","","","","","","","","",""]
[null,76,null,null,{"$f":"SW!G85","v":0},null,null,null,null,null,null,null,null,null,null,null,null,"","","","","","",null,null,null,null,null,null,null,null,null,null,null,null,"","","","","","","","","","","",""]
[null,77,null,null,{"$f":"SW!G86","v":0},null,null,null,null,null,null,null,null,null,null,null,null,"","","","","","",null,null,null,null,null,null,null,null,null,null,null,null,"","","","","","","","","","","",""]
[null,78,null,null,{"$f":"SW!G87","v":0},null,null,null,null,null,null,null,null,null,null,null,null,"","","","","","",null,null,null,null,null,null,null,null,null,null,null,null,"","","","","","","","","","","",""]
[null,79,null,null,{"$f":"SW!G88","v":0},null,null,null,null,null,null,null,null,null,null,null,null,"","","","","","",null,null,null,null,null,null,null,null,null,null,null,null,"","","","","","","","","","","",""]
[null,80,null,null,{"$f":"SW!G89","v":0},null,null,null,null,null,null,null,null,null,null,null,null,"","","","","","",null,null,null,null,null,null,null,null,null,null,null,null,"","","","","","","","","","","",""]
[null,81,null,null,{"$f":"SW!G90","v":0},null,null,null,null,null,null,null,null,null,null,null,null,"","","","","","",null,null,null,null,null,null,null,null,null,null,null,null,"","","","","","","","","","","",""]
[null,82,null,null,{"$f":"SW!G91","v":0},null,null,null,null,null,null,null,null,null,null,null,null,"","","","","","",null,null,null,null,null,null,null,null,null,null,null,null,"","","","","","","","","","","",""]
[null,83,null,null,{"$f":"SW!G92","v":0},null,null,null,null,null,null,null,null,null,null,null,null,"","","","","","",null,null,null,null,null,null,null,null,null,null,null,null,"","","","","","","","","","","",""]
[null,84,null,null,{"$f":"SW!G93","v":0},null,null,null,null,null,null,null,null,null,null,null,null,"","","","","","",null,null,null,null,null,null,null,null,null,null,null,null,"","","","","","","","","","","",""]
[null,85,null,null,{"$f":"SW!G94","v":0},null,null,null,null,null,null,null,null,null,null,null,null,"","","","","","",null,null,null,null,null,null,null,null,null,null,null,null,"","","","","","","","","","","",""]
[null,86,null,null,{"$f":"SW!G95","v":0},null,null,null,null,null,null,null,null,null,null,null,null,"","","","","","",null,null,null,null,null,null,null,null,null,null,null,null,"","","","","","","","","","","",""]
[null,87,null,null,{"$f":"SW!G96","v":0},null,null,null,null,null,null,null,null,null,null,null,null,"","","","","","",null,null,null,null,null,null,null,null,null,null,null,null,"","","","","","","","","","","",""]
[null,88,null,null,{"$f":"SW!G97","v":0},null,null,null,null,null,null,null,null,null,null,null,null,"","","","","","",null,null,null,null,null,null,null,null,null,null,null,null,"","","","","","","","","","","",""]
[null,89,null,null,{"$f":"SW!G98","v":0},null,null,null,null,null,null,null,null,null,null,null,null,"","","","","","",null,null,null,null,null,null,null,null,null,null,null,null,"","","","","","","","","","","",""]

{"sheet":"RTM","index":6,"n_rows":99,"n_cols":47,"rows_kept":99,"cut":false,"hidden":false,"merged":[[4,38,5,39],[3,6,3,21],[4,6,4,21],[5,6,5,21],[8,41,8,46],[1,1,1,46],[8,1,9,1],[8,4,9,4],[8,5,8,10],[8,11,8,16],[8,17,8,22],[8,23,8,28],[8,29,8,34],[8,35,8,40],[3,42,5,45],[4,23,5,24],[4,26,5,27],[4,29,5,30],[4,32,5,33],[4,35,5,36]]}
[]
[null,"R E K A P I T U L A S I   D A F T A R   N I L A I"]
[]
[null,"MATA PELAJARAN",null,null,null,":",{"$f":"MN!H10","v":"TEMA"},null,null,null,null,null,null,null,null,null,null,null,null,null,null,null,null,null,null,null,null,null,null,null,null,null,null,null,null,null,null,null,null,null,null,null,"۩MENU↗"]
[null,"KELAS",null,null,null,":",{"$f":"UPPER(MN!D22)","v":"V B"},null,null,null,null,null,null,null,null,null,null,null,null,null,null,null,null,"TEMA 1",null,null,"TEMA 2",null,null,"TEMA 3",null,null,"TEMA 4",null,null,"TEMA 5",null,null,"TEMA 6"]
[null,"TAHUN PELAJARAN",null,null,null,":",{"$f":"MN!D18","v":"2019 - 2020"}]
[]
[]
[null,"No","No. Induk","NISN","Nama Siswa","BIN",null,null,null,null,null,"MTK",null,null,null,null,null,"IPA",null,null,null,null,null,"PPKn",null,null,null,null,null,"IPS",null,null,null,null,null,"SBDP",null,null,null,null,null,"RATA RATA"]
[null,null,null,null,null,"TEMA 1","TEMA 2","TEMA 3","TEMA 4","TEMA 5","TEMA 6","TEMA 1","TEMA 2","TEMA 3","TEMA 4","TEMA 5","TEMA 6","TEMA 1","TEMA 2","TEMA 3","TEMA 4","TEMA 5","TEMA 6","TEMA 1","TEMA 2","TEMA 3","TEMA 4","TEMA 5","TEMA 6","TEMA 1","TEMA 2","TEMA 3","TEMA 4","TEMA 5","TEMA 6","TEMA 1","TEMA 2","TEMA 3","TEMA 4","TEMA 5","TEMA 6","BIN","MTK","IPA","PPKn","IPS","SBDP"]
[null,1,null,null,{"$f":"SW!G10","v":"ABD. ROCHMAN NAJA FATLAN PRATAMA"},{"$f":"'T1'!AP12","v":55},{"$f":"'T2'!AP12","v":44},{"$f":"'T3'!AP12","v":29},{"$f":"'T4'!AP12","v":""},{"$f":"'T5'!AP12","v":""},{"$f":"'T6'!AP12","v":""},{"$f":"'T1'!AQ12","v":""},{"$f":"'T2'!AQ12","v":""},{"$f":"'T3'!AQ12","v":""},{"$f":"'T4'!AQ12","v":""},{"$f":"'T5'!AQ12","v":""},{"$f":"'T6'!AQ12","v":""},{"$f":"'T1'!AR12","v":55},{"$f":"'T2'!AR12","v":44},{"$f":"'T3'!AR12","v":29},{"$f":"'T4'!AR12","v":""},{"$f":"'T5'!AR12","v":""},{"$f":"'T6'!AR12","v":""},{"$f":"'T1'!AS12","v":55},{"$f":"'T2'!AS12","v":44},{"$f":"'T3'!AS12","v":29},{"$f":"'T4'!AS12","v":""},{"$f":"'T5'!AS12","v":""},{"$f":"'T6'!AS12","v":""},{"$f":"'T1'!AT12","v":55},{"$f":"'T2'!AT12","v":44},{"$f":"'T3'!AT12","v":29},{"$f":"'T4'!AT12","v":""},{"$f":"'T5'!AT12","v":""},{"$f":"'T6'!AT12","v":""},{"$f":"'T1'!AU12","v":55},{"$f":"'T2'!AU12","v":44},{"$f":"'T3'!AU12","v":29},{"$f":"'T4'!AU12","v":""},{"$f":"'T5'!AU12","v":""},{"$f":"'T6'!AU12","v":""},{"$f":"IFERROR(ROUND(AVERAGE(F11:K11),0),\"\")","v":43},{"$f":"IFERROR(ROUND(AVERAGE(L11:Q11),0),\"\")","v":""},{"$f":"IFERROR(ROUND(AVERAGE(R11:W11),0),\"\")","v":43},{"$f":"IFERROR(ROUND(AVERAGE(X11:AC11),0),\"\")","v":43},{"$f":"IFERROR(ROUND(AVERAGE(AD11:AI11),0),\"\")","v":43},{"$f":"IFERROR(ROUND(AVERAGE(AJ11:AO11),0),\"\")","v":43}]
[null,2,null,null,{"$f":"SW!G11","v":"ABDURRAHMAN FAQIH"},{"$f":"'T1'!AP13","v":48},{"$f":"'T2'!AP13","v":30},{"$f":"'T3'!AP13","v":34},{"$f":"'T4'!AP13","v":""},{"$f":"'T5'!AP13","v":""},{"$f":"'T6'!AP13","v":""},{"$f":"'T1'!AQ13","v":""},{"$f":"'T2'!AQ13","v":""},{"$f":"'T3'!AQ13","v":""},{"$f":"'T4'!AQ13","v":""},{"$f":"'T5'!AQ13","v":""},{"$f":"'T6'!AQ13","v":""},{"$f":"'T1'!AR13","v":48},{"$f":"'T2'!AR13","v":30},{"$f":"'T3'!AR13","v":34},{"$f":"'T4'!AR13","v":""},{"$f":"'T5'!AR13","v":""},{"$f":"'T6'!AR13","v":""},{"$f":"'T1'!AS13","v":48},{"$f":"'T2'!AS13","v":30},{"$f":"'T3'!AS13","v":34},{"$f":"'T4'!AS13","v":""},{"$f":"'T5'!AS13","v":""},{"$f":"'T6'!AS13","v":""},{"$f":"'T1'!AT13","v":48},{"$f":"'T2'!AT13","v":30},{"$f":"'T3'!AT13","v":34},{"$f":"'T4'!AT13","v":""},{"$f":"'T5'!AT13","v":""},{"$f":"'T6'!AT13","v":""},{"$f":"'T1'!AU13","v":48},{"$f":"'T2'!AU13","v":30},{"$f":"'T3'!AU13","v":34},{"$f":"'T4'!AU13","v":""},{"$f":"'T5'!AU13","v":""},{"$f":"'T6'!AU13","v":""},{"$f":"IFERROR(ROUND(AVERAGE(F12:K12),0),\"\")","v":37},{"$f":"IFERROR(ROUND(AVERAGE(L12:Q12),0),\"\")","v":""},{"$f":"IFERROR(ROUND(AVERAGE(R12:W12),0),\"\")","v":37},{"$f":"IFERROR(ROUND(AVERAGE(X12:AC12),0),\"\")","v":37},{"$f":"IFERROR(ROUND(AVERAGE(AD12:AI12),0),\"\")","v":37},{"$f":"IFERROR(ROUND(AVERAGE(AJ12:AO12),0),\"\")","v":37}]
[null,3,null,null,{"$f":"SW!G12","v":"ACHMAD FARROIHUN MUSHOBIRONILLAH"},{"$f":"'T1'!AP14","v":51},{"$f":"'T2'!AP14","v":64},{"$f":"'T3'!AP14","v":40},{"$f":"'T4'!AP14","v":""},{"$f":"'T5'!AP14","v":""},{"$f":"'T6'!AP14","v":""},{"$f":"'T1'!AQ14","v":""},{"$f":"'T2'!AQ14","v":""},{"$f":"'T3'!AQ14","v":""},{"$f":"'T4'!AQ14","v":""},{"$f":"'T5'!AQ14","v":""},{"$f":"'T6'!AQ14","v":""},{"$f":"'T1'!AR14","v":51},{"$f":"'T2'!AR14","v":64},{"$f":"'T3'!AR14","v":40},{"$f":"'T4'!AR14","v":""},{"$f":"'T5'!AR14","v":""},{"$f":"'T6'!AR14","v":""},{"$f":"'T1'!AS14","v":51},{"$f":"'T2'!AS14","v":64},{"$f":"'T3'!AS14","v":40},{"$f":"'T4'!AS14","v":""},{"$f":"'T5'!AS14","v":""},{"$f":"'T6'!AS14","v":""},{"$f":"'T1'!AT14","v":51},{"$f":"'T2'!AT14","v":64},{"$f":"'T3'!AT14","v":40},{"$f":"'T4'!AT14","v":""},{"$f":"'T5'!AT14","v":""},{"$f":"'T6'!AT14","v":""},{"$f":"'T1'!AU14","v":51},{"$f":"'T2'!AU14","v":64},{"$f":"'T3'!AU14","v":40},{"$f":"'T4'!AU14","v":""},{"$f":"'T5'!AU14","v":""},{"$f":"'T6'!AU14","v":""},52,"",52,52,52,52]
[null,4,null,null,{"$f":"SW!G13","v":"ACHMAD HASBI ASSIDDIQI"},{"$f":"'T1'!AP15","v":46},{"$f":"'T2'!AP15","v":45},{"$f":"'T3'!AP15","v":29},{"$f":"'T4'!AP15","v":""},{"$f":"'T5'!AP15","v":""},{"$f":"'T6'!AP15","v":""},{"$f":"'T1'!AQ15","v":""},{"$f":"'T2'!AQ15","v":""},{"$f":"'T3'!AQ15","v":""},{"$f":"'T4'!AQ15","v":""},{"$f":"'T5'!AQ15","v":""},{"$f":"'T6'!AQ15","v":""},{"$f":"'T1'!AR15","v":46},{"$f":"'T2'!AR15","v":45},{"$f":"'T3'!AR15","v":29},{"$f":"'T4'!AR15","v":""},{"$f":"'T5'!AR15","v":""},{"$f":"'T6'!AR15","v":""},{"$f":"'T1'!AS15","v":46},{"$f":"'T2'!AS15","v":45},{"$f":"'T3'!AS15","v":29},{"$f":"'T4'!AS15","v":""},{"$f":"'T5'!AS15","v":""},{"$f":"'T6'!AS15","v":""},{"$f":"'T1'!AT15","v":46},{"$f":"'T2'!AT15","v":45},{"$f":"'T3'!AT15","v":29},{"$f":"'T4'!AT15","v":""},{"$f":"'T5'!AT15","v":""},{"$f":"'T6'!AT15","v":""},{"$f":"'T1'!AU15","v":46},{"$f":"'T2'!AU15","v":45},{"$f":"'T3'!AU15","v":29},{"$f":"'T4'!AU15","v":""},{"$f":"'T5'!AU15","v":""},{"$f":"'T6'!AU15","v":""},40,"",40,40,40,40]
[null,5,null,null,{"$f":"SW!G14","v":"ACHMAD REZA AKRAM ALAUDDIN"},{"$f":"'T1'!AP16","v":69},{"$f":"'T2'!AP16","v":66},{"$f":"'T3'!AP16","v":61},{"$f":"'T4'!AP16","v":""},{"$f":"'T5'!AP16","v":""},{"$f":"'T6'!AP16","v":""},{"$f":"'T1'!AQ16","v":""},{"$f":"'T2'!AQ16","v":""},{"$f":"'T3'!AQ16","v":""},{"$f":"'T4'!AQ16","v":""},{"$f":"'T5'!AQ16","v":""},{"$f":"'T6'!AQ16","v":""},{"$f":"'T1'!AR16","v":69},{"$f":"'T2'!AR16","v":66},{"$f":"'T3'!AR16","v":61},{"$f":"'T4'!AR16","v":""},{"$f":"'T5'!AR16","v":""},{"$f":"'T6'!AR16","v":""},{"$f":"'T1'!AS16","v":69},{"$f":"'T2'!AS16","v":66},{"$f":"'T3'!AS16","v":61},{"$f":"'T4'!AS16","v":""},{"$f":"'T5'!AS16","v":""},{"$f":"'T6'!AS16","v":""},{"$f":"'T1'!AT16","v":69},{"$f":"'T2'!AT16","v":66},{"$f":"'T3'!AT16","v":61},{"$f":"'T4'!AT16","v":""},{"$f":"'T5'!AT16","v":""},{"$f":"'T6'!AT16","v":""},{"$f":"'T1'!AU16","v":69},{"$f":"'T2'!AU16","v":66},{"$f":"'T3'!AU16","v":61},{"$f":"'T4'!AU16","v":""},{"$f":"'T5'!AU16","v":""},{"$f":"'T6'!AU16","v":""},65,"",65,65,65,65]
[null,6,null,null,{"$f":"SW!G15","v":"ACHMAD YANI"},{"$f":"'T1'!AP17","v":46},{"$f":"'T2'!AP17","v":62},{"$f":"'T3'!AP17","v":50},{"$f":"'T4'!AP17","v":""},{"$f":"'T5'!AP17","v":""},{"$f":"'T6'!AP17","v":""},{"$f":"'T1'!AQ17","v":""},{"$f":"'T2'!AQ17","v":""},{"$f":"'T3'!AQ17","v":""},{"$f":"'T4'!AQ17","v":""},{"$f":"'T5'!AQ17","v":""},{"$f":"'T6'!AQ17","v":""},{"$f":"'T1'!AR17","v":46},{"$f":"'T2'!AR17","v":62},{"$f":"'T3'!AR17","v":50},{"$f":"'T4'!AR17","v":""},{"$f":"'T5'!AR17","v":""},{"$f":"'T6'!AR17","v":""},{"$f":"'T1'!AS17","v":46},{"$f":"'T2'!AS17","v":62},{"$f":"'T3'!AS17","v":50},{"$f":"'T4'!AS17","v":""},{"$f":"'T5'!AS17","v":""},{"$f":"'T6'!AS17","v":""},{"$f":"'T1'!AT17","v":46},{"$f":"'T2'!AT17","v":62},{"$f":"'T3'!AT17","v":50},{"$f":"'T4'!AT17","v":""},{"$f":"'T5'!AT17","v":""},{"$f":"'T6'!AT17","v":""},{"$f":"'T1'!AU17","v":46},{"$f":"'T2'!AU17","v":62},{"$f":"'T3'!AU17","v":50},{"$f":"'T4'!AU17","v":""},{"$f":"'T5'!AU17","v":""},{"$f":"'T6'!AU17","v":""},53,"",53,53,53,53]
[null,7,null,null,{"$f":"SW!G16","v":"AKHMAD RIDWAN"},{"$f":"'T1'!AP18","v":58},{"$f":"'T2'!AP18","v":72},{"$f":"'T3'!AP18","v":53},{"$f":"'T4'!AP18","v":""},{"$f":"'T5'!AP18","v":""},{"$f":"'T6'!AP18","v":""},{"$f":"'T1'!AQ18","v":""},{"$f":"'T2'!AQ18","v":""},{"$f":"'T3'!AQ18","v":""},{"$f":"'T4'!AQ18","v":""},{"$f":"'T5'!AQ18","v":""},{"$f":"'T6'!AQ18","v":""},{"$f":"'T1'!AR18","v":58},{"$f":"'T2'!AR18","v":72},{"$f":"'T3'!AR18","v":53},{"$f":"'T4'!AR18","v":""},{"$f":"'T5'!AR18","v":""},{"$f":"'T6'!AR18","v":""},{"$f":"'T1'!AS18","v":58},{"$f":"'T2'!AS18","v":72},{"$f":"'T3'!AS18","v":53},{"$f":"'T4'!AS18","v":""},{"$f":"'T5'!AS18","v":""},{"$f":"'T6'!AS18","v":""},{"$f":"'T1'!AT18","v":58},{"$f":"'T2'!AT18","v":72},{"$f":"'T3'!AT18","v":53},{"$f":"'T4'!AT18","v":""},{"$f":"'T5'!AT18","v":""},{"$f":"'T6'!AT18","v":""},{"$f":"'T1'!AU18","v":58},{"$f":"'T2'!AU18","v":72},{"$f":"'T3'!AU18","v":53},{"$f":"'T4'!AU18","v":""},{"$f":"'T5'!AU18","v":""},{"$f":"'T6'!AU18","v":""},61,"",61,61,61,61]
[null,8,null,null,{"$f":"SW!G17","v":"ANDREAN DWI YULIANO"},{"$f":"'T1'!AP19","v":48},{"$f":"'T2'!AP19","v":49},{"$f":"'T3'!AP19","v":39},{"$f":"'T4'!AP19","v":""},{"$f":"'T5'!AP19","v":""},{"$f":"'T6'!AP19","v":""},{"$f":"'T1'!AQ19","v":""},{"$f":"'T2'!AQ19","v":""},{"$f":"'T3'!AQ19","v":""},{"$f":"'T4'!AQ19","v":""},{"$f":"'T5'!AQ19","v":""},{"$f":"'T6'!AQ19","v":""},{"$f":"'T1'!AR19","v":48},{"$f":"'T2'!AR19","v":49},{"$f":"'T3'!AR19","v":39},{"$f":"'T4'!AR19","v":""},{"$f":"'T5'!AR19","v":""},{"$f":"'T6'!AR19","v":""},{"$f":"'T1'!AS19","v":48},{"$f":"'T2'!AS19","v":49},{"$f":"'T3'!AS19","v":39},{"$f":"'T4'!AS19","v":""},{"$f":"'T5'!AS19","v":""},{"$f":"'T6'!AS19","v":""},{"$f":"'T1'!AT19","v":48},{"$f":"'T2'!AT19","v":49},{"$f":"'T3'!AT19","v":39},{"$f":"'T4'!AT19","v":""},{"$f":"'T5'!AT19","v":""},{"$f":"'T6'!AT19","v":""},{"$f":"'T1'!AU19","v":48},{"$f":"'T2'!AU19","v":49},{"$f":"'T3'!AU19","v":39},{"$f":"'T4'!AU19","v":""},{"$f":"'T5'!AU19","v":""},{"$f":"'T6'!AU19","v":""},45,"",45,45,45,45]
[null,9,null,null,{"$f":"SW!G18","v":"ASFAN FAKHRI BARANI"},{"$f":"'T1'!AP20","v":66},{"$f":"'T2'!AP20","v":57},{"$f":"'T3'!AP20","v":49},{"$f":"'T4'!AP20","v":""},{"$f":"'T5'!AP20","v":""},{"$f":"'T6'!AP20","v":""},{"$f":"'T1'!AQ20","v":""},{"$f":"'T2'!AQ20","v":""},{"$f":"'T3'!AQ20","v":""},{"$f":"'T4'!AQ20","v":""},{"$f":"'T5'!AQ20","v":""},{"$f":"'T6'!AQ20","v":""},{"$f":"'T1'!AR20","v":66},{"$f":"'T2'!AR20","v":57},{"$f":"'T3'!AR20","v":49},{"$f":"'T4'!AR20","v":""},{"$f":"'T5'!AR20","v":""},{"$f":"'T6'!AR20","v":""},{"$f":"'T1'!AS20","v":66},{"$f":"'T2'!AS20","v":57},{"$f":"'T3'!AS20","v":49},{"$f":"'T4'!AS20","v":""},{"$f":"'T5'!AS20","v":""},{"$f":"'T6'!AS20","v":""},{"$f":"'T1'!AT20","v":66},{"$f":"'T2'!AT20","v":57},{"$f":"'T3'!AT20","v":49},{"$f":"'T4'!AT20","v":""},{"$f":"'T5'!AT20","v":""},{"$f":"'T6'!AT20","v":""},{"$f":"'T1'!AU20","v":66},{"$f":"'T2'!AU20","v":57},{"$f":"'T3'!AU20","v":49},{"$f":"'T4'!AU20","v":""},{"$f":"'T5'!AU20","v":""},{"$f":"'T6'!AU20","v":""},57,"",57,57,57,57]
[null,10,null,null,{"$f":"SW!G19","v":"DEVAN ADITYA SAPUTRA"},{"$f":"'T1'!AP21","v":55},{"$f":"'T2'!AP21","v":60},{"$f":"'T3'!AP21","v":57},{"$f":"'T4'!AP21","v":""},{"$f":"'T5'!AP21","v":""},{"$f":"'T6'!AP21","v":""},{"$f":"'T1'!AQ21","v":""},{"$f":"'T2'!AQ21","v":""},{"$f":"'T3'!AQ21","v":""},{"$f":"'T4'!AQ21","v":""},{"$f":"'T5'!AQ21","v":""},{"$f":"'T6'!AQ21","v":""},{"$f":"'T1'!AR21","v":55},{"$f":"'T2'!AR21","v":60},{"$f":"'T3'!AR21","v":57},{"$f":"'T4'!AR21","v":""},{"$f":"'T5'!AR21","v":""},{"$f":"'T6'!AR21","v":""},{"$f":"'T1'!AS21","v":55},{"$f":"'T2'!AS21","v":60},{"$f":"'T3'!AS21","v":57},{"$f":"'T4'!AS21","v":""},{"$f":"'T5'!AS21","v":""},{"$f":"'T6'!AS21","v":""},{"$f":"'T1'!AT21","v":55},{"$f":"'T2'!AT21","v":60},{"$f":"'T3'!AT21","v":57},{"$f":"'T4'!AT21","v":""},{"$f":"'T5'!AT21","v":""},{"$f":"'T6'!AT21","v":""},{"$f":"'T1'!AU21","v":55},{"$f":"'T2'!AU21","v":60},{"$f":"'T3'!AU21","v":57},{"$f":"'T4'!AU21","v":""},{"$f":"'T5'!AU21","v":""},{"$f":"'T6'!AU21","v":""},57,"",57,57,57,57]
[null,11,null,null,{"$f":"SW!G20","v":"FAHRUL AHMAD FAHREZA"},{"$f":"'T1'!AP22","v":53},{"$f":"'T2'!AP22","v":76},{"$f":"'T3'!AP22","v":52},{"$f":"'T4'!AP22","v":""},{"$f":"'T5'!AP22","v":""},{"$f":"'T6'!AP22","v":""},{"$f":"'T1'!AQ22","v":""},{"$f":"'T2'!AQ22","v":""},{"$f":"'T3'!AQ22","v":""},{"$f":"'T4'!AQ22","v":""},{"$f":"'T5'!AQ22","v":""},{"$f":"'T6'!AQ22","v":""},{"$f":"'T1'!AR22","v":53},{"$f":"'T2'!AR22","v":76},{"$f":"'T3'!AR22","v":52},{"$f":"'T4'!AR22","v":""},{"$f":"'T5'!AR22","v":""},{"$f":"'T6'!AR22","v":""},{"$f":"'T1'!AS22","v":53},{"$f":"'T2'!AS22","v":76},{"$f":"'T3'!AS22","v":52},{"$f":"'T4'!AS22","v":""},{"$f":"'T5'!AS22","v":""},{"$f":"'T6'!AS22","v":""},{"$f":"'T1'!AT22","v":53},{"$f":"'T2'!AT22","v":76},{"$f":"'T3'!AT22","v":52},{"$f":"'T4'!AT22","v":""},{"$f":"'T5'!AT22","v":""},{"$f":"'T6'!AT22","v":""},{"$f":"'T1'!AU22","v":53},{"$f":"'T2'!AU22","v":76},{"$f":"'T3'!AU22","v":52},{"$f":"'T4'!AU22","v":""},{"$f":"'T5'!AU22","v":""},{"$f":"'T6'!AU22","v":""},60,"",60,60,60,60]
[null,12,null,null,{"$f":"SW!G21","v":"FAUZIA AMELIA PUTRI"},{"$f":"'T1'!AP23","v":58},{"$f":"'T2'!AP23","v":71},{"$f":"'T3'!AP23","v":48},{"$f":"'T4'!AP23","v":""},{"$f":"'T5'!AP23","v":""},{"$f":"'T6'!AP23","v":""},{"$f":"'T1'!AQ23","v":""},{"$f":"'T2'!AQ23","v":""},{"$f":"'T3'!AQ23","v":""},{"$f":"'T4'!AQ23","v":""},{"$f":"'T5'!AQ23","v":""},{"$f":"'T6'!AQ23","v":""},{"$f":"'T1'!AR23","v":58},{"$f":"'T2'!AR23","v":71},{"$f":"'T3'!AR23","v":48},{"$f":"'T4'!AR23","v":""},{"$f":"'T5'!AR23","v":""},{"$f":"'T6'!AR23","v":""},{"$f":"'T1'!AS23","v":58},{"$f":"'T2'!AS23","v":71},{"$f":"'T3'!AS23","v":48},{"$f":"'T4'!AS23","v":""},{"$f":"'T5'!AS23","v":""},{"$f":"'T6'!AS23","v":""},{"$f":"'T1'!AT23","v":58},{"$f":"'T2'!AT23","v":71},{"$f":"'T3'!AT23","v":48},{"$f":"'T4'!AT23","v":""},{"$f":"'T5'!AT23","v":""},{"$f":"'T6'!AT23","v":""},{"$f":"'T1'!AU23","v":58},{"$f":"'T2'!AU23","v":71},{"$f":"'T3'!AU23","v":48},{"$f":"'T4'!AU23","v":""},{"$f":"'T5'!AU23","v":""},{"$f":"'T6'!AU23","v":""},59,"",59,59,59,59]
[null,13,null,null,{"$f":"SW!G22","v":"FAZA AZIFAH SALSABILA"},{"$f":"'T1'!AP24","v":52},{"$f":"'T2'!AP24","v":58},{"$f":"'T3'!AP24","v":44},{"$f":"'T4'!AP24","v":""},{"$f":"'T5'!AP24","v":""},{"$f":"'T6'!AP24","v":""},{"$f":"'T1'!AQ24","v":""},{"$f":"'T2'!AQ24","v":""},{"$f":"'T3'!AQ24","v":""},{"$f":"'T4'!AQ24","v":""},{"$f":"'T5'!AQ24","v":""},{"$f":"'T6'!AQ24","v":""},{"$f":"'T1'!AR24","v":52},{"$f":"'T2'!AR24","v":58},{"$f":"'T3'!AR24","v":44},{"$f":"'T4'!AR24","v":""},{"$f":"'T5'!AR24","v":""},{"$f":"'T6'!AR24","v":""},{"$f":"'T1'!AS24","v":52},{"$f":"'T2'!AS24","v":58},{"$f":"'T3'!AS24","v":44},{"$f":"'T4'!AS24","v":""},{"$f":"'T5'!AS24","v":""},{"$f":"'T6'!AS24","v":""},{"$f":"'T1'!AT24","v":52},{"$f":"'T2'!AT24","v":58},{"$f":"'T3'!AT24","v":44},{"$f":"'T4'!AT24","v":""},{"$f":"'T5'!AT24","v":""},{"$f":"'T6'!AT24","v":""},{"$f":"'T1'!AU24","v":52},{"$f":"'T2'!AU24","v":58},{"$f":"'T3'!AU24","v":44},{"$f":"'T4'!AU24","v":""},{"$f":"'T5'!AU24","v":""},{"$f":"'T6'!AU24","v":""},51,"",51,51,51,51]
[null,14,null,null,{"$f":"SW!G23","v":"HABIBIE NURUSSALAM"},{"$f":"'T1'!AP25","v":56},{"$f":"'T2'!AP25","v":61},{"$f":"'T3'!AP25","v":52},{"$f":"'T4'!AP25","v":""},{"$f":"'T5'!AP25","v":""},{"$f":"'T6'!AP25","v":""},{"$f":"'T1'!AQ25","v":""},{"$f":"'T2'!AQ25","v":""},{"$f":"'T3'!AQ25","v":""},{"$f":"'T4'!AQ25","v":""},{"$f":"'T5'!AQ25","v":""},{"$f":"'T6'!AQ25","v":""},{"$f":"'T1'!AR25","v":56},{"$f":"'T2'!AR25","v":61},{"$f":"'T3'!AR25","v":52},{"$f":"'T4'!AR25","v":""},{"$f":"'T5'!AR25","v":""},{"$f":"'T6'!AR25","v":""},{"$f":"'T1'!AS25","v":56},{"$f":"'T2'!AS25","v":61},{"$f":"'T3'!AS25","v":52},{"$f":"'T4'!AS25","v":""},{"$f":"'T5'!AS25","v":""},{"$f":"'T6'!AS25","v":""},{"$f":"'T1'!AT25","v":56},{"$f":"'T2'!AT25","v":61},{"$f":"'T3'!AT25","v":52},{"$f":"'T4'!AT25","v":""},{"$f":"'T5'!AT25","v":""},{"$f":"'T6'!AT25","v":""},{"$f":"'T1'!AU25","v":56},{"$f":"'T2'!AU25","v":61},{"$f":"'T3'!AU25","v":52},{"$f":"'T4'!AU25","v":""},{"$f":"'T5'!AU25","v":""},{"$f":"'T6'!AU25","v":""},56,"",56,56,56,56]
[null,15,null,null,{"$f":"SW!G24","v":"HIMATURROSYIDAH"},{"$f":"'T1'!AP26","v":55},{"$f":"'T2'!AP26","v":72},{"$f":"'T3'!AP26","v":51},{"$f":"'T4'!AP26","v":""},{"$f":"'T5'!AP26","v":""},{"$f":"'T6'!AP26","v":""},{"$f":"'T1'!AQ26","v":""},{"$f":"'T2'!AQ26","v":""},{"$f":"'T3'!AQ26","v":""},{"$f":"'T4'!AQ26","v":""},{"$f":"'T5'!AQ26","v":""},{"$f":"'T6'!AQ26","v":""},{"$f":"'T1'!AR26","v":55},{"$f":"'T2'!AR26","v":72},{"$f":"'T3'!AR26","v":51},{"$f":"'T4'!AR26","v":""},{"$f":"'T5'!AR26","v":""},{"$f":"'T6'!AR26","v":""},{"$f":"'T1'!AS26","v":55},{"$f":"'T2'!AS26","v":72},{"$f":"'T3'!AS26","v":51},{"$f":"'T4'!AS26","v":""},{"$f":"'T5'!AS26","v":""},{"$f":"'T6'!AS26","v":""},{"$f":"'T1'!AT26","v":55},{"$f":"'T2'!AT26","v":72},{"$f":"'T3'!AT26","v":51},{"$f":"'T4'!AT26","v":""},{"$f":"'T5'!AT26","v":""},{"$f":"'T6'!AT26","v":""},{"$f":"'T1'!AU26","v":55},{"$f":"'T2'!AU26","v":72},{"$f":"'T3'!AU26","v":51},{"$f":"'T4'!AU26","v":""},{"$f":"'T5'!AU26","v":""},{"$f":"'T6'!AU26","v":""},59,"",59,59,59,59]
[null,16,null,null,{"$f":"SW!G25","v":"IFKARINA NAILA SAUQYA"},{"$f":"'T1'!AP27","v":68},{"$f":"'T2'!AP27","v":72},{"$f":"'T3'!AP27","v":60},{"$f":"'T4'!AP27","v":""},{"$f":"'T5'!AP27","v":""},{"$f":"'T6'!AP27","v":""},{"$f":"'T1'!AQ27","v":""},{"$f":"'T2'!AQ27","v":""},{"$f":"'T3'!AQ27","v":""},{"$f":"'T4'!AQ27","v":""},{"$f":"'T5'!AQ27","v":""},{"$f":"'T6'!AQ27","v":""},{"$f":"'T1'!AR27","v":68},{"$f":"'T2'!AR27","v":72},{"$f":"'T3'!AR27","v":60},{"$f":"'T4'!AR27","v":""},{"$f":"'T5'!AR27","v":""},{"$f":"'T6'!AR27","v":""},{"$f":"'T1'!AS27","v":68},{"$f":"'T2'!AS27","v":72},{"$f":"'T3'!AS27","v":60},{"$f":"'T4'!AS27","v":""},{"$f":"'T5'!AS27","v":""},{"$f":"'T6'!AS27","v":""},{"$f":"'T1'!AT27","v":68},{"$f":"'T2'!AT27","v":72},{"$f":"'T3'!AT27","v":60},{"$f":"'T4'!AT27","v":""},{"$f":"'T5'!AT27","v":""},{"$f":"'T6'!AT27","v":""},{"$f":"'T1'!AU27","v":68},{"$f":"'T2'!AU27","v":72},{"$f":"'T3'!AU27","v":60},{"$f":"'T4'!AU27","v":""},{"$f":"'T5'!AU27","v":""},{"$f":"'T6'!AU27","v":""},67,"",67,67,67,67]
[null,17,null,null,{"$f":"SW!G26","v":"KEISA AYU SASKIYAH"},{"$f":"'T1'!AP28","v":50},{"$f":"'T2'!AP28","v":52},{"$f":"'T3'!AP28","v":38},{"$f":"'T4'!AP28","v":""},{"$f":"'T5'!AP28","v":""},{"$f":"'T6'!AP28","v":""},{"$f":"'T1'!AQ28","v":""},{"$f":"'T2'!AQ28","v":""},{"$f":"'T3'!AQ28","v":""},{"$f":"'T4'!AQ28","v":""},{"$f":"'T5'!AQ28","v":""},{"$f":"'T6'!AQ28","v":""},{"$f":"'T1'!AR28","v":50},{"$f":"'T2'!AR28","v":52},{"$f":"'T3'!AR28","v":38},{"$f":"'T4'!AR28","v":""},{"$f":"'T5'!AR28","v":""},{"$f":"'T6'!AR28","v":""},{"$f":"'T1'!AS28","v":50},{"$f":"'T2'!AS28","v":52},{"$f":"'T3'!AS28","v":38},{"$f":"'T4'!AS28","v":""},{"$f":"'T5'!AS28","v":""},{"$f":"'T6'!AS28","v":""},{"$f":"'T1'!AT28","v":50},{"$f":"'T2'!AT28","v":52},{"$f":"'T3'!AT28","v":38},{"$f":"'T4'!AT28","v":""},{"$f":"'T5'!AT28","v":""},{"$f":"'T6'!AT28","v":""},{"$f":"'T1'!AU28","v":50},{"$f":"'T2'!AU28","v":52},{"$f":"'T3'!AU28","v":38},{"$f":"'T4'!AU28","v":""},{"$f":"'T5'!AU28","v":""},{"$f":"'T6'!AU28","v":""},47,"",47,47,47,47]
[null,18,null,null,{"$f":"SW!G27","v":"MOCHAMMAD RENO FIRMANSYAH"},{"$f":"'T1'!AP29","v":35},{"$f":"'T2'!AP29","v":35},{"$f":"'T3'!AP29","v":32},{"$f":"'T4'!AP29","v":""},{"$f":"'T5'!AP29","v":""},{"$f":"'T6'!AP29","v":""},{"$f":"'T1'!AQ29","v":""},{"$f":"'T2'!AQ29","v":""},{"$f":"'T3'!AQ29","v":""},{"$f":"'T4'!AQ29","v":""},{"$f":"'T5'!AQ29","v":""},{"$f":"'T6'!AQ29","v":""},{"$f":"'T1'!AR29","v":35},{"$f":"'T2'!AR29","v":35},{"$f":"'T3'!AR29","v":32},{"$f":"'T4'!AR29","v":""},{"$f":"'T5'!AR29","v":""},{"$f":"'T6'!AR29","v":""},{"$f":"'T1'!AS29","v":35},{"$f":"'T2'!AS29","v":35},{"$f":"'T3'!AS29","v":32},{"$f":"'T4'!AS29","v":""},{"$f":"'T5'!AS29","v":""},{"$f":"'T6'!AS29","v":""},{"$f":"'T1'!AT29","v":35},{"$f":"'T2'!AT29","v":35},{"$f":"'T3'!AT29","v":32},{"$f":"'T4'!AT29","v":""},{"$f":"'T5'!AT29","v":""},{"$f":"'T6'!AT29","v":""},{"$f":"'T1'!AU29","v":35},{"$f":"'T2'!AU29","v":35},{"$f":"'T3'!AU29","v":32},{"$f":"'T4'!AU29","v":""},{"$f":"'T5'!AU29","v":""},{"$f":"'T6'!AU29","v":""},34,"",34,34,34,34]
[null,19,null,null,{"$f":"SW!G28","v":"MOHAMAD NUR KHAFID KHABIBULLOH"},{"$f":"'T1'!AP30","v":48},{"$f":"'T2'!AP30","v":68},{"$f":"'T3'!AP30","v":54},{"$f":"'T4'!AP30","v":""},{"$f":"'T5'!AP30","v":""},{"$f":"'T6'!AP30","v":""},{"$f":"'T1'!AQ30","v":""},{"$f":"'T2'!AQ30","v":""},{"$f":"'T3'!AQ30","v":""},{"$f":"'T4'!AQ30","v":""},{"$f":"'T5'!AQ30","v":""},{"$f":"'T6'!AQ30","v":""},{"$f":"'T1'!AR30","v":48},{"$f":"'T2'!AR30","v":68},{"$f":"'T3'!AR30","v":54},{"$f":"'T4'!AR30","v":""},{"$f":"'T5'!AR30","v":""},{"$f":"'T6'!AR30","v":""},{"$f":"'T1'!AS30","v":48},{"$f":"'T2'!AS30","v":68},{"$f":"'T3'!AS30","v":54},{"$f":"'T4'!AS30","v":""},{"$f":"'T5'!AS30","v":""},{"$f":"'T6'!AS30","v":""},{"$f":"'T1'!AT30","v":48},{"$f":"'T2'!AT30","v":68},{"$f":"'T3'!AT30","v":54},{"$f":"'T4'!AT30","v":""},{"$f":"'T5'!AT30","v":""},{"$f":"'T6'!AT30","v":""},{"$f":"'T1'!AU30","v":48},{"$f":"'T2'!AU30","v":68},{"$f":"'T3'!AU30","v":54},{"$f":"'T4'!AU30","v":""},{"$f":"'T5'!AU30","v":""},{"$f":"'T6'!AU30","v":""},57,"",57,57,57,57]
[null,20,null,null,{"$f":"SW!G29","v":"MOHAMMAD NAUFAL NAWWARUDDIN"},{"$f":"'T1'!AP31","v":38},{"$f":"'T2'!AP31","v":43},{"$f":"'T3'!AP31","v":36},{"$f":"'T4'!AP31","v":""},{"$f":"'T5'!AP31","v":""},{"$f":"'T6'!AP31","v":""},{"$f":"'T1'!AQ31","v":""},{"$f":"'T2'!AQ31","v":""},{"$f":"'T3'!AQ31","v":""},{"$f":"'T4'!AQ31","v":""},{"$f":"'T5'!AQ31","v":""},{"$f":"'T6'!AQ31","v":""},{"$f":"'T1'!AR31","v":38},{"$f":"'T2'!AR31","v":43},{"$f":"'T3'!AR31","v":36},{"$f":"'T4'!AR31","v":""},{"$f":"'T5'!AR31","v":""},{"$f":"'T6'!AR31","v":""},{"$f":"'T1'!AS31","v":38},{"$f":"'T2'!AS31","v":43},{"$f":"'T3'!AS31","v":36},{"$f":"'T4'!AS31","v":""},{"$f":"'T5'!AS31","v":""},{"$f":"'T6'!AS31","v":""},{"$f":"'T1'!AT31","v":38},{"$f":"'T2'!AT31","v":43},{"$f":"'T3'!AT31","v":36},{"$f":"'T4'!AT31","v":""},{"$f":"'T5'!AT31","v":""},{"$f":"'T6'!AT31","v":""},{"$f":"'T1'!AU31","v":38},{"$f":"'T2'!AU31","v":43},{"$f":"'T3'!AU31","v":36},{"$f":"'T4'!AU31","v":""},{"$f":"'T5'!AU31","v":""},{"$f":"'T6'!AU31","v":""},39,"",39,39,39,39]
[null,21,null,null,{"$f":"SW!G30","v":"MUCHAMAD PRIMA PAMBUDI"},{"$f":"'T1'!AP32","v":52},{"$f":"'T2'!AP32","v":56},{"$f":"'T3'!AP32","v":39},{"$f":"'T4'!AP32","v":""},{"$f":"'T5'!AP32","v":""},{"$f":"'T6'!AP32","v":""},{"$f":"'T1'!AQ32","v":""},{"$f":"'T2'!AQ32","v":""},{"$f":"'T3'!AQ32","v":""},{"$f":"'T4'!AQ32","v":""},{"$f":"'T5'!AQ32","v":""},{"$f":"'T6'!AQ32","v":""},{"$f":"'T1'!AR32","v":52},{"$f":"'T2'!AR32","v":56},{"$f":"'T3'!AR32","v":39},{"$f":"'T4'!AR32","v":""},{"$f":"'T5'!AR32","v":""},{"$f":"'T6'!AR32","v":""},{"$f":"'T1'!AS32","v":52},{"$f":"'T2'!AS32","v":56},{"$f":"'T3'!AS32","v":39},{"$f":"'T4'!AS32","v":""},{"$f":"'T5'!AS32","v":""},{"$f":"'T6'!AS32","v":""},{"$f":"'T1'!AT32","v":52},{"$f":"'T2'!AT32","v":56},{"$f":"'T3'!AT32","v":39},{"$f":"'T4'!AT32","v":""},{"$f":"'T5'!AT32","v":""},{"$f":"'T6'!AT32","v":""},{"$f":"'T1'!AU32","v":52},{"$f":"'T2'!AU32","v":56},{"$f":"'T3'!AU32","v":39},{"$f":"'T4'!AU32","v":""},{"$f":"'T5'!AU32","v":""},{"$f":"'T6'!AU32","v":""},49,"",49,49,49,49]
[null,22,null,null,{"$f":"SW!G31","v":"MUHAMMAD ALFAN FATHONI"},{"$f":"'T1'!AP33","v":49},{"$f":"'T2'!AP33","v":52},{"$f":"'T3'!AP33","v":40},{"$f":"'T4'!AP33","v":""},{"$f":"'T5'!AP33","v":""},{"$f":"'T6'!AP33","v":""},{"$f":"'T1'!AQ33","v":""},{"$f":"'T2'!AQ33","v":""},{"$f":"'T3'!AQ33","v":""},{"$f":"'T4'!AQ33","v":""},{"$f":"'T5'!AQ33","v":""},{"$f":"'T6'!AQ33","v":""},{"$f":"'T1'!AR33","v":49},{"$f":"'T2'!AR33","v":52},{"$f":"'T3'!AR33","v":40},{"$f":"'T4'!AR33","v":""},{"$f":"'T5'!AR33","v":""},{"$f":"'T6'!AR33","v":""},{"$f":"'T1'!AS33","v":49},{"$f":"'T2'!AS33","v":52},{"$f":"'T3'!AS33","v":40},{"$f":"'T4'!AS33","v":""},{"$f":"'T5'!AS33","v":""},{"$f":"'T6'!AS33","v":""},{"$f":"'T1'!AT33","v":49},{"$f":"'T2'!AT33","v":52},{"$f":"'T3'!AT33","v":40},{"$f":"'T4'!AT33","v":""},{"$f":"'T5'!AT33","v":""},{"$f":"'T6'!AT33","v":""},{"$f":"'T1'!AU33","v":49},{"$f":"'T2'!AU33","v":52},{"$f":"'T3'!AU33","v":40},{"$f":"'T4'!AU33","v":""},{"$f":"'T5'!AU33","v":""},{"$f":"'T6'!AU33","v":""},47,"",47,47,47,47]
[null,23,null,null,{"$f":"SW!G32","v":"MUHAMMAD AMINULLAH MAULUDANI"},{"$f":"'T1'!AP34","v":34},{"$f":"'T2'!AP34","v":45},{"$f":"'T3'!AP34","v":31},{"$f":"'T4'!AP34","v":""},{"$f":"'T5'!AP34","v":""},{"$f":"'T6'!AP34","v":""},{"$f":"'T1'!AQ34","v":""},{"$f":"'T2'!AQ34","v":""},{"$f":"'T3'!AQ34","v":""},{"$f":"'T4'!AQ34","v":""},{"$f":"'T5'!AQ34","v":""},{"$f":"'T6'!AQ34","v":""},{"$f":"'T1'!AR34","v":34},{"$f":"'T2'!AR34","v":45},{"$f":"'T3'!AR34","v":31},{"$f":"'T4'!AR34","v":""},{"$f":"'T5'!AR34","v":""},{"$f":"'T6'!AR34","v":""},{"$f":"'T1'!AS34","v":34},{"$f":"'T2'!AS34","v":45},{"$f":"'T3'!AS34","v":31},{"$f":"'T4'!AS34","v":""},{"$f":"'T5'!AS34","v":""},{"$f":"'T6'!AS34","v":""},{"$f":"'T1'!AT34","v":34},{"$f":"'T2'!AT34","v":45},{"$f":"'T3'!AT34","v":31},{"$f":"'T4'!AT34","v":""},{"$f":"'T5'!AT34","v":""},{"$f":"'T6'!AT34","v":""},{"$f":"'T1'!AU34","v":34},{"$f":"'T2'!AU34","v":45},{"$f":"'T3'!AU34","v":31},{"$f":"'T4'!AU34","v":""},{"$f":"'T5'!AU34","v":""},{"$f":"'T6'!AU34","v":""},37,"",37,37,37,37]
[null,24,null,null,{"$f":"SW!G33","v":"MUHAMMAD DAVIN  LEVANTINO"},{"$f":"'T1'!AP35","v":41},{"$f":"'T2'!AP35","v":55},{"$f":"'T3'!AP35","v":54},{"$f":"'T4'!AP35","v":""},{"$f":"'T5'!AP35","v":""},{"$f":"'T6'!AP35","v":""},{"$f":"'T1'!AQ35","v":""},{"$f":"'T2'!AQ35","v":""},{"$f":"'T3'!AQ35","v":""},{"$f":"'T4'!AQ35","v":""},{"$f":"'T5'!AQ35","v":""},{"$f":"'T6'!AQ35","v":""},{"$f":"'T1'!AR35","v":41},{"$f":"'T2'!AR35","v":55},{"$f":"'T3'!AR35","v":54},{"$f":"'T4'!AR35","v":""},{"$f":"'T5'!AR35","v":""},{"$f":"'T6'!AR35","v":""},{"$f":"'T1'!AS35","v":41},{"$f":"'T2'!AS35","v":55},{"$f":"'T3'!AS35","v":54},{"$f":"'T4'!AS35","v":""},{"$f":"'T5'!AS35","v":""},{"$f":"'T6'!AS35","v":""},{"$f":"'T1'!AT35","v":41},{"$f":"'T2'!AT35","v":55},{"$f":"'T3'!AT35","v":54},{"$f":"'T4'!AT35","v":""},{"$f":"'T5'!AT35","v":""},{"$f":"'T6'!AT35","v":""},{"$f":"'T1'!AU35","v":41},{"$f":"'T2'!AU35","v":55},{"$f":"'T3'!AU35","v":54},{"$f":"'T4'!AU35","v":""},{"$f":"'T5'!AU35","v":""},{"$f":"'T6'!AU35","v":""},50,"",50,50,50,50]
[null,25,null,null,{"$f":"SW!G34","v":"MUHAMMAD MAULANA PAHLEVY"},{"$f":"'T1'!AP36","v":54},{"$f":"'T2'!AP36","v":51},{"$f":"'T3'!AP36","v":40},{"$f":"'T4'!AP36","v":""},{"$f":"'T5'!AP36","v":""},{"$f":"'T6'!AP36","v":""},{"$f":"'T1'!AQ36","v":""},{"$f":"'T2'!AQ36","v":""},{"$f":"'T3'!AQ36","v":""},{"$f":"'T4'!AQ36","v":""},{"$f":"'T5'!AQ36","v":""},{"$f":"'T6'!AQ36","v":""},{"$f":"'T1'!AR36","v":54},{"$f":"'T2'!AR36","v":51},{"$f":"'T3'!AR36","v":40},{"$f":"'T4'!AR36","v":""},{"$f":"'T5'!AR36","v":""},{"$f":"'T6'!AR36","v":""},{"$f":"'T1'!AS36","v":54},{"$f":"'T2'!AS36","v":51},{"$f":"'T3'!AS36","v":40},{"$f":"'T4'!AS36","v":""},{"$f":"'T5'!AS36","v":""},{"$f":"'T6'!AS36","v":""},{"$f":"'T1'!AT36","v":54},{"$f":"'T2'!AT36","v":51},{"$f":"'T3'!AT36","v":40},{"$f":"'T4'!AT36","v":""},{"$f":"'T5'!AT36","v":""},{"$f":"'T6'!AT36","v":""},{"$f":"'T1'!AU36","v":54},{"$f":"'T2'!AU36","v":51},{"$f":"'T3'!AU36","v":40},{"$f":"'T4'!AU36","v":""},{"$f":"'T5'!AU36","v":""},{"$f":"'T6'!AU36","v":""},48,"",48,48,48,48]
[null,26,null,null,{"$f":"SW!G35","v":"RADITYA NIRWANSYAH"},{"$f":"'T1'!AP37","v":46},{"$f":"'T2'!AP37","v":35},{"$f":"'T3'!AP37","v":33},{"$f":"'T4'!AP37","v":""},{"$f":"'T5'!AP37","v":""},{"$f":"'T6'!AP37","v":""},{"$f":"'T1'!AQ37","v":""},{"$f":"'T2'!AQ37","v":""},{"$f":"'T3'!AQ37","v":""},{"$f":"'T4'!AQ37","v":""},{"$f":"'T5'!AQ37","v":""},{"$f":"'T6'!AQ37","v":""},{"$f":"'T1'!AR37","v":46},{"$f":"'T2'!AR37","v":35},{"$f":"'T3'!AR37","v":33},{"$f":"'T4'!AR37","v":""},{"$f":"'T5'!AR37","v":""},{"$f":"'T6'!AR37","v":""},{"$f":"'T1'!AS37","v":46},{"$f":"'T2'!AS37","v":35},{"$f":"'T3'!AS37","v":33},{"$f":"'T4'!AS37","v":""},{"$f":"'T5'!AS37","v":""},{"$f":"'T6'!AS37","v":""},{"$f":"'T1'!AT37","v":46},{"$f":"'T2'!AT37","v":35},{"$f":"'T3'!AT37","v":33},{"$f":"'T4'!AT37","v":""},{"$f":"'T5'!AT37","v":""},{"$f":"'T6'!AT37","v":""},{"$f":"'T1'!AU37","v":46},{"$f":"'T2'!AU37","v":35},{"$f":"'T3'!AU37","v":33},{"$f":"'T4'!AU37","v":""},{"$f":"'T5'!AU37","v":""},{"$f":"'T6'!AU37","v":""},38,"",38,38,38,38]
[null,27,null,null,{"$f":"SW!G36","v":"REVINA SRI UTARI"},{"$f":"'T1'!AP38","v":44},{"$f":"'T2'!AP38","v":54},{"$f":"'T3'!AP38","v":42},{"$f":"'T4'!AP38","v":""},{"$f":"'T5'!AP38","v":""},{"$f":"'T6'!AP38","v":""},{"$f":"'T1'!AQ38","v":""},{"$f":"'T2'!AQ38","v":""},{"$f":"'T3'!AQ38","v":""},{"$f":"'T4'!AQ38","v":""},{"$f":"'T5'!AQ38","v":""},{"$f":"'T6'!AQ38","v":""},{"$f":"'T1'!AR38","v":44},{"$f":"'T2'!AR38","v":54},{"$f":"'T3'!AR38","v":42},{"$f":"'T4'!AR38","v":""},{"$f":"'T5'!AR38","v":""},{"$f":"'T6'!AR38","v":""},{"$f":"'T1'!AS38","v":44},{"$f":"'T2'!AS38","v":54},{"$f":"'T3'!AS38","v":42},{"$f":"'T4'!AS38","v":""},{"$f":"'T5'!AS38","v":""},{"$f":"'T6'!AS38","v":""},{"$f":"'T1'!AT38","v":44},{"$f":"'T2'!AT38","v":54},{"$f":"'T3'!AT38","v":42},{"$f":"'T4'!AT38","v":""},{"$f":"'T5'!AT38","v":""},{"$f":"'T6'!AT38","v":""},{"$f":"'T1'!AU38","v":44},{"$f":"'T2'!AU38","v":54},{"$f":"'T3'!AU38","v":42},{"$f":"'T4'!AU38","v":""},{"$f":"'T5'!AU38","v":""},{"$f":"'T6'!AU38","v":""},47,"",47,47,47,47]
[null,28,null,null,{"$f":"SW!G37","v":"REYHAN DWI ANDIKA"},{"$f":"'T1'!AP39","v":45},{"$f":"'T2'!AP39","v":46},{"$f":"'T3'!AP39","v":25},{"$f":"'T4'!AP39","v":""},{"$f":"'T5'!AP39","v":""},{"$f":"'T6'!AP39","v":""},{"$f":"'T1'!AQ39","v":""},{"$f":"'T2'!AQ39","v":""},{"$f":"'T3'!AQ39","v":""},{"$f":"'T4'!AQ39","v":""},{"$f":"'T5'!AQ39","v":""},{"$f":"'T6'!AQ39","v":""},{"$f":"'T1'!AR39","v":45},{"$f":"'T2'!AR39","v":46},{"$f":"'T3'!AR39","v":25},{"$f":"'T4'!AR39","v":""},{"$f":"'T5'!AR39","v":""},{"$f":"'T6'!AR39","v":""},{"$f":"'T1'!AS39","v":45},{"$f":"'T2'!AS39","v":46},{"$f":"'T3'!AS39","v":25},{"$f":"'T4'!AS39","v":""},{"$f":"'T5'!AS39","v":""},{"$f":"'T6'!AS39","v":""},{"$f":"'T1'!AT39","v":45},{"$f":"'T2'!AT39","v":46},{"$f":"'T3'!AT39","v":25},{"$f":"'T4'!AT39","v":""},{"$f":"'T5'!AT39","v":""},{"$f":"'T6'!AT39","v":""},{"$f":"'T1'!AU39","v":45},{"$f":"'T2'!AU39","v":46},{"$f":"'T3'!AU39","v":25},{"$f":"'T4'!AU39","v":""},{"$f":"'T5'!AU39","v":""},{"$f":"'T6'!AU39","v":""},39,"",39,39,39,39]
[null,29,null,null,{"$f":"SW!G38","v":"RISKA LAURA TRIA OCTAVIA"},{"$f":"'T1'!AP40","v":63},{"$f":"'T2'!AP40","v":67},{"$f":"'T3'!AP40","v":""},{"$f":"'T4'!AP40","v":""},{"$f":"'T5'!AP40","v":""},{"$f":"'T6'!AP40","v":""},{"$f":"'T1'!AQ40","v":""},{"$f":"'T2'!AQ40","v":""},{"$f":"'T3'!AQ40","v":""},{"$f":"'T4'!AQ40","v":""},{"$f":"'T5'!AQ40","v":""},{"$f":"'T6'!AQ40","v":""},{"$f":"'T1'!AR40","v":63},{"$f":"'T2'!AR40","v":67},{"$f":"'T3'!AR40","v":""},{"$f":"'T4'!AR40","v":""},{"$f":"'T5'!AR40","v":""},{"$f":"'T6'!AR40","v":""},{"$f":"'T1'!AS40","v":63},{"$f":"'T2'!AS40","v":67},{"$f":"'T3'!AS40","v":""},{"$f":"'T4'!AS40","v":""},{"$f":"'T5'!AS40","v":""},{"$f":"'T6'!AS40","v":""},{"$f":"'T1'!AT40","v":63},{"$f":"'T2'!AT40","v":67},{"$f":"'T3'!AT40","v":""},{"$f":"'T4'!AT40","v":""},{"$f":"'T5'!AT40","v":""},{"$f":"'T6'!AT40","v":""},{"$f":"'T1'!AU40","v":63},{"$f":"'T2'!AU40","v":67},{"$f":"'T3'!AU40","v":""},{"$f":"'T4'!AU40","v":""},{"$f":"'T5'!AU40","v":""},{"$f":"'T6'!AU40","v":""},65,"",65,65,65,65]
[null,30,null,null,{"$f":"SW!G39","v":"ROHMADONA DWI SAFITRI"},{"$f":"'T1'!AP41","v":67},{"$f":"'T2'!AP41","v":80},{"$f":"'T3'!AP41","v":53},{"$f":"'T4'!AP41","v":""},{"$f":"'T5'!AP41","v":""},{"$f":"'T6'!AP41","v":""},{"$f":"'T1'!AQ41","v":""},{"$f":"'T2'!AQ41","v":""},{"$f":"'T3'!AQ41","v":""},{"$f":"'T4'!AQ41","v":""},{"$f":"'T5'!AQ41","v":""},{"$f":"'T6'!AQ41","v":""},{"$f":"'T1'!AR41","v":67},{"$f":"'T2'!AR41","v":80},{"$f":"'T3'!AR41","v":53},{"$f":"'T4'!AR41","v":""},{"$f":"'T5'!AR41","v":""},{"$f":"'T6'!AR41","v":""},{"$f":"'T1'!AS41","v":67},{"$f":"'T2'!AS41","v":80},{"$f":"'T3'!AS41","v":53},{"$f":"'T4'!AS41","v":""},{"$f":"'T5'!AS41","v":""},{"$f":"'T6'!AS41","v":""},{"$f":"'T1'!AT41","v":67},{"$f":"'T2'!AT41","v":80},{"$f":"'T3'!AT41","v":53},{"$f":"'T4'!AT41","v":""},{"$f":"'T5'!AT41","v":""},{"$f":"'T6'!AT41","v":""},{"$f":"'T1'!AU41","v":67},{"$f":"'T2'!AU41","v":80},{"$f":"'T3'!AU41","v":53},{"$f":"'T4'!AU41","v":""},{"$f":"'T5'!AU41","v":""},{"$f":"'T6'!AU41","v":""},67,"",67,67,67,67]
[null,31,null,null,{"$f":"SW!G40","v":"SALMAN ALFARIZI"},{"$f":"'T1'!AP42","v":43},{"$f":"'T2'!AP42","v":47},{"$f":"'T3'!AP42","v":36},{"$f":"'T4'!AP42","v":""},{"$f":"'T5'!AP42","v":""},{"$f":"'T6'!AP42","v":""},{"$f":"'T1'!AQ42","v":""},{"$f":"'T2'!AQ42","v":""},{"$f":"'T3'!AQ42","v":""},{"$f":"'T4'!AQ42","v":""},{"$f":"'T5'!AQ42","v":""},{"$f":"'T6'!AQ42","v":""},{"$f":"'T1'!AR42","v":43},{"$f":"'T2'!AR42","v":47},{"$f":"'T3'!AR42","v":36},{"$f":"'T4'!AR42","v":""},{"$f":"'T5'!AR42","v":""},{"$f":"'T6'!AR42","v":""},{"$f":"'T1'!AS42","v":43},{"$f":"'T2'!AS42","v":47},{"$f":"'T3'!AS42","v":36},{"$f":"'T4'!AS42","v":""},{"$f":"'T5'!AS42","v":""},{"$f":"'T6'!AS42","v":""},{"$f":"'T1'!AT42","v":43},{"$f":"'T2'!AT42","v":47},{"$f":"'T3'!AT42","v":36},{"$f":"'T4'!AT42","v":""},{"$f":"'T5'!AT42","v":""},{"$f":"'T6'!AT42","v":""},{"$f":"'T1'!AU42","v":43},{"$f":"'T2'!AU42","v":47},{"$f":"'T3'!AU42","v":36},{"$f":"'T4'!AU42","v":""},{"$f":"'T5'!AU42","v":""},{"$f":"'T6'!AU42","v":""},42,"",42,42,42,42]
[null,32,null,null,{"$f":"SW!G41","v":"TAUFIQ KURROHMAN"},{"$f":"'T1'!AP43","v":53},{"$f":"'T2'!AP43","v":51},{"$f":"'T3'!AP43","v":41},{"$f":"'T4'!AP43","v":""},{"$f":"'T5'!AP43","v":""},{"$f":"'T6'!AP43","v":""},{"$f":"'T1'!AQ43","v":""},{"$f":"'T2'!AQ43","v":""},{"$f":"'T3'!AQ43","v":""},{"$f":"'T4'!AQ43","v":""},{"$f":"'T5'!AQ43","v":""},{"$f":"'T6'!AQ43","v":""},{"$f":"'T1'!AR43","v":53},{"$f":"'T2'!AR43","v":51},{"$f":"'T3'!AR43","v":41},{"$f":"'T4'!AR43","v":""},{"$f":"'T5'!AR43","v":""},{"$f":"'T6'!AR43","v":""},{"$f":"'T1'!AS43","v":53},{"$f":"'T2'!AS43","v":51},{"$f":"'T3'!AS43","v":41},{"$f":"'T4'!AS43","v":""},{"$f":"'T5'!AS43","v":""},{"$f":"'T6'!AS43","v":""},{"$f":"'T1'!AT43","v":53},{"$f":"'T2'!AT43","v":51},{"$f":"'T3'!AT43","v":41},{"$f":"'T4'!AT43","v":""},{"$f":"'T5'!AT43","v":""},{"$f":"'T6'!AT43","v":""},{"$f":"'T1'!AU43","v":53},{"$f":"'T2'!AU43","v":51},{"$f":"'T3'!AU43","v":41},{"$f":"'T4'!AU43","v":""},{"$f":"'T5'!AU43","v":""},{"$f":"'T6'!AU43","v":""},48,"",48,48,48,48]
[null,33,null,null,{"$f":"SW!G42","v":0},{"$f":"'T1'!AP44","v":""},{"$f":"'T2'!AP44","v":""},{"$f":"'T3'!AP44","v":""},{"$f":"'T4'!AP44","v":""},{"$f":"'T5'!AP44","v":""},{"$f":"'T6'!AP44","v":""},{"$f":"'T1'!AQ44","v":""},{"$f":"'T2'!AQ44","v":""},{"$f":"'T3'!AQ44","v":""},{"$f":"'T4'!AQ44","v":""},{"$f":"'T5'!AQ44","v":""},{"$f":"'T6'!AQ44","v":""},{"$f":"'T1'!AR44","v":""},{"$f":"'T2'!AR44","v":""},{"$f":"'T3'!AR44","v":""},{"$f":"'T4'!AR44","v":""},{"$f":"'T5'!AR44","v":""},{"$f":"'T6'!AR44","v":""},{"$f":"'T1'!AS44","v":""},{"$f":"'T2'!AS44","v":""},{"$f":"'T3'!AS44","v":""},{"$f":"'T4'!AS44","v":""},{"$f":"'T5'!AS44","v":""},{"$f":"'T6'!AS44","v":""},{"$f":"'T1'!AT44","v":""},{"$f":"'T2'!AT44","v":""},{"$f":"'T3'!AT44","v":""},{"$f":"'T4'!AT44","v":""},{"$f":"'T5'!AT44","v":""},{"$f":"'T6'!AT44","v":""},{"$f":"'T1'!AU44","v":""},{"$f":"'T2'!AU44","v":""},{"$f":"'T3'!AU44","v":""},{"$f":"'T4'!AU44","v":""},{"$f":"'T5'!AU44","v":""},{"$f":"'T6'!AU44","v":""},"","","","","",""]
[null,34,null,null,{"$f":"SW!G43","v":0},{"$f":"'T1'!AP45","v":""},{"$f":"'T2'!AP45","v":""},{"$f":"'T3'!AP45","v":""},{"$f":"'T4'!AP45","v":""},{"$f":"'T5'!AP45","v":""},{"$f":"'T6'!AP45","v":""},{"$f":"'T1'!AQ45","v":""},{"$f":"'T2'!AQ45","v":""},{"$f":"'T3'!AQ45","v":""},{"$f":"'T4'!AQ45","v":""},{"$f":"'T5'!AQ45","v":""},{"$f":"'T6'!AQ45","v":""},{"$f":"'T1'!AR45","v":""},{"$f":"'T2'!AR45","v":""},{"$f":"'T3'!AR45","v":""},{"$f":"'T4'!AR45","v":""},{"$f":"'T5'!AR45","v":""},{"$f":"'T6'!AR45","v":""},{"$f":"'T1'!AS45","v":""},{"$f":"'T2'!AS45","v":""},{"$f":"'T3'!AS45","v":""},{"$f":"'T4'!AS45","v":""},{"$f":"'T5'!AS45","v":""},{"$f":"'T6'!AS45","v":""},{"$f":"'T1'!AT45","v":""},{"$f":"'T2'!AT45","v":""},{"$f":"'T3'!AT45","v":""},{"$f":"'T4'!AT45","v":""},{"$f":"'T5'!AT45","v":""},{"$f":"'T6'!AT45","v":""},{"$f":"'T1'!AU45","v":""},{"$f":"'T2'!AU45","v":""},{"$f":"'T3'!AU45","v":""},{"$f":"'T4'!AU45","v":""},{"$f":"'T5'!AU45","v":""},{"$f":"'T6'!AU45","v":""},"","","","","",""]
[null,35,null,null,{"$f":"SW!G44","v":0},{"$f":"'T1'!AP46","v":""},{"$f":"'T2'!AP46","v":""},{"$f":"'T3'!AP46","v":""},{"$f":"'T4'!AP46","v":""},{"$f":"'T5'!AP46","v":""},{"$f":"'T6'!AP46","v":""},{"$f":"'T1'!AQ46","v":""},{"$f":"'T2'!AQ46","v":""},{"$f":"'T3'!AQ46","v":""},{"$f":"'T4'!AQ46","v":""},{"$f":"'T5'!AQ46","v":""},{"$f":"'T6'!AQ46","v":""},{"$f":"'T1'!AR46","v":""},{"$f":"'T2'!AR46","v":""},{"$f":"'T3'!AR46","v":""},{"$f":"'T4'!AR46","v":""},{"$f":"'T5'!AR46","v":""},{"$f":"'T6'!AR46","v":""},{"$f":"'T1'!AS46","v":""},{"$f":"'T2'!AS46","v":""},{"$f":"'T3'!AS46","v":""},{"$f":"'T4'!AS46","v":""},{"$f":"'T5'!AS46","v":""},{"$f":"'T6'!AS46","v":""},{"$f":"'T1'!AT46","v":""},{"$f":"'T2'!AT46","v":""},{"$f":"'T3'!AT46","v":""},{"$f":"'T4'!AT46","v":""},{"$f":"'T5'!AT46","v":""},{"$f":"'T6'!AT46","v":""},{"$f":"'T1'!AU46","v":""},{"$f":"'T2'!AU46","v":""},{"$f":"'T3'!AU46","v":""},{"$f":"'T4'!AU46","v":""},{"$f":"'T5'!AU46","v":""},{"$f":"'T6'!AU46","v":""},"","","","","",""]
[null,36,null,null,{"$f":"SW!G45","v":0},{"$f":"'T1'!AP47","v":""},{"$f":"'T2'!AP47","v":""},{"$f":"'T3'!AP47","v":""},{"$f":"'T4'!AP47","v":""},{"$f":"'T5'!AP47","v":""},{"$f":"'T6'!AP47","v":""},{"$f":"'T1'!AQ47","v":""},{"$f":"'T2'!AQ47","v":""},{"$f":"'T3'!AQ47","v":""},{"$f":"'T4'!AQ47","v":""},{"$f":"'T5'!AQ47","v":""},{"$f":"'T6'!AQ47","v":""},{"$f":"'T1'!AR47","v":""},{"$f":"'T2'!AR47","v":""},{"$f":"'T3'!AR47","v":""},{"$f":"'T4'!AR47","v":""},{"$f":"'T5'!AR47","v":""},{"$f":"'T6'!AR47","v":""},{"$f":"'T1'!AS47","v":""},{"$f":"'T2'!AS47","v":""},{"$f":"'T3'!AS47","v":""},{"$f":"'T4'!AS47","v":""},{"$f":"'T5'!AS47","v":""},{"$f":"'T6'!AS47","v":""},{"$f":"'T1'!AT47","v":""},{"$f":"'T2'!AT47","v":""},{"$f":"'T3'!AT47","v":""},{"$f":"'T4'!AT47","v":""},{"$f":"'T5'!AT47","v":""},{"$f":"'T6'!AT47","v":""},{"$f":"'T1'!AU47","v":""},{"$f":"'T2'!AU47","v":""},{"$f":"'T3'!AU47","v":""},{"$f":"'T4'!AU47","v":""},{"$f":"'T5'!AU47","v":""},{"$f":"'T6'!AU47","v":""},"","","","","",""]
[null,37,null,null,{"$f":"SW!G46","v":0},{"$f":"'T1'!AP48","v":""},{"$f":"'T2'!AP48","v":""},{"$f":"'T3'!AP48","v":""},{"$f":"'T4'!AP48","v":""},{"$f":"'T5'!AP48","v":""},{"$f":"'T6'!AP48","v":""},{"$f":"'T1'!AQ48","v":""},{"$f":"'T2'!AQ48","v":""},{"$f":"'T3'!AQ48","v":""},{"$f":"'T4'!AQ48","v":""},{"$f":"'T5'!AQ48","v":""},{"$f":"'T6'!AQ48","v":""},{"$f":"'T1'!AR48","v":""},{"$f":"'T2'!AR48","v":""},{"$f":"'T3'!AR48","v":""},{"$f":"'T4'!AR48","v":""},{"$f":"'T5'!AR48","v":""},{"$f":"'T6'!AR48","v":""},{"$f":"'T1'!AS48","v":""},{"$f":"'T2'!AS48","v":""},{"$f":"'T3'!AS48","v":""},{"$f":"'T4'!AS48","v":""},{"$f":"'T5'!AS48","v":""},{"$f":"'T6'!AS48","v":""},{"$f":"'T1'!AT48","v":""},{"$f":"'T2'!AT48","v":""},{"$f":"'T3'!AT48","v":""},{"$f":"'T4'!AT48","v":""},{"$f":"'T5'!AT48","v":""},{"$f":"'T6'!AT48","v":""},{"$f":"'T1'!AU48","v":""},{"$f":"'T2'!AU48","v":""},{"$f":"'T3'!AU48","v":""},{"$f":"'T4'!AU48","v":""},{"$f":"'T5'!AU48","v":""},{"$f":"'T6'!AU48","v":""},"","","","","",""]
[null,38,null,null,{"$f":"SW!G47","v":0},{"$f":"'T1'!AP49","v":""},{"$f":"'T2'!AP49","v":""},{"$f":"'T3'!AP49","v":""},{"$f":"'T4'!AP49","v":""},{"$f":"'T5'!AP49","v":""},{"$f":"'T6'!AP49","v":""},{"$f":"'T1'!AQ49","v":""},{"$f":"'T2'!AQ49","v":""},{"$f":"'T3'!AQ49","v":""},{"$f":"'T4'!AQ49","v":""},{"$f":"'T5'!AQ49","v":""},{"$f":"'T6'!AQ49","v":""},{"$f":"'T1'!AR49","v":""},{"$f":"'T2'!AR49","v":""},{"$f":"'T3'!AR49","v":""},{"$f":"'T4'!AR49","v":""},{"$f":"'T5'!AR49","v":""},{"$f":"'T6'!AR49","v":""},{"$f":"'T1'!AS49","v":""},{"$f":"'T2'!AS49","v":""},{"$f":"'T3'!AS49","v":""},{"$f":"'T4'!AS49","v":""},{"$f":"'T5'!AS49","v":""},{"$f":"'T6'!AS49","v":""},{"$f":"'T1'!AT49","v":""},{"$f":"'T2'!AT49","v":""},{"$f":"'T3'!AT49","v":""},{"$f":"'T4'!AT49","v":""},{"$f":"'T5'!AT49","v":""},{"$f":"'T6'!AT49","v":""},{"$f":"'T1'!AU49","v":""},{"$f":"'T2'!AU49","v":""},{"$f":"'T3'!AU49","v":""},{"$f":"'T4'!AU49","v":""},{"$f":"'T5'!AU49","v":""},{"$f":"'T6'!AU49","v":""},"","","","","",""]
[null,39,null,null,{"$f":"SW!G48","v":0},{"$f":"'T1'!AP50","v":""},{"$f":"'T2'!AP50","v":""},{"$f":"'T3'!AP50","v":""},{"$f":"'T4'!AP50","v":""},{"$f":"'T5'!AP50","v":""},{"$f":"'T6'!AP50","v":""},{"$f":"'T1'!AQ50","v":""},{"$f":"'T2'!AQ50","v":""},{"$f":"'T3'!AQ50","v":""},{"$f":"'T4'!AQ50","v":""},{"$f":"'T5'!AQ50","v":""},{"$f":"'T6'!AQ50","v":""},{"$f":"'T1'!AR50","v":""},{"$f":"'T2'!AR50","v":""},{"$f":"'T3'!AR50","v":""},{"$f":"'T4'!AR50","v":""},{"$f":"'T5'!AR50","v":""},{"$f":"'T6'!AR50","v":""},{"$f":"'T1'!AS50","v":""},{"$f":"'T2'!AS50","v":""},{"$f":"'T3'!AS50","v":""},{"$f":"'T4'!AS50","v":""},{"$f":"'T5'!AS50","v":""},{"$f":"'T6'!AS50","v":""},{"$f":"'T1'!AT50","v":""},{"$f":"'T2'!AT50","v":""},{"$f":"'T3'!AT50","v":""},{"$f":"'T4'!AT50","v":""},{"$f":"'T5'!AT50","v":""},{"$f":"'T6'!AT50","v":""},{"$f":"'T1'!AU50","v":""},{"$f":"'T2'!AU50","v":""},{"$f":"'T3'!AU50","v":""},{"$f":"'T4'!AU50","v":""},{"$f":"'T5'!AU50","v":""},{"$f":"'T6'!AU50","v":""},"","","","","",""]
[null,40,null,null,{"$f":"SW!G49","v":0},{"$f":"'T1'!AP51","v":""},{"$f":"'T2'!AP51","v":""},{"$f":"'T3'!AP51","v":""},{"$f":"'T4'!AP51","v":""},{"$f":"'T5'!AP51","v":""},{"$f":"'T6'!AP51","v":""},{"$f":"'T1'!AQ51","v":""},{"$f":"'T2'!AQ51","v":""},{"$f":"'T3'!AQ51","v":""},{"$f":"'T4'!AQ51","v":""},{"$f":"'T5'!AQ51","v":""},{"$f":"'T6'!AQ51","v":""},{"$f":"'T1'!AR51","v":""},{"$f":"'T2'!AR51","v":""},{"$f":"'T3'!AR51","v":""},{"$f":"'T4'!AR51","v":""},{"$f":"'T5'!AR51","v":""},{"$f":"'T6'!AR51","v":""},{"$f":"'T1'!AS51","v":""},{"$f":"'T2'!AS51","v":""},{"$f":"'T3'!AS51","v":""},{"$f":"'T4'!AS51","v":""},{"$f":"'T5'!AS51","v":""},{"$f":"'T6'!AS51","v":""},{"$f":"'T1'!AT51","v":""},{"$f":"'T2'!AT51","v":""},{"$f":"'T3'!AT51","v":""},{"$f":"'T4'!AT51","v":""},{"$f":"'T5'!AT51","v":""},{"$f":"'T6'!AT51","v":""},{"$f":"'T1'!AU51","v":""},{"$f":"'T2'!AU51","v":""},{"$f":"'T3'!AU51","v":""},{"$f":"'T4'!AU51","v":""},{"$f":"'T5'!AU51","v":""},{"$f":"'T6'!AU51","v":""},"","","","","",""]
[null,41,null,null,{"$f":"SW!G50","v":0},{"$f":"'T1'!AP52","v":""},{"$f":"'T2'!AP52","v":""},{"$f":"'T3'!AP52","v":""},{"$f":"'T4'!AP52","v":""},{"$f":"'T5'!AP52","v":""},{"$f":"'T6'!AP52","v":""},{"$f":"'T1'!AQ52","v":""},{"$f":"'T2'!AQ52","v":""},{"$f":"'T3'!AQ52","v":""},{"$f":"'T4'!AQ52","v":""},{"$f":"'T5'!AQ52","v":""},{"$f":"'T6'!AQ52","v":""},{"$f":"'T1'!AR52","v":""},{"$f":"'T2'!AR52","v":""},{"$f":"'T3'!AR52","v":""},{"$f":"'T4'!AR52","v":""},{"$f":"'T5'!AR52","v":""},{"$f":"'T6'!AR52","v":""},{"$f":"'T1'!AS52","v":""},{"$f":"'T2'!AS52","v":""},{"$f":"'T3'!AS52","v":""},{"$f":"'T4'!AS52","v":""},{"$f":"'T5'!AS52","v":""},{"$f":"'T6'!AS52","v":""},{"$f":"'T1'!AT52","v":""},{"$f":"'T2'!AT52","v":""},{"$f":"'T3'!AT52","v":""},{"$f":"'T4'!AT52","v":""},{"$f":"'T5'!AT52","v":""},{"$f":"'T6'!AT52","v":""},{"$f":"'T1'!AU52","v":""},{"$f":"'T2'!AU52","v":""},{"$f":"'T3'!AU52","v":""},{"$f":"'T4'!AU52","v":""},{"$f":"'T5'!AU52","v":""},{"$f":"'T6'!AU52","v":""},"","","","","",""]
[null,42,null,null,{"$f":"SW!G51","v":0},{"$f":"'T1'!AP53","v":""},{"$f":"'T2'!AP53","v":""},{"$f":"'T3'!AP53","v":""},{"$f":"'T4'!AP53","v":""},{"$f":"'T5'!AP53","v":""},{"$f":"'T6'!AP53","v":""},{"$f":"'T1'!AQ53","v":""},{"$f":"'T2'!AQ53","v":""},{"$f":"'T3'!AQ53","v":""},{"$f":"'T4'!AQ53","v":""},{"$f":"'T5'!AQ53","v":""},{"$f":"'T6'!AQ53","v":""},{"$f":"'T1'!AR53","v":""},{"$f":"'T2'!AR53","v":""},{"$f":"'T3'!AR53","v":""},{"$f":"'T4'!AR53","v":""},{"$f":"'T5'!AR53","v":""},{"$f":"'T6'!AR53","v":""},{"$f":"'T1'!AS53","v":""},{"$f":"'T2'!AS53","v":""},{"$f":"'T3'!AS53","v":""},{"$f":"'T4'!AS53","v":""},{"$f":"'T5'!AS53","v":""},{"$f":"'T6'!AS53","v":""},{"$f":"'T1'!AT53","v":""},{"$f":"'T2'!AT53","v":""},{"$f":"'T3'!AT53","v":""},{"$f":"'T4'!AT53","v":""},{"$f":"'T5'!AT53","v":""},{"$f":"'T6'!AT53","v":""},{"$f":"'T1'!AU53","v":""},{"$f":"'T2'!AU53","v":""},{"$f":"'T3'!AU53","v":""},{"$f":"'T4'!AU53","v":""},{"$f":"'T5'!AU53","v":""},{"$f":"'T6'!AU53","v":""},"","","","","",""]
[null,43,null,null,{"$f":"SW!G52","v":0},{"$f":"'T1'!AP54","v":""},{"$f":"'T2'!AP54","v":""},{"$f":"'T3'!AP54","v":""},{"$f":"'T4'!AP54","v":""},{"$f":"'T5'!AP54","v":""},{"$f":"'T6'!AP54","v":""},{"$f":"'T1'!AQ54","v":""},{"$f":"'T2'!AQ54","v":""},{"$f":"'T3'!AQ54","v":""},{"$f":"'T4'!AQ54","v":""},{"$f":"'T5'!AQ54","v":""},{"$f":"'T6'!AQ54","v":""},{"$f":"'T1'!AR54","v":""},{"$f":"'T2'!AR54","v":""},{"$f":"'T3'!AR54","v":""},{"$f":"'T4'!AR54","v":""},{"$f":"'T5'!AR54","v":""},{"$f":"'T6'!AR54","v":""},{"$f":"'T1'!AS54","v":""},{"$f":"'T2'!AS54","v":""},{"$f":"'T3'!AS54","v":""},{"$f":"'T4'!AS54","v":""},{"$f":"'T5'!AS54","v":""},{"$f":"'T6'!AS54","v":""},{"$f":"'T1'!AT54","v":""},{"$f":"'T2'!AT54","v":""},{"$f":"'T3'!AT54","v":""},{"$f":"'T4'!AT54","v":""},{"$f":"'T5'!AT54","v":""},{"$f":"'T6'!AT54","v":""},{"$f":"'T1'!AU54","v":""},{"$f":"'T2'!AU54","v":""},{"$f":"'T3'!AU54","v":""},{"$f":"'T4'!AU54","v":""},{"$f":"'T5'!AU54","v":""},{"$f":"'T6'!AU54","v":""},"","","","","",""]
[null,44,null,null,{"$f":"SW!G53","v":0},{"$f":"'T1'!AP55","v":""},{"$f":"'T2'!AP55","v":""},{"$f":"'T3'!AP55","v":""},{"$f":"'T4'!AP55","v":""},{"$f":"'T5'!AP55","v":""},{"$f":"'T6'!AP55","v":""},{"$f":"'T1'!AQ55","v":""},{"$f":"'T2'!AQ55","v":""},{"$f":"'T3'!AQ55","v":""},{"$f":"'T4'!AQ55","v":""},{"$f":"'T5'!AQ55","v":""},{"$f":"'T6'!AQ55","v":""},{"$f":"'T1'!AR55","v":""},{"$f":"'T2'!AR55","v":""},{"$f":"'T3'!AR55","v":""},{"$f":"'T4'!AR55","v":""},{"$f":"'T5'!AR55","v":""},{"$f":"'T6'!AR55","v":""},{"$f":"'T1'!AS55","v":""},{"$f":"'T2'!AS55","v":""},{"$f":"'T3'!AS55","v":""},{"$f":"'T4'!AS55","v":""},{"$f":"'T5'!AS55","v":""},{"$f":"'T6'!AS55","v":""},{"$f":"'T1'!AT55","v":""},{"$f":"'T2'!AT55","v":""},{"$f":"'T3'!AT55","v":""},{"$f":"'T4'!AT55","v":""},{"$f":"'T5'!AT55","v":""},{"$f":"'T6'!AT55","v":""},{"$f":"'T1'!AU55","v":""},{"$f":"'T2'!AU55","v":""},{"$f":"'T3'!AU55","v":""},{"$f":"'T4'!AU55","v":""},{"$f":"'T5'!AU55","v":""},{"$f":"'T6'!AU55","v":""},"","","","","",""]
[null,45,null,null,{"$f":"SW!G54","v":0},{"$f":"'T1'!AP56","v":""},{"$f":"'T2'!AP56","v":""},{"$f":"'T3'!AP56","v":""},{"$f":"'T4'!AP56","v":""},{"$f":"'T5'!AP56","v":""},{"$f":"'T6'!AP56","v":""},{"$f":"'T1'!AQ56","v":""},{"$f":"'T2'!AQ56","v":""},{"$f":"'T3'!AQ56","v":""},{"$f":"'T4'!AQ56","v":""},{"$f":"'T5'!AQ56","v":""},{"$f":"'T6'!AQ56","v":""},{"$f":"'T1'!AR56","v":""},{"$f":"'T2'!AR56","v":""},{"$f":"'T3'!AR56","v":""},{"$f":"'T4'!AR56","v":""},{"$f":"'T5'!AR56","v":""},{"$f":"'T6'!AR56","v":""},{"$f":"'T1'!AS56","v":""},{"$f":"'T2'!AS56","v":""},{"$f":"'T3'!AS56","v":""},{"$f":"'T4'!AS56","v":""},{"$f":"'T5'!AS56","v":""},{"$f":"'T6'!AS56","v":""},{"$f":"'T1'!AT56","v":""},{"$f":"'T2'!AT56","v":""},{"$f":"'T3'!AT56","v":""},{"$f":"'T4'!AT56","v":""},{"$f":"'T5'!AT56","v":""},{"$f":"'T6'!AT56","v":""},{"$f":"'T1'!AU56","v":""},{"$f":"'T2'!AU56","v":""},{"$f":"'T3'!AU56","v":""},{"$f":"'T4'!AU56","v":""},{"$f":"'T5'!AU56","v":""},{"$f":"'T6'!AU56","v":""},"","","","","",""]
[null,46,null,null,{"$f":"SW!G55","v":0},{"$f":"'T1'!AP57","v":""},{"$f":"'T2'!AP57","v":""},{"$f":"'T3'!AP57","v":""},{"$f":"'T4'!AP57","v":""},{"$f":"'T5'!AP57","v":""},{"$f":"'T6'!AP57","v":""},{"$f":"'T1'!AQ57","v":""},{"$f":"'T2'!AQ57","v":""},{"$f":"'T3'!AQ57","v":""},{"$f":"'T4'!AQ57","v":""},{"$f":"'T5'!AQ57","v":""},{"$f":"'T6'!AQ57","v":""},{"$f":"'T1'!AR57","v":""},{"$f":"'T2'!AR57","v":""},{"$f":"'T3'!AR57","v":""},{"$f":"'T4'!AR57","v":""},{"$f":"'T5'!AR57","v":""},{"$f":"'T6'!AR57","v":""},{"$f":"'T1'!AS57","v":""},{"$f":"'T2'!AS57","v":""},{"$f":"'T3'!AS57","v":""},{"$f":"'T4'!AS57","v":""},{"$f":"'T5'!AS57","v":""},{"$f":"'T6'!AS57","v":""},{"$f":"'T1'!AT57","v":""},{"$f":"'T2'!AT57","v":""},{"$f":"'T3'!AT57","v":""},{"$f":"'T4'!AT57","v":""},{"$f":"'T5'!AT57","v":""},{"$f":"'T6'!AT57","v":""},{"$f":"'T1'!AU57","v":""},{"$f":"'T2'!AU57","v":""},{"$f":"'T3'!AU57","v":""},{"$f":"'T4'!AU57","v":""},{"$f":"'T5'!AU57","v":""},{"$f":"'T6'!AU57","v":""},"","","","","",""]
[null,47,null,null,{"$f":"SW!G56","v":0},{"$f":"'T1'!AP58","v":""},{"$f":"'T2'!AP58","v":""},{"$f":"'T3'!AP58","v":""},{"$f":"'T4'!AP58","v":""},{"$f":"'T5'!AP58","v":""},{"$f":"'T6'!AP58","v":""},{"$f":"'T1'!AQ58","v":""},{"$f":"'T2'!AQ58","v":""},{"$f":"'T3'!AQ58","v":""},{"$f":"'T4'!AQ58","v":""},{"$f":"'T5'!AQ58","v":""},{"$f":"'T6'!AQ58","v":""},{"$f":"'T1'!AR58","v":""},{"$f":"'T2'!AR58","v":""},{"$f":"'T3'!AR58","v":""},{"$f":"'T4'!AR58","v":""},{"$f":"'T5'!AR58","v":""},{"$f":"'T6'!AR58","v":""},{"$f":"'T1'!AS58","v":""},{"$f":"'T2'!AS58","v":""},{"$f":"'T3'!AS58","v":""},{"$f":"'T4'!AS58","v":""},{"$f":"'T5'!AS58","v":""},{"$f":"'T6'!AS58","v":""},{"$f":"'T1'!AT58","v":""},{"$f":"'T2'!AT58","v":""},{"$f":"'T3'!AT58","v":""},{"$f":"'T4'!AT58","v":""},{"$f":"'T5'!AT58","v":""},{"$f":"'T6'!AT58","v":""},{"$f":"'T1'!AU58","v":""},{"$f":"'T2'!AU58","v":""},{"$f":"'T3'!AU58","v":""},{"$f":"'T4'!AU58","v":""},{"$f":"'T5'!AU58","v":""},{"$f":"'T6'!AU58","v":""},"","","","","",""]
[null,48,null,null,{"$f":"SW!G57","v":0},{"$f":"'T1'!AP59","v":""},{"$f":"'T2'!AP59","v":""},{"$f":"'T3'!AP59","v":""},{"$f":"'T4'!AP59","v":""},{"$f":"'T5'!AP59","v":""},{"$f":"'T6'!AP59","v":""},{"$f":"'T1'!AQ59","v":""},{"$f":"'T2'!AQ59","v":""},{"$f":"'T3'!AQ59","v":""},{"$f":"'T4'!AQ59","v":""},{"$f":"'T5'!AQ59","v":""},{"$f":"'T6'!AQ59","v":""},{"$f":"'T1'!AR59","v":""},{"$f":"'T2'!AR59","v":""},{"$f":"'T3'!AR59","v":""},{"$f":"'T4'!AR59","v":""},{"$f":"'T5'!AR59","v":""},{"$f":"'T6'!AR59","v":""},{"$f":"'T1'!AS59","v":""},{"$f":"'T2'!AS59","v":""},{"$f":"'T3'!AS59","v":""},{"$f":"'T4'!AS59","v":""},{"$f":"'T5'!AS59","v":""},{"$f":"'T6'!AS59","v":""},{"$f":"'T1'!AT59","v":""},{"$f":"'T2'!AT59","v":""},{"$f":"'T3'!AT59","v":""},{"$f":"'T4'!AT59","v":""},{"$f":"'T5'!AT59","v":""},{"$f":"'T6'!AT59","v":""},{"$f":"'T1'!AU59","v":""},{"$f":"'T2'!AU59","v":""},{"$f":"'T3'!AU59","v":""},{"$f":"'T4'!AU59","v":""},{"$f":"'T5'!AU59","v":""},{"$f":"'T6'!AU59","v":""},"","","","","",""]
[null,49,null,null,{"$f":"SW!G58","v":0},{"$f":"'T1'!AP60","v":""},{"$f":"'T2'!AP60","v":""},{"$f":"'T3'!AP60","v":""},{"$f":"'T4'!AP60","v":""},{"$f":"'T5'!AP60","v":""},{"$f":"'T6'!AP60","v":""},{"$f":"'T1'!AQ60","v":""},{"$f":"'T2'!AQ60","v":""},{"$f":"'T3'!AQ60","v":""},{"$f":"'T4'!AQ60","v":""},{"$f":"'T5'!AQ60","v":""},{"$f":"'T6'!AQ60","v":""},{"$f":"'T1'!AR60","v":""},{"$f":"'T2'!AR60","v":""},{"$f":"'T3'!AR60","v":""},{"$f":"'T4'!AR60","v":""},{"$f":"'T5'!AR60","v":""},{"$f":"'T6'!AR60","v":""},{"$f":"'T1'!AS60","v":""},{"$f":"'T2'!AS60","v":""},{"$f":"'T3'!AS60","v":""},{"$f":"'T4'!AS60","v":""},{"$f":"'T5'!AS60","v":""},{"$f":"'T6'!AS60","v":""},{"$f":"'T1'!AT60","v":""},{"$f":"'T2'!AT60","v":""},{"$f":"'T3'!AT60","v":""},{"$f":"'T4'!AT60","v":""},{"$f":"'T5'!AT60","v":""},{"$f":"'T6'!AT60","v":""},{"$f":"'T1'!AU60","v":""},{"$f":"'T2'!AU60","v":""},{"$f":"'T3'!AU60","v":""},{"$f":"'T4'!AU60","v":""},{"$f":"'T5'!AU60","v":""},{"$f":"'T6'!AU60","v":""},"","","","","",""]
[null,50,null,null,{"$f":"SW!G59","v":0},{"$f":"'T1'!AP61","v":""},{"$f":"'T2'!AP61","v":""},{"$f":"'T3'!AP61","v":""},{"$f":"'T4'!AP61","v":""},{"$f":"'T5'!AP61","v":""},{"$f":"'T6'!AP61","v":""},{"$f":"'T1'!AQ61","v":""},{"$f":"'T2'!AQ61","v":""},{"$f":"'T3'!AQ61","v":""},{"$f":"'T4'!AQ61","v":""},{"$f":"'T5'!AQ61","v":""},{"$f":"'T6'!AQ61","v":""},{"$f":"'T1'!AR61","v":""},{"$f":"'T2'!AR61","v":""},{"$f":"'T3'!AR61","v":""},{"$f":"'T4'!AR61","v":""},{"$f":"'T5'!AR61","v":""},{"$f":"'T6'!AR61","v":""},{"$f":"'T1'!AS61","v":""},{"$f":"'T2'!AS61","v":""},{"$f":"'T3'!AS61","v":""},{"$f":"'T4'!AS61","v":""},{"$f":"'T5'!AS61","v":""},{"$f":"'T6'!AS61","v":""},{"$f":"'T1'!AT61","v":""},{"$f":"'T2'!AT61","v":""},{"$f":"'T3'!AT61","v":""},{"$f":"'T4'!AT61","v":""},{"$f":"'T5'!AT61","v":""},{"$f":"'T6'!AT61","v":""},{"$f":"'T1'!AU61","v":""},{"$f":"'T2'!AU61","v":""},{"$f":"'T3'!AU61","v":""},{"$f":"'T4'!AU61","v":""},{"$f":"'T5'!AU61","v":""},{"$f":"'T6'!AU61","v":""},"","","","","",""]
[null,51,null,null,{"$f":"SW!G60","v":0},{"$f":"'T1'!AP62","v":""},{"$f":"'T2'!AP62","v":""},{"$f":"'T3'!AP62","v":""},{"$f":"'T4'!AP62","v":""},{"$f":"'T5'!AP62","v":""},{"$f":"'T6'!AP62","v":""},{"$f":"'T1'!AQ62","v":""},{"$f":"'T2'!AQ62","v":""},{"$f":"'T3'!AQ62","v":""},{"$f":"'T4'!AQ62","v":""},{"$f":"'T5'!AQ62","v":""},{"$f":"'T6'!AQ62","v":""},{"$f":"'T1'!AR62","v":""},{"$f":"'T2'!AR62","v":""},{"$f":"'T3'!AR62","v":""},{"$f":"'T4'!AR62","v":""},{"$f":"'T5'!AR62","v":""},{"$f":"'T6'!AR62","v":""},{"$f":"'T1'!AS62","v":""},{"$f":"'T2'!AS62","v":""},{"$f":"'T3'!AS62","v":""},{"$f":"'T4'!AS62","v":""},{"$f":"'T5'!AS62","v":""},{"$f":"'T6'!AS62","v":""},{"$f":"'T1'!AT62","v":""},{"$f":"'T2'!AT62","v":""},{"$f":"'T3'!AT62","v":""},{"$f":"'T4'!AT62","v":""},{"$f":"'T5'!AT62","v":""},{"$f":"'T6'!AT62","v":""},{"$f":"'T1'!AU62","v":""},{"$f":"'T2'!AU62","v":""},{"$f":"'T3'!AU62","v":""},{"$f":"'T4'!AU62","v":""},{"$f":"'T5'!AU62","v":""},{"$f":"'T6'!AU62","v":""},"","","","","",""]
[null,52,null,null,{"$f":"SW!G61","v":0},{"$f":"'T1'!AP63","v":""},{"$f":"'T2'!AP63","v":""},{"$f":"'T3'!AP63","v":""},{"$f":"'T4'!AP63","v":""},{"$f":"'T5'!AP63","v":""},{"$f":"'T6'!AP63","v":""},{"$f":"'T1'!AQ63","v":""},{"$f":"'T2'!AQ63","v":""},{"$f":"'T3'!AQ63","v":""},{"$f":"'T4'!AQ63","v":""},{"$f":"'T5'!AQ63","v":""},{"$f":"'T6'!AQ63","v":""},{"$f":"'T1'!AR63","v":""},{"$f":"'T2'!AR63","v":""},{"$f":"'T3'!AR63","v":""},{"$f":"'T4'!AR63","v":""},{"$f":"'T5'!AR63","v":""},{"$f":"'T6'!AR63","v":""},{"$f":"'T1'!AS63","v":""},{"$f":"'T2'!AS63","v":""},{"$f":"'T3'!AS63","v":""},{"$f":"'T4'!AS63","v":""},{"$f":"'T5'!AS63","v":""},{"$f":"'T6'!AS63","v":""},{"$f":"'T1'!AT63","v":""},{"$f":"'T2'!AT63","v":""},{"$f":"'T3'!AT63","v":""},{"$f":"'T4'!AT63","v":""},{"$f":"'T5'!AT63","v":""},{"$f":"'T6'!AT63","v":""},{"$f":"'T1'!AU63","v":""},{"$f":"'T2'!AU63","v":""},{"$f":"'T3'!AU63","v":""},{"$f":"'T4'!AU63","v":""},{"$f":"'T5'!AU63","v":""},{"$f":"'T6'!AU63","v":""},"","","","","",""]
[null,53,null,null,{"$f":"SW!G62","v":0},{"$f":"'T1'!AP64","v":""},{"$f":"'T2'!AP64","v":""},{"$f":"'T3'!AP64","v":""},{"$f":"'T4'!AP64","v":""},{"$f":"'T5'!AP64","v":""},{"$f":"'T6'!AP64","v":""},{"$f":"'T1'!AQ64","v":""},{"$f":"'T2'!AQ64","v":""},{"$f":"'T3'!AQ64","v":""},{"$f":"'T4'!AQ64","v":""},{"$f":"'T5'!AQ64","v":""},{"$f":"'T6'!AQ64","v":""},{"$f":"'T1'!AR64","v":""},{"$f":"'T2'!AR64","v":""},{"$f":"'T3'!AR64","v":""},{"$f":"'T4'!AR64","v":""},{"$f":"'T5'!AR64","v":""},{"$f":"'T6'!AR64","v":""},{"$f":"'T1'!AS64","v":""},{"$f":"'T2'!AS64","v":""},{"$f":"'T3'!AS64","v":""},{"$f":"'T4'!AS64","v":""},{"$f":"'T5'!AS64","v":""},{"$f":"'T6'!AS64","v":""},{"$f":"'T1'!AT64","v":""},{"$f":"'T2'!AT64","v":""},{"$f":"'T3'!AT64","v":""},{"$f":"'T4'!AT64","v":""},{"$f":"'T5'!AT64","v":""},{"$f":"'T6'!AT64","v":""},{"$f":"'T1'!AU64","v":""},{"$f":"'T2'!AU64","v":""},{"$f":"'T3'!AU64","v":""},{"$f":"'T4'!AU64","v":""},{"$f":"'T5'!AU64","v":""},{"$f":"'T6'!AU64","v":""},"","","","","",""]
[null,54,null,null,{"$f":"SW!G63","v":0},{"$f":"'T1'!AP65","v":""},{"$f":"'T2'!AP65","v":""},{"$f":"'T3'!AP65","v":""},{"$f":"'T4'!AP65","v":""},{"$f":"'T5'!AP65","v":""},{"$f":"'T6'!AP65","v":""},{"$f":"'T1'!AQ65","v":""},{"$f":"'T2'!AQ65","v":""},{"$f":"'T3'!AQ65","v":""},{"$f":"'T4'!AQ65","v":""},{"$f":"'T5'!AQ65","v":""},{"$f":"'T6'!AQ65","v":""},{"$f":"'T1'!AR65","v":""},{"$f":"'T2'!AR65","v":""},{"$f":"'T3'!AR65","v":""},{"$f":"'T4'!AR65","v":""},{"$f":"'T5'!AR65","v":""},{"$f":"'T6'!AR65","v":""},{"$f":"'T1'!AS65","v":""},{"$f":"'T2'!AS65","v":""},{"$f":"'T3'!AS65","v":""},{"$f":"'T4'!AS65","v":""},{"$f":"'T5'!AS65","v":""},{"$f":"'T6'!AS65","v":""},{"$f":"'T1'!AT65","v":""},{"$f":"'T2'!AT65","v":""},{"$f":"'T3'!AT65","v":""},{"$f":"'T4'!AT65","v":""},{"$f":"'T5'!AT65","v":""},{"$f":"'T6'!AT65","v":""},{"$f":"'T1'!AU65","v":""},{"$f":"'T2'!AU65","v":""},{"$f":"'T3'!AU65","v":""},{"$f":"'T4'!AU65","v":""},{"$f":"'T5'!AU65","v":""},{"$f":"'T6'!AU65","v":""},"","","","","",""]
[null,55,null,null,{"$f":"SW!G64","v":0},{"$f":"'T1'!AP66","v":""},{"$f":"'T2'!AP66","v":""},{"$f":"'T3'!AP66","v":""},{"$f":"'T4'!AP66","v":""},{"$f":"'T5'!AP66","v":""},{"$f":"'T6'!AP66","v":""},{"$f":"'T1'!AQ66","v":""},{"$f":"'T2'!AQ66","v":""},{"$f":"'T3'!AQ66","v":""},{"$f":"'T4'!AQ66","v":""},{"$f":"'T5'!AQ66","v":""},{"$f":"'T6'!AQ66","v":""},{"$f":"'T1'!AR66","v":""},{"$f":"'T2'!AR66","v":""},{"$f":"'T3'!AR66","v":""},{"$f":"'T4'!AR66","v":""},{"$f":"'T5'!AR66","v":""},{"$f":"'T6'!AR66","v":""},{"$f":"'T1'!AS66","v":""},{"$f":"'T2'!AS66","v":""},{"$f":"'T3'!AS66","v":""},{"$f":"'T4'!AS66","v":""},{"$f":"'T5'!AS66","v":""},{"$f":"'T6'!AS66","v":""},{"$f":"'T1'!AT66","v":""},{"$f":"'T2'!AT66","v":""},{"$f":"'T3'!AT66","v":""},{"$f":"'T4'!AT66","v":""},{"$f":"'T5'!AT66","v":""},{"$f":"'T6'!AT66","v":""},{"$f":"'T1'!AU66","v":""},{"$f":"'T2'!AU66","v":""},{"$f":"'T3'!AU66","v":""},{"$f":"'T4'!AU66","v":""},{"$f":"'T5'!AU66","v":""},{"$f":"'T6'!AU66","v":""},"","","","","",""]
[null,56,null,null,{"$f":"SW!G65","v":0},{"$f":"'T1'!AP67","v":""},{"$f":"'T2'!AP67","v":""},{"$f":"'T3'!AP67","v":""},{"$f":"'T4'!AP67","v":""},{"$f":"'T5'!AP67","v":""},{"$f":"'T6'!AP67","v":""},{"$f":"'T1'!AQ67","v":""},{"$f":"'T2'!AQ67","v":""},{"$f":"'T3'!AQ67","v":""},{"$f":"'T4'!AQ67","v":""},{"$f":"'T5'!AQ67","v":""},{"$f":"'T6'!AQ67","v":""},{"$f":"'T1'!AR67","v":""},{"$f":"'T2'!AR67","v":""},{"$f":"'T3'!AR67","v":""},{"$f":"'T4'!AR67","v":""},{"$f":"'T5'!AR67","v":""},{"$f":"'T6'!AR67","v":""},{"$f":"'T1'!AS67","v":""},{"$f":"'T2'!AS67","v":""},{"$f":"'T3'!AS67","v":""},{"$f":"'T4'!AS67","v":""},{"$f":"'T5'!AS67","v":""},{"$f":"'T6'!AS67","v":""},{"$f":"'T1'!AT67","v":""},{"$f":"'T2'!AT67","v":""},{"$f":"'T3'!AT67","v":""},{"$f":"'T4'!AT67","v":""},{"$f":"'T5'!AT67","v":""},{"$f":"'T6'!AT67","v":""},{"$f":"'T1'!AU67","v":""},{"$f":"'T2'!AU67","v":""},{"$f":"'T3'!AU67","v":""},{"$f":"'T4'!AU67","v":""},{"$f":"'T5'!AU67","v":""},{"$f":"'T6'!AU67","v":""},"","","","","",""]
[null,57,null,null,{"$f":"SW!G66","v":0},{"$f":"'T1'!AP68","v":""},{"$f":"'T2'!AP68","v":""},{"$f":"'T3'!AP68","v":""},{"$f":"'T4'!AP68","v":""},{"$f":"'T5'!AP68","v":""},{"$f":"'T6'!AP68","v":""},{"$f":"'T1'!AQ68","v":""},{"$f":"'T2'!AQ68","v":""},{"$f":"'T3'!AQ68","v":""},{"$f":"'T4'!AQ68","v":""},{"$f":"'T5'!AQ68","v":""},{"$f":"'T6'!AQ68","v":""},{"$f":"'T1'!AR68","v":""},{"$f":"'T2'!AR68","v":""},{"$f":"'T3'!AR68","v":""},{"$f":"'T4'!AR68","v":""},{"$f":"'T5'!AR68","v":""},{"$f":"'T6'!AR68","v":""},{"$f":"'T1'!AS68","v":""},{"$f":"'T2'!AS68","v":""},{"$f":"'T3'!AS68","v":""},{"$f":"'T4'!AS68","v":""},{"$f":"'T5'!AS68","v":""},{"$f":"'T6'!AS68","v":""},{"$f":"'T1'!AT68","v":""},{"$f":"'T2'!AT68","v":""},{"$f":"'T3'!AT68","v":""},{"$f":"'T4'!AT68","v":""},{"$f":"'T5'!AT68","v":""},{"$f":"'T6'!AT68","v":""},{"$f":"'T1'!AU68","v":""},{"$f":"'T2'!AU68","v":""},{"$f":"'T3'!AU68","v":""},{"$f":"'T4'!AU68","v":""},{"$f":"'T5'!AU68","v":""},{"$f":"'T6'!AU68","v":""},"","","","","",""]
[null,58,null,null,{"$f":"SW!G67","v":0},{"$f":"'T1'!AP69","v":""},{"$f":"'T2'!AP69","v":""},{"$f":"'T3'!AP69","v":""},{"$f":"'T4'!AP69","v":""},{"$f":"'T5'!AP69","v":""},{"$f":"'T6'!AP69","v":""},{"$f":"'T1'!AQ69","v":""},{"$f":"'T2'!AQ69","v":""},{"$f":"'T3'!AQ69","v":""},{"$f":"'T4'!AQ69","v":""},{"$f":"'T5'!AQ69","v":""},{"$f":"'T6'!AQ69","v":""},{"$f":"'T1'!AR69","v":""},{"$f":"'T2'!AR69","v":""},{"$f":"'T3'!AR69","v":""},{"$f":"'T4'!AR69","v":""},{"$f":"'T5'!AR69","v":""},{"$f":"'T6'!AR69","v":""},{"$f":"'T1'!AS69","v":""},{"$f":"'T2'!AS69","v":""},{"$f":"'T3'!AS69","v":""},{"$f":"'T4'!AS69","v":""},{"$f":"'T5'!AS69","v":""},{"$f":"'T6'!AS69","v":""},{"$f":"'T1'!AT69","v":""},{"$f":"'T2'!AT69","v":""},{"$f":"'T3'!AT69","v":""},{"$f":"'T4'!AT69","v":""},{"$f":"'T5'!AT69","v":""},{"$f":"'T6'!AT69","v":""},{"$f":"'T1'!AU69","v":""},{"$f":"'T2'!AU69","v":""},{"$f":"'T3'!AU69","v":""},{"$f":"'T4'!AU69","v":""},{"$f":"'T5'!AU69","v":""},{"$f":"'T6'!AU69","v":""},"","","","","",""]
[null,59,null,null,{"$f":"SW!G68","v":0},{"$f":"'T1'!AP70","v":""},{"$f":"'T2'!AP70","v":""},{"$f":"'T3'!AP70","v":""},{"$f":"'T4'!AP70","v":""},{"$f":"'T5'!AP70","v":""},{"$f":"'T6'!AP70","v":""},{"$f":"'T1'!AQ70","v":""},{"$f":"'T2'!AQ70","v":""},{"$f":"'T3'!AQ70","v":""},{"$f":"'T4'!AQ70","v":""},{"$f":"'T5'!AQ70","v":""},{"$f":"'T6'!AQ70","v":""},{"$f":"'T1'!AR70","v":""},{"$f":"'T2'!AR70","v":""},{"$f":"'T3'!AR70","v":""},{"$f":"'T4'!AR70","v":""},{"$f":"'T5'!AR70","v":""},{"$f":"'T6'!AR70","v":""},{"$f":"'T1'!AS70","v":""},{"$f":"'T2'!AS70","v":""},{"$f":"'T3'!AS70","v":""},{"$f":"'T4'!AS70","v":""},{"$f":"'T5'!AS70","v":""},{"$f":"'T6'!AS70","v":""},{"$f":"'T1'!AT70","v":""},{"$f":"'T2'!AT70","v":""},{"$f":"'T3'!AT70","v":""},{"$f":"'T4'!AT70","v":""},{"$f":"'T5'!AT70","v":""},{"$f":"'T6'!AT70","v":""},{"$f":"'T1'!AU70","v":""},{"$f":"'T2'!AU70","v":""},{"$f":"'T3'!AU70","v":""},{"$f":"'T4'!AU70","v":""},{"$f":"'T5'!AU70","v":""},{"$f":"'T6'!AU70","v":""},"","","","","",""]
[null,60,null,null,{"$f":"SW!G69","v":0},{"$f":"'T1'!AP71","v":""},{"$f":"'T2'!AP71","v":""},{"$f":"'T3'!AP71","v":""},{"$f":"'T4'!AP71","v":""},{"$f":"'T5'!AP71","v":""},{"$f":"'T6'!AP71","v":""},{"$f":"'T1'!AQ71","v":""},{"$f":"'T2'!AQ71","v":""},{"$f":"'T3'!AQ71","v":""},{"$f":"'T4'!AQ71","v":""},{"$f":"'T5'!AQ71","v":""},{"$f":"'T6'!AQ71","v":""},{"$f":"'T1'!AR71","v":""},{"$f":"'T2'!AR71","v":""},{"$f":"'T3'!AR71","v":""},{"$f":"'T4'!AR71","v":""},{"$f":"'T5'!AR71","v":""},{"$f":"'T6'!AR71","v":""},{"$f":"'T1'!AS71","v":""},{"$f":"'T2'!AS71","v":""},{"$f":"'T3'!AS71","v":""},{"$f":"'T4'!AS71","v":""},{"$f":"'T5'!AS71","v":""},{"$f":"'T6'!AS71","v":""},{"$f":"'T1'!AT71","v":""},{"$f":"'T2'!AT71","v":""},{"$f":"'T3'!AT71","v":""},{"$f":"'T4'!AT71","v":""},{"$f":"'T5'!AT71","v":""},{"$f":"'T6'!AT71","v":""},{"$f":"'T1'!AU71","v":""},{"$f":"'T2'!AU71","v":""},{"$f":"'T3'!AU71","v":""},{"$f":"'T4'!AU71","v":""},{"$f":"'T5'!AU71","v":""},{"$f":"'T6'!AU71","v":""},"","","","","",""]
[null,61,null,null,{"$f":"SW!G70","v":0},{"$f":"'T1'!AP72","v":""},{"$f":"'T2'!AP72","v":""},{"$f":"'T3'!AP72","v":""},{"$f":"'T4'!AP72","v":""},{"$f":"'T5'!AP72","v":""},{"$f":"'T6'!AP72","v":""},{"$f":"'T1'!AQ72","v":""},{"$f":"'T2'!AQ72","v":""},{"$f":"'T3'!AQ72","v":""},{"$f":"'T4'!AQ72","v":""},{"$f":"'T5'!AQ72","v":""},{"$f":"'T6'!AQ72","v":""},{"$f":"'T1'!AR72","v":""},{"$f":"'T2'!AR72","v":""},{"$f":"'T3'!AR72","v":""},{"$f":"'T4'!AR72","v":""},{"$f":"'T5'!AR72","v":""},{"$f":"'T6'!AR72","v":""},{"$f":"'T1'!AS72","v":""},{"$f":"'T2'!AS72","v":""},{"$f":"'T3'!AS72","v":""},{"$f":"'T4'!AS72","v":""},{"$f":"'T5'!AS72","v":""},{"$f":"'T6'!AS72","v":""},{"$f":"'T1'!AT72","v":""},{"$f":"'T2'!AT72","v":""},{"$f":"'T3'!AT72","v":""},{"$f":"'T4'!AT72","v":""},{"$f":"'T5'!AT72","v":""},{"$f":"'T6'!AT72","v":""},{"$f":"'T1'!AU72","v":""},{"$f":"'T2'!AU72","v":""},{"$f":"'T3'!AU72","v":""},{"$f":"'T4'!AU72","v":""},{"$f":"'T5'!AU72","v":""},{"$f":"'T6'!AU72","v":""},"","","","","",""]
[null,62,null,null,{"$f":"SW!G71","v":0},{"$f":"'T1'!AP73","v":""},{"$f":"'T2'!AP73","v":""},{"$f":"'T3'!AP73","v":""},{"$f":"'T4'!AP73","v":""},{"$f":"'T5'!AP73","v":""},{"$f":"'T6'!AP73","v":""},{"$f":"'T1'!AQ73","v":""},{"$f":"'T2'!AQ73","v":""},{"$f":"'T3'!AQ73","v":""},{"$f":"'T4'!AQ73","v":""},{"$f":"'T5'!AQ73","v":""},{"$f":"'T6'!AQ73","v":""},{"$f":"'T1'!AR73","v":""},{"$f":"'T2'!AR73","v":""},{"$f":"'T3'!AR73","v":""},{"$f":"'T4'!AR73","v":""},{"$f":"'T5'!AR73","v":""},{"$f":"'T6'!AR73","v":""},{"$f":"'T1'!AS73","v":""},{"$f":"'T2'!AS73","v":""},{"$f":"'T3'!AS73","v":""},{"$f":"'T4'!AS73","v":""},{"$f":"'T5'!AS73","v":""},{"$f":"'T6'!AS73","v":""},{"$f":"'T1'!AT73","v":""},{"$f":"'T2'!AT73","v":""},{"$f":"'T3'!AT73","v":""},{"$f":"'T4'!AT73","v":""},{"$f":"'T5'!AT73","v":""},{"$f":"'T6'!AT73","v":""},{"$f":"'T1'!AU73","v":""},{"$f":"'T2'!AU73","v":""},{"$f":"'T3'!AU73","v":""},{"$f":"'T4'!AU73","v":""},{"$f":"'T5'!AU73","v":""},{"$f":"'T6'!AU73","v":""},"","","","","",""]
[null,63,null,null,{"$f":"SW!G72","v":0},{"$f":"'T1'!AP74","v":""},{"$f":"'T2'!AP74","v":""},{"$f":"'T3'!AP74","v":""},{"$f":"'T4'!AP74","v":""},{"$f":"'T5'!AP74","v":""},{"$f":"'T6'!AP74","v":""},{"$f":"'T1'!AQ74","v":""},{"$f":"'T2'!AQ74","v":""},{"$f":"'T3'!AQ74","v":""},{"$f":"'T4'!AQ74","v":""},{"$f":"'T5'!AQ74","v":""},{"$f":"'T6'!AQ74","v":""},{"$f":"'T1'!AR74","v":""},{"$f":"'T2'!AR74","v":""},{"$f":"'T3'!AR74","v":""},{"$f":"'T4'!AR74","v":""},{"$f":"'T5'!AR74","v":""},{"$f":"'T6'!AR74","v":""},{"$f":"'T1'!AS74","v":""},{"$f":"'T2'!AS74","v":""},{"$f":"'T3'!AS74","v":""},{"$f":"'T4'!AS74","v":""},{"$f":"'T5'!AS74","v":""},{"$f":"'T6'!AS74","v":""},{"$f":"'T1'!AT74","v":""},{"$f":"'T2'!AT74","v":""},{"$f":"'T3'!AT74","v":""},{"$f":"'T4'!AT74","v":""},{"$f":"'T5'!AT74","v":""},{"$f":"'T6'!AT74","v":""},{"$f":"'T1'!AU74","v":""},{"$f":"'T2'!AU74","v":""},{"$f":"'T3'!AU74","v":""},{"$f":"'T4'!AU74","v":""},{"$f":"'T5'!AU74","v":""},{"$f":"'T6'!AU74","v":""},"","","","","",""]
[null,64,null,null,{"$f":"SW!G73","v":0},{"$f":"'T1'!AP75","v":""},{"$f":"'T2'!AP75","v":""},{"$f":"'T3'!AP75","v":""},{"$f":"'T4'!AP75","v":""},{"$f":"'T5'!AP75","v":""},{"$f":"'T6'!AP75","v":""},{"$f":"'T1'!AQ75","v":""},{"$f":"'T2'!AQ75","v":""},{"$f":"'T3'!AQ75","v":""},{"$f":"'T4'!AQ75","v":""},{"$f":"'T5'!AQ75","v":""},{"$f":"'T6'!AQ75","v":""},{"$f":"'T1'!AR75","v":""},{"$f":"'T2'!AR75","v":""},{"$f":"'T3'!AR75","v":""},{"$f":"'T4'!AR75","v":""},{"$f":"'T5'!AR75","v":""},{"$f":"'T6'!AR75","v":""},{"$f":"'T1'!AS75","v":""},{"$f":"'T2'!AS75","v":""},{"$f":"'T3'!AS75","v":""},{"$f":"'T4'!AS75","v":""},{"$f":"'T5'!AS75","v":""},{"$f":"'T6'!AS75","v":""},{"$f":"'T1'!AT75","v":""},{"$f":"'T2'!AT75","v":""},{"$f":"'T3'!AT75","v":""},{"$f":"'T4'!AT75","v":""},{"$f":"'T5'!AT75","v":""},{"$f":"'T6'!AT75","v":""},{"$f":"'T1'!AU75","v":""},{"$f":"'T2'!AU75","v":""},{"$f":"'T3'!AU75","v":""},{"$f":"'T4'!AU75","v":""},{"$f":"'T5'!AU75","v":""},{"$f":"'T6'!AU75","v":""},"","","","","",""]
[null,65,null,null,{"$f":"SW!G74","v":0},{"$f":"'T1'!AP76","v":""},{"$f":"'T2'!AP76","v":""},{"$f":"'T3'!AP76","v":""},{"$f":"'T4'!AP76","v":""},{"$f":"'T5'!AP76","v":""},{"$f":"'T6'!AP76","v":""},{"$f":"'T1'!AQ76","v":""},{"$f":"'T2'!AQ76","v":""},{"$f":"'T3'!AQ76","v":""},{"$f":"'T4'!AQ76","v":""},{"$f":"'T5'!AQ76","v":""},{"$f":"'T6'!AQ76","v":""},{"$f":"'T1'!AR76","v":""},{"$f":"'T2'!AR76","v":""},{"$f":"'T3'!AR76","v":""},{"$f":"'T4'!AR76","v":""},{"$f":"'T5'!AR76","v":""},{"$f":"'T6'!AR76","v":""},{"$f":"'T1'!AS76","v":""},{"$f":"'T2'!AS76","v":""},{"$f":"'T3'!AS76","v":""},{"$f":"'T4'!AS76","v":""},{"$f":"'T5'!AS76","v":""},{"$f":"'T6'!AS76","v":""},{"$f":"'T1'!AT76","v":""},{"$f":"'T2'!AT76","v":""},{"$f":"'T3'!AT76","v":""},{"$f":"'T4'!AT76","v":""},{"$f":"'T5'!AT76","v":""},{"$f":"'T6'!AT76","v":""},{"$f":"'T1'!AU76","v":""},{"$f":"'T2'!AU76","v":""},{"$f":"'T3'!AU76","v":""},{"$f":"'T4'!AU76","v":""},{"$f":"'T5'!AU76","v":""},{"$f":"'T6'!AU76","v":""},"","","","","",""]
[null,66,null,null,{"$f":"SW!G75","v":0},{"$f":"'T1'!AP77","v":""},{"$f":"'T2'!AP77","v":""},{"$f":"'T3'!AP77","v":""},{"$f":"'T4'!AP77","v":""},{"$f":"'T5'!AP77","v":""},{"$f":"'T6'!AP77","v":""},{"$f":"'T1'!AQ77","v":""},{"$f":"'T2'!AQ77","v":""},{"$f":"'T3'!AQ77","v":""},{"$f":"'T4'!AQ77","v":""},{"$f":"'T5'!AQ77","v":""},{"$f":"'T6'!AQ77","v":""},{"$f":"'T1'!AR77","v":""},{"$f":"'T2'!AR77","v":""},{"$f":"'T3'!AR77","v":""},{"$f":"'T4'!AR77","v":""},{"$f":"'T5'!AR77","v":""},{"$f":"'T6'!AR77","v":""},{"$f":"'T1'!AS77","v":""},{"$f":"'T2'!AS77","v":""},{"$f":"'T3'!AS77","v":""},{"$f":"'T4'!AS77","v":""},{"$f":"'T5'!AS77","v":""},{"$f":"'T6'!AS77","v":""},{"$f":"'T1'!AT77","v":""},{"$f":"'T2'!AT77","v":""},{"$f":"'T3'!AT77","v":""},{"$f":"'T4'!AT77","v":""},{"$f":"'T5'!AT77","v":""},{"$f":"'T6'!AT77","v":""},{"$f":"'T1'!AU77","v":""},{"$f":"'T2'!AU77","v":""},{"$f":"'T3'!AU77","v":""},{"$f":"'T4'!AU77","v":""},{"$f":"'T5'!AU77","v":""},{"$f":"'T6'!AU77","v":""},{"$f":"IFERROR(ROUND(AVERAGE(F76:K76),0),\"\")","v":""},{"$f":"IFERROR(ROUND(AVERAGE(L76:Q76),0),\"\")","v":""},{"$f":"IFERROR(ROUND(AVERAGE(R76:W76),0),\"\")","v":""},{"$f":"IFERROR(ROUND(AVERAGE(X76:AC76),0),\"\")","v":""},{"$f":"IFERROR(ROUND(AVERAGE(AD76:AI76),0),\"\")","v":""},{"$f":"IFERROR(ROUND(AVERAGE(AJ76:AO76),0),\"\")","v":""}]
[null,67,null,null,{"$f":"SW!G76","v":0},{"$f":"'T1'!AP78","v":""},{"$f":"'T2'!AP78","v":""},{"$f":"'T3'!AP78","v":""},{"$f":"'T4'!AP78","v":""},{"$f":"'T5'!AP78","v":""},{"$f":"'T6'!AP78","v":""},{"$f":"'T1'!AQ78","v":""},{"$f":"'T2'!AQ78","v":""},{"$f":"'T3'!AQ78","v":""},{"$f":"'T4'!AQ78","v":""},{"$f":"'T5'!AQ78","v":""},{"$f":"'T6'!AQ78","v":""},{"$f":"'T1'!AR78","v":""},{"$f":"'T2'!AR78","v":""},{"$f":"'T3'!AR78","v":""},{"$f":"'T4'!AR78","v":""},{"$f":"'T5'!AR78","v":""},{"$f":"'T6'!AR78","v":""},{"$f":"'T1'!AS78","v":""},{"$f":"'T2'!AS78","v":""},{"$f":"'T3'!AS78","v":""},{"$f":"'T4'!AS78","v":""},{"$f":"'T5'!AS78","v":""},{"$f":"'T6'!AS78","v":""},{"$f":"'T1'!AT78","v":""},{"$f":"'T2'!AT78","v":""},{"$f":"'T3'!AT78","v":""},{"$f":"'T4'!AT78","v":""},{"$f":"'T5'!AT78","v":""},{"$f":"'T6'!AT78","v":""},{"$f":"'T1'!AU78","v":""},{"$f":"'T2'!AU78","v":""},{"$f":"'T3'!AU78","v":""},{"$f":"'T4'!AU78","v":""},{"$f":"'T5'!AU78","v":""},{"$f":"'T6'!AU78","v":""},"","","","","",""]
[null,68,null,null,{"$f":"SW!G77","v":0},{"$f":"'T1'!AP79","v":""},{"$f":"'T2'!AP79","v":""},{"$f":"'T3'!AP79","v":""},{"$f":"'T4'!AP79","v":""},{"$f":"'T5'!AP79","v":""},{"$f":"'T6'!AP79","v":""},{"$f":"'T1'!AQ79","v":""},{"$f":"'T2'!AQ79","v":""},{"$f":"'T3'!AQ79","v":""},{"$f":"'T4'!AQ79","v":""},{"$f":"'T5'!AQ79","v":""},{"$f":"'T6'!AQ79","v":""},{"$f":"'T1'!AR79","v":""},{"$f":"'T2'!AR79","v":""},{"$f":"'T3'!AR79","v":""},{"$f":"'T4'!AR79","v":""},{"$f":"'T5'!AR79","v":""},{"$f":"'T6'!AR79","v":""},{"$f":"'T1'!AS79","v":""},{"$f":"'T2'!AS79","v":""},{"$f":"'T3'!AS79","v":""},{"$f":"'T4'!AS79","v":""},{"$f":"'T5'!AS79","v":""},{"$f":"'T6'!AS79","v":""},{"$f":"'T1'!AT79","v":""},{"$f":"'T2'!AT79","v":""},{"$f":"'T3'!AT79","v":""},{"$f":"'T4'!AT79","v":""},{"$f":"'T5'!AT79","v":""},{"$f":"'T6'!AT79","v":""},{"$f":"'T1'!AU79","v":""},{"$f":"'T2'!AU79","v":""},{"$f":"'T3'!AU79","v":""},{"$f":"'T4'!AU79","v":""},{"$f":"'T5'!AU79","v":""},{"$f":"'T6'!AU79","v":""},"","","","","",""]
[null,69,null,null,{"$f":"SW!G78","v":0},{"$f":"'T1'!AP80","v":""},{"$f":"'T2'!AP80","v":""},{"$f":"'T3'!AP80","v":""},{"$f":"'T4'!AP80","v":""},{"$f":"'T5'!AP80","v":""},{"$f":"'T6'!AP80","v":""},{"$f":"'T1'!AQ80","v":""},{"$f":"'T2'!AQ80","v":""},{"$f":"'T3'!AQ80","v":""},{"$f":"'T4'!AQ80","v":""},{"$f":"'T5'!AQ80","v":""},{"$f":"'T6'!AQ80","v":""},{"$f":"'T1'!AR80","v":""},{"$f":"'T2'!AR80","v":""},{"$f":"'T3'!AR80","v":""},{"$f":"'T4'!AR80","v":""},{"$f":"'T5'!AR80","v":""},{"$f":"'T6'!AR80","v":""},{"$f":"'T1'!AS80","v":""},{"$f":"'T2'!AS80","v":""},{"$f":"'T3'!AS80","v":""},{"$f":"'T4'!AS80","v":""},{"$f":"'T5'!AS80","v":""},{"$f":"'T6'!AS80","v":""},{"$f":"'T1'!AT80","v":""},{"$f":"'T2'!AT80","v":""},{"$f":"'T3'!AT80","v":""},{"$f":"'T4'!AT80","v":""},{"$f":"'T5'!AT80","v":""},{"$f":"'T6'!AT80","v":""},{"$f":"'T1'!AU80","v":""},{"$f":"'T2'!AU80","v":""},{"$f":"'T3'!AU80","v":""},{"$f":"'T4'!AU80","v":""},{"$f":"'T5'!AU80","v":""},{"$f":"'T6'!AU80","v":""},"","","","","",""]
[null,70,null,null,{"$f":"SW!G79","v":0},{"$f":"'T1'!AP81","v":""},{"$f":"'T2'!AP81","v":""},{"$f":"'T3'!AP81","v":""},{"$f":"'T4'!AP81","v":""},{"$f":"'T5'!AP81","v":""},{"$f":"'T6'!AP81","v":""},{"$f":"'T1'!AQ81","v":""},{"$f":"'T2'!AQ81","v":""},{"$f":"'T3'!AQ81","v":""},{"$f":"'T4'!AQ81","v":""},{"$f":"'T5'!AQ81","v":""},{"$f":"'T6'!AQ81","v":""},{"$f":"'T1'!AR81","v":""},{"$f":"'T2'!AR81","v":""},{"$f":"'T3'!AR81","v":""},{"$f":"'T4'!AR81","v":""},{"$f":"'T5'!AR81","v":""},{"$f":"'T6'!AR81","v":""},{"$f":"'T1'!AS81","v":""},{"$f":"'T2'!AS81","v":""},{"$f":"'T3'!AS81","v":""},{"$f":"'T4'!AS81","v":""},{"$f":"'T5'!AS81","v":""},{"$f":"'T6'!AS81","v":""},{"$f":"'T1'!AT81","v":""},{"$f":"'T2'!AT81","v":""},{"$f":"'T3'!AT81","v":""},{"$f":"'T4'!AT81","v":""},{"$f":"'T5'!AT81","v":""},{"$f":"'T6'!AT81","v":""},{"$f":"'T1'!AU81","v":""},{"$f":"'T2'!AU81","v":""},{"$f":"'T3'!AU81","v":""},{"$f":"'T4'!AU81","v":""},{"$f":"'T5'!AU81","v":""},{"$f":"'T6'!AU81","v":""},"","","","","",""]
[null,71,null,null,{"$f":"SW!G80","v":0},{"$f":"'T1'!AP82","v":""},{"$f":"'T2'!AP82","v":""},{"$f":"'T3'!AP82","v":""},{"$f":"'T4'!AP82","v":""},{"$f":"'T5'!AP82","v":""},{"$f":"'T6'!AP82","v":""},{"$f":"'T1'!AQ82","v":""},{"$f":"'T2'!AQ82","v":""},{"$f":"'T3'!AQ82","v":""},{"$f":"'T4'!AQ82","v":""},{"$f":"'T5'!AQ82","v":""},{"$f":"'T6'!AQ82","v":""},{"$f":"'T1'!AR82","v":""},{"$f":"'T2'!AR82","v":""},{"$f":"'T3'!AR82","v":""},{"$f":"'T4'!AR82","v":""},{"$f":"'T5'!AR82","v":""},{"$f":"'T6'!AR82","v":""},{"$f":"'T1'!AS82","v":""},{"$f":"'T2'!AS82","v":""},{"$f":"'T3'!AS82","v":""},{"$f":"'T4'!AS82","v":""},{"$f":"'T5'!AS82","v":""},{"$f":"'T6'!AS82","v":""},{"$f":"'T1'!AT82","v":""},{"$f":"'T2'!AT82","v":""},{"$f":"'T3'!AT82","v":""},{"$f":"'T4'!AT82","v":""},{"$f":"'T5'!AT82","v":""},{"$f":"'T6'!AT82","v":""},{"$f":"'T1'!AU82","v":""},{"$f":"'T2'!AU82","v":""},{"$f":"'T3'!AU82","v":""},{"$f":"'T4'!AU82","v":""},{"$f":"'T5'!AU82","v":""},{"$f":"'T6'!AU82","v":""},"","","","","",""]
[null,72,null,null,{"$f":"SW!G81","v":0},{"$f":"'T1'!AP83","v":""},{"$f":"'T2'!AP83","v":""},{"$f":"'T3'!AP83","v":""},{"$f":"'T4'!AP83","v":""},{"$f":"'T5'!AP83","v":""},{"$f":"'T6'!AP83","v":""},{"$f":"'T1'!AQ83","v":""},{"$f":"'T2'!AQ83","v":""},{"$f":"'T3'!AQ83","v":""},{"$f":"'T4'!AQ83","v":""},{"$f":"'T5'!AQ83","v":""},{"$f":"'T6'!AQ83","v":""},{"$f":"'T1'!AR83","v":""},{"$f":"'T2'!AR83","v":""},{"$f":"'T3'!AR83","v":""},{"$f":"'T4'!AR83","v":""},{"$f":"'T5'!AR83","v":""},{"$f":"'T6'!AR83","v":""},{"$f":"'T1'!AS83","v":""},{"$f":"'T2'!AS83","v":""},{"$f":"'T3'!AS83","v":""},{"$f":"'T4'!AS83","v":""},{"$f":"'T5'!AS83","v":""},{"$f":"'T6'!AS83","v":""},{"$f":"'T1'!AT83","v":""},{"$f":"'T2'!AT83","v":""},{"$f":"'T3'!AT83","v":""},{"$f":"'T4'!AT83","v":""},{"$f":"'T5'!AT83","v":""},{"$f":"'T6'!AT83","v":""},{"$f":"'T1'!AU83","v":""},{"$f":"'T2'!AU83","v":""},{"$f":"'T3'!AU83","v":""},{"$f":"'T4'!AU83","v":""},{"$f":"'T5'!AU83","v":""},{"$f":"'T6'!AU83","v":""},"","","","","",""]
[null,73,null,null,{"$f":"SW!G82","v":0},{"$f":"'T1'!AP84","v":""},{"$f":"'T2'!AP84","v":""},{"$f":"'T3'!AP84","v":""},{"$f":"'T4'!AP84","v":""},{"$f":"'T5'!AP84","v":""},{"$f":"'T6'!AP84","v":""},{"$f":"'T1'!AQ84","v":""},{"$f":"'T2'!AQ84","v":""},{"$f":"'T3'!AQ84","v":""},{"$f":"'T4'!AQ84","v":""},{"$f":"'T5'!AQ84","v":""},{"$f":"'T6'!AQ84","v":""},{"$f":"'T1'!AR84","v":""},{"$f":"'T2'!AR84","v":""},{"$f":"'T3'!AR84","v":""},{"$f":"'T4'!AR84","v":""},{"$f":"'T5'!AR84","v":""},{"$f":"'T6'!AR84","v":""},{"$f":"'T1'!AS84","v":""},{"$f":"'T2'!AS84","v":""},{"$f":"'T3'!AS84","v":""},{"$f":"'T4'!AS84","v":""},{"$f":"'T5'!AS84","v":""},{"$f":"'T6'!AS84","v":""},{"$f":"'T1'!AT84","v":""},{"$f":"'T2'!AT84","v":""},{"$f":"'T3'!AT84","v":""},{"$f":"'T4'!AT84","v":""},{"$f":"'T5'!AT84","v":""},{"$f":"'T6'!AT84","v":""},{"$f":"'T1'!AU84","v":""},{"$f":"'T2'!AU84","v":""},{"$f":"'T3'!AU84","v":""},{"$f":"'T4'!AU84","v":""},{"$f":"'T5'!AU84","v":""},{"$f":"'T6'!AU84","v":""},"","","","","",""]
[null,74,null,null,{"$f":"SW!G83","v":0},{"$f":"'T1'!AP85","v":""},{"$f":"'T2'!AP85","v":""},{"$f":"'T3'!AP85","v":""},{"$f":"'T4'!AP85","v":""},{"$f":"'T5'!AP85","v":""},{"$f":"'T6'!AP85","v":""},{"$f":"'T1'!AQ85","v":""},{"$f":"'T2'!AQ85","v":""},{"$f":"'T3'!AQ85","v":""},{"$f":"'T4'!AQ85","v":""},{"$f":"'T5'!AQ85","v":""},{"$f":"'T6'!AQ85","v":""},{"$f":"'T1'!AR85","v":""},{"$f":"'T2'!AR85","v":""},{"$f":"'T3'!AR85","v":""},{"$f":"'T4'!AR85","v":""},{"$f":"'T5'!AR85","v":""},{"$f":"'T6'!AR85","v":""},{"$f":"'T1'!AS85","v":""},{"$f":"'T2'!AS85","v":""},{"$f":"'T3'!AS85","v":""},{"$f":"'T4'!AS85","v":""},{"$f":"'T5'!AS85","v":""},{"$f":"'T6'!AS85","v":""},{"$f":"'T1'!AT85","v":""},{"$f":"'T2'!AT85","v":""},{"$f":"'T3'!AT85","v":""},{"$f":"'T4'!AT85","v":""},{"$f":"'T5'!AT85","v":""},{"$f":"'T6'!AT85","v":""},{"$f":"'T1'!AU85","v":""},{"$f":"'T2'!AU85","v":""},{"$f":"'T3'!AU85","v":""},{"$f":"'T4'!AU85","v":""},{"$f":"'T5'!AU85","v":""},{"$f":"'T6'!AU85","v":""},"","","","","",""]
[null,75,null,null,{"$f":"SW!G84","v":0},{"$f":"'T1'!AP86","v":""},{"$f":"'T2'!AP86","v":""},{"$f":"'T3'!AP86","v":""},{"$f":"'T4'!AP86","v":""},{"$f":"'T5'!AP86","v":""},{"$f":"'T6'!AP86","v":""},{"$f":"'T1'!AQ86","v":""},{"$f":"'T2'!AQ86","v":""},{"$f":"'T3'!AQ86","v":""},{"$f":"'T4'!AQ86","v":""},{"$f":"'T5'!AQ86","v":""},{"$f":"'T6'!AQ86","v":""},{"$f":"'T1'!AR86","v":""},{"$f":"'T2'!AR86","v":""},{"$f":"'T3'!AR86","v":""},{"$f":"'T4'!AR86","v":""},{"$f":"'T5'!AR86","v":""},{"$f":"'T6'!AR86","v":""},{"$f":"'T1'!AS86","v":""},{"$f":"'T2'!AS86","v":""},{"$f":"'T3'!AS86","v":""},{"$f":"'T4'!AS86","v":""},{"$f":"'T5'!AS86","v":""},{"$f":"'T6'!AS86","v":""},{"$f":"'T1'!AT86","v":""},{"$f":"'T2'!AT86","v":""},{"$f":"'T3'!AT86","v":""},{"$f":"'T4'!AT86","v":""},{"$f":"'T5'!AT86","v":""},{"$f":"'T6'!AT86","v":""},{"$f":"'T1'!AU86","v":""},{"$f":"'T2'!AU86","v":""},{"$f":"'T3'!AU86","v":""},{"$f":"'T4'!AU86","v":""},{"$f":"'T5'!AU86","v":""},{"$f":"'T6'!AU86","v":""},"","","","","",""]
[null,76,null,null,{"$f":"SW!G85","v":0},{"$f":"'T1'!AP87","v":""},{"$f":"'T2'!AP87","v":""},{"$f":"'T3'!AP87","v":""},{"$f":"'T4'!AP87","v":""},{"$f":"'T5'!AP87","v":""},{"$f":"'T6'!AP87","v":""},{"$f":"'T1'!AQ87","v":""},{"$f":"'T2'!AQ87","v":""},{"$f":"'T3'!AQ87","v":""},{"$f":"'T4'!AQ87","v":""},{"$f":"'T5'!AQ87","v":""},{"$f":"'T6'!AQ87","v":""},{"$f":"'T1'!AR87","v":""},{"$f":"'T2'!AR87","v":""},{"$f":"'T3'!AR87","v":""},{"$f":"'T4'!AR87","v":""},{"$f":"'T5'!AR87","v":""},{"$f":"'T6'!AR87","v":""},{"$f":"'T1'!AS87","v":""},{"$f":"'T2'!AS87","v":""},{"$f":"'T3'!AS87","v":""},{"$f":"'T4'!AS87","v":""},{"$f":"'T5'!AS87","v":""},{"$f":"'T6'!AS87","v":""},{"$f":"'T1'!AT87","v":""},{"$f":"'T2'!AT87","v":""},{"$f":"'T3'!AT87","v":""},{"$f":"'T4'!AT87","v":""},{"$f":"'T5'!AT87","v":""},{"$f":"'T6'!AT87","v":""},{"$f":"'T1'!AU87","v":""},{"$f":"'T2'!AU87","v":""},{"$f":"'T3'!AU87","v":""},{"$f":"'T4'!AU87","v":""},{"$f":"'T5'!AU87","v":""},{"$f":"'T6'!AU87","v":""},"","","","","",""]
[null,77,null,null,{"$f":"SW!G86","v":0},{"$f":"'T1'!AP88","v":""},{"$f":"'T2'!AP88","v":""},{"$f":"'T3'!AP88","v":""},{"$f":"'T4'!AP88","v":""},{"$f":"'T5'!AP88","v":""},{"$f":"'T6'!AP88","v":""},{"$f":"'T1'!AQ88","v":""},{"$f":"'T2'!AQ88","v":""},{"$f":"'T3'!AQ88","v":""},{"$f":"'T4'!AQ88","v":""},{"$f":"'T5'!AQ88","v":""},{"$f":"'T6'!AQ88","v":""},{"$f":"'T1'!AR88","v":""},{"$f":"'T2'!AR88","v":""},{"$f":"'T3'!AR88","v":""},{"$f":"'T4'!AR88","v":""},{"$f":"'T5'!AR88","v":""},{"$f":"'T6'!AR88","v":""},{"$f":"'T1'!AS88","v":""},{"$f":"'T2'!AS88","v":""},{"$f":"'T3'!AS88","v":""},{"$f":"'T4'!AS88","v":""},{"$f":"'T5'!AS88","v":""},{"$f":"'T6'!AS88","v":""},{"$f":"'T1'!AT88","v":""},{"$f":"'T2'!AT88","v":""},{"$f":"'T3'!AT88","v":""},{"$f":"'T4'!AT88","v":""},{"$f":"'T5'!AT88","v":""},{"$f":"'T6'!AT88","v":""},{"$f":"'T1'!AU88","v":""},{"$f":"'T2'!AU88","v":""},{"$f":"'T3'!AU88","v":""},{"$f":"'T4'!AU88","v":""},{"$f":"'T5'!AU88","v":""},{"$f":"'T6'!AU88","v":""},"","","","","",""]
[null,78,null,null,{"$f":"SW!G87","v":0},{"$f":"'T1'!AP89","v":""},{"$f":"'T2'!AP89","v":""},{"$f":"'T3'!AP89","v":""},{"$f":"'T4'!AP89","v":""},{"$f":"'T5'!AP89","v":""},{"$f":"'T6'!AP89","v":""},{"$f":"'T1'!AQ89","v":""},{"$f":"'T2'!AQ89","v":""},{"$f":"'T3'!AQ89","v":""},{"$f":"'T4'!AQ89","v":""},{"$f":"'T5'!AQ89","v":""},{"$f":"'T6'!AQ89","v":""},{"$f":"'T1'!AR89","v":""},{"$f":"'T2'!AR89","v":""},{"$f":"'T3'!AR89","v":""},{"$f":"'T4'!AR89","v":""},{"$f":"'T5'!AR89","v":""},{"$f":"'T6'!AR89","v":""},{"$f":"'T1'!AS89","v":""},{"$f":"'T2'!AS89","v":""},{"$f":"'T3'!AS89","v":""},{"$f":"'T4'!AS89","v":""},{"$f":"'T5'!AS89","v":""},{"$f":"'T6'!AS89","v":""},{"$f":"'T1'!AT89","v":""},{"$f":"'T2'!AT89","v":""},{"$f":"'T3'!AT89","v":""},{"$f":"'T4'!AT89","v":""},{"$f":"'T5'!AT89","v":""},{"$f":"'T6'!AT89","v":""},{"$f":"'T1'!AU89","v":""},{"$f":"'T2'!AU89","v":""},{"$f":"'T3'!AU89","v":""},{"$f":"'T4'!AU89","v":""},{"$f":"'T5'!AU89","v":""},{"$f":"'T6'!AU89","v":""},"","","","","",""]
[null,79,null,null,{"$f":"SW!G88","v":0},{"$f":"'T1'!AP90","v":""},{"$f":"'T2'!AP90","v":""},{"$f":"'T3'!AP90","v":""},{"$f":"'T4'!AP90","v":""},{"$f":"'T5'!AP90","v":""},{"$f":"'T6'!AP90","v":""},{"$f":"'T1'!AQ90","v":""},{"$f":"'T2'!AQ90","v":""},{"$f":"'T3'!AQ90","v":""},{"$f":"'T4'!AQ90","v":""},{"$f":"'T5'!AQ90","v":""},{"$f":"'T6'!AQ90","v":""},{"$f":"'T1'!AR90","v":""},{"$f":"'T2'!AR90","v":""},{"$f":"'T3'!AR90","v":""},{"$f":"'T4'!AR90","v":""},{"$f":"'T5'!AR90","v":""},{"$f":"'T6'!AR90","v":""},{"$f":"'T1'!AS90","v":""},{"$f":"'T2'!AS90","v":""},{"$f":"'T3'!AS90","v":""},{"$f":"'T4'!AS90","v":""},{"$f":"'T5'!AS90","v":""},{"$f":"'T6'!AS90","v":""},{"$f":"'T1'!AT90","v":""},{"$f":"'T2'!AT90","v":""},{"$f":"'T3'!AT90","v":""},{"$f":"'T4'!AT90","v":""},{"$f":"'T5'!AT90","v":""},{"$f":"'T6'!AT90","v":""},{"$f":"'T1'!AU90","v":""},{"$f":"'T2'!AU90","v":""},{"$f":"'T3'!AU90","v":""},{"$f":"'T4'!AU90","v":""},{"$f":"'T5'!AU90","v":""},{"$f":"'T6'!AU90","v":""},"","","","","",""]
[null,80,null,null,{"$f":"SW!G89","v":0},{"$f":"'T1'!AP91","v":""},{"$f":"'T2'!AP91","v":""},{"$f":"'T3'!AP91","v":""},{"$f":"'T4'!AP91","v":""},{"$f":"'T5'!AP91","v":""},{"$f":"'T6'!AP91","v":""},{"$f":"'T1'!AQ91","v":""},{"$f":"'T2'!AQ91","v":""},{"$f":"'T3'!AQ91","v":""},{"$f":"'T4'!AQ91","v":""},{"$f":"'T5'!AQ91","v":""},{"$f":"'T6'!AQ91","v":""},{"$f":"'T1'!AR91","v":""},{"$f":"'T2'!AR91","v":""},{"$f":"'T3'!AR91","v":""},{"$f":"'T4'!AR91","v":""},{"$f":"'T5'!AR91","v":""},{"$f":"'T6'!AR91","v":""},{"$f":"'T1'!AS91","v":""},{"$f":"'T2'!AS91","v":""},{"$f":"'T3'!AS91","v":""},{"$f":"'T4'!AS91","v":""},{"$f":"'T5'!AS91","v":""},{"$f":"'T6'!AS91","v":""},{"$f":"'T1'!AT91","v":""},{"$f":"'T2'!AT91","v":""},{"$f":"'T3'!AT91","v":""},{"$f":"'T4'!AT91","v":""},{"$f":"'T5'!AT91","v":""},{"$f":"'T6'!AT91","v":""},{"$f":"'T1'!AU91","v":""},{"$f":"'T2'!AU91","v":""},{"$f":"'T3'!AU91","v":""},{"$f":"'T4'!AU91","v":""},{"$f":"'T5'!AU91","v":""},{"$f":"'T6'!AU91","v":""},"","","","","",""]
[null,81,null,null,{"$f":"SW!G90","v":0},{"$f":"'T1'!AP92","v":""},{"$f":"'T2'!AP92","v":""},{"$f":"'T3'!AP92","v":""},{"$f":"'T4'!AP92","v":""},{"$f":"'T5'!AP92","v":""},{"$f":"'T6'!AP92","v":""},{"$f":"'T1'!AQ92","v":""},{"$f":"'T2'!AQ92","v":""},{"$f":"'T3'!AQ92","v":""},{"$f":"'T4'!AQ92","v":""},{"$f":"'T5'!AQ92","v":""},{"$f":"'T6'!AQ92","v":""},{"$f":"'T1'!AR92","v":""},{"$f":"'T2'!AR92","v":""},{"$f":"'T3'!AR92","v":""},{"$f":"'T4'!AR92","v":""},{"$f":"'T5'!AR92","v":""},{"$f":"'T6'!AR92","v":""},{"$f":"'T1'!AS92","v":""},{"$f":"'T2'!AS92","v":""},{"$f":"'T3'!AS92","v":""},{"$f":"'T4'!AS92","v":""},{"$f":"'T5'!AS92","v":""},{"$f":"'T6'!AS92","v":""},{"$f":"'T1'!AT92","v":""},{"$f":"'T2'!AT92","v":""},{"$f":"'T3'!AT92","v":""},{"$f":"'T4'!AT92","v":""},{"$f":"'T5'!AT92","v":""},{"$f":"'T6'!AT92","v":""},{"$f":"'T1'!AU92","v":""},{"$f":"'T2'!AU92","v":""},{"$f":"'T3'!AU92","v":""},{"$f":"'T4'!AU92","v":""},{"$f":"'T5'!AU92","v":""},{"$f":"'T6'!AU92","v":""},"","","","","",""]
[null,82,null,null,{"$f":"SW!G91","v":0},{"$f":"'T1'!AP93","v":""},{"$f":"'T2'!AP93","v":""},{"$f":"'T3'!AP93","v":""},{"$f":"'T4'!AP93","v":""},{"$f":"'T5'!AP93","v":""},{"$f":"'T6'!AP93","v":""},{"$f":"'T1'!AQ93","v":""},{"$f":"'T2'!AQ93","v":""},{"$f":"'T3'!AQ93","v":""},{"$f":"'T4'!AQ93","v":""},{"$f":"'T5'!AQ93","v":""},{"$f":"'T6'!AQ93","v":""},{"$f":"'T1'!AR93","v":""},{"$f":"'T2'!AR93","v":""},{"$f":"'T3'!AR93","v":""},{"$f":"'T4'!AR93","v":""},{"$f":"'T5'!AR93","v":""},{"$f":"'T6'!AR93","v":""},{"$f":"'T1'!AS93","v":""},{"$f":"'T2'!AS93","v":""},{"$f":"'T3'!AS93","v":""},{"$f":"'T4'!AS93","v":""},{"$f":"'T5'!AS93","v":""},{"$f":"'T6'!AS93","v":""},{"$f":"'T1'!AT93","v":""},{"$f":"'T2'!AT93","v":""},{"$f":"'T3'!AT93","v":""},{"$f":"'T4'!AT93","v":""},{"$f":"'T5'!AT93","v":""},{"$f":"'T6'!AT93","v":""},{"$f":"'T1'!AU93","v":""},{"$f":"'T2'!AU93","v":""},{"$f":"'T3'!AU93","v":""},{"$f":"'T4'!AU93","v":""},{"$f":"'T5'!AU93","v":""},{"$f":"'T6'!AU93","v":""},"","","","","",""]
[null,83,null,null,{"$f":"SW!G92","v":0},{"$f":"'T1'!AP94","v":""},{"$f":"'T2'!AP94","v":""},{"$f":"'T3'!AP94","v":""},{"$f":"'T4'!AP94","v":""},{"$f":"'T5'!AP94","v":""},{"$f":"'T6'!AP94","v":""},{"$f":"'T1'!AQ94","v":""},{"$f":"'T2'!AQ94","v":""},{"$f":"'T3'!AQ94","v":""},{"$f":"'T4'!AQ94","v":""},{"$f":"'T5'!AQ94","v":""},{"$f":"'T6'!AQ94","v":""},{"$f":"'T1'!AR94","v":""},{"$f":"'T2'!AR94","v":""},{"$f":"'T3'!AR94","v":""},{"$f":"'T4'!AR94","v":""},{"$f":"'T5'!AR94","v":""},{"$f":"'T6'!AR94","v":""},{"$f":"'T1'!AS94","v":""},{"$f":"'T2'!AS94","v":""},{"$f":"'T3'!AS94","v":""},{"$f":"'T4'!AS94","v":""},{"$f":"'T5'!AS94","v":""},{"$f":"'T6'!AS94","v":""},{"$f":"'T1'!AT94","v":""},{"$f":"'T2'!AT94","v":""},{"$f":"'T3'!AT94","v":""},{"$f":"'T4'!AT94","v":""},{"$f":"'T5'!AT94","v":""},{"$f":"'T6'!AT94","v":""},{"$f":"'T1'!AU94","v":""},{"$f":"'T2'!AU94","v":""},{"$f":"'T3'!AU94","v":""},{"$f":"'T4'!AU94","v":""},{"$f":"'T5'!AU94","v":""},{"$f":"'T6'!AU94","v":""},"","","","","",""]
[null,84,null,null,{"$f":"SW!G93","v":0},{"$f":"'T1'!AP95","v":""},{"$f":"'T2'!AP95","v":""},{"$f":"'T3'!AP95","v":""},{"$f":"'T4'!AP95","v":""},{"$f":"'T5'!AP95","v":""},{"$f":"'T6'!AP95","v":""},{"$f":"'T1'!AQ95","v":""},{"$f":"'T2'!AQ95","v":""},{"$f":"'T3'!AQ95","v":""},{"$f":"'T4'!AQ95","v":""},{"$f":"'T5'!AQ95","v":""},{"$f":"'T6'!AQ95","v":""},{"$f":"'T1'!AR95","v":""},{"$f":"'T2'!AR95","v":""},{"$f":"'T3'!AR95","v":""},{"$f":"'T4'!AR95","v":""},{"$f":"'T5'!AR95","v":""},{"$f":"'T6'!AR95","v":""},{"$f":"'T1'!AS95","v":""},{"$f":"'T2'!AS95","v":""},{"$f":"'T3'!AS95","v":""},{"$f":"'T4'!AS95","v":""},{"$f":"'T5'!AS95","v":""},{"$f":"'T6'!AS95","v":""},{"$f":"'T1'!AT95","v":""},{"$f":"'T2'!AT95","v":""},{"$f":"'T3'!AT95","v":""},{"$f":"'T4'!AT95","v":""},{"$f":"'T5'!AT95","v":""},{"$f":"'T6'!AT95","v":""},{"$f":"'T1'!AU95","v":""},{"$f":"'T2'!AU95","v":""},{"$f":"'T3'!AU95","v":""},{"$f":"'T4'!AU95","v":""},{"$f":"'T5'!AU95","v":""},{"$f":"'T6'!AU95","v":""},"","","","","",""]
[null,85,null,null,{"$f":"SW!G94","v":0},{"$f":"'T1'!AP96","v":""},{"$f":"'T2'!AP96","v":""},{"$f":"'T3'!AP96","v":""},{"$f":"'T4'!AP96","v":""},{"$f":"'T5'!AP96","v":""},{"$f":"'T6'!AP96","v":""},{"$f":"'T1'!AQ96","v":""},{"$f":"'T2'!AQ96","v":""},{"$f":"'T3'!AQ96","v":""},{"$f":"'T4'!AQ96","v":""},{"$f":"'T5'!AQ96","v":""},{"$f":"'T6'!AQ96","v":""},{"$f":"'T1'!AR96","v":""},{"$f":"'T2'!AR96","v":""},{"$f":"'T3'!AR96","v":""},{"$f":"'T4'!AR96","v":""},{"$f":"'T5'!AR96","v":""},{"$f":"'T6'!AR96","v":""},{"$f":"'T1'!AS96","v":""},{"$f":"'T2'!AS96","v":""},{"$f":"'T3'!AS96","v":""},{"$f":"'T4'!AS96","v":""},{"$f":"'T5'!AS96","v":""},{"$f":"'T6'!AS96","v":""},{"$f":"'T1'!AT96","v":""},{"$f":"'T2'!AT96","v":""},{"$f":"'T3'!AT96","v":""},{"$f":"'T4'!AT96","v":""},{"$f":"'T5'!AT96","v":""},{"$f":"'T6'!AT96","v":""},{"$f":"'T1'!AU96","v":""},{"$f":"'T2'!AU96","v":""},{"$f":"'T3'!AU96","v":""},{"$f":"'T4'!AU96","v":""},{"$f":"'T5'!AU96","v":""},{"$f":"'T6'!AU96","v":""},"","","","","",""]
[null,86,null,null,{"$f":"SW!G95","v":0},{"$f":"'T1'!AP97","v":""},{"$f":"'T2'!AP97","v":""},{"$f":"'T3'!AP97","v":""},{"$f":"'T4'!AP97","v":""},{"$f":"'T5'!AP97","v":""},{"$f":"'T6'!AP97","v":""},{"$f":"'T1'!AQ97","v":""},{"$f":"'T2'!AQ97","v":""},{"$f":"'T3'!AQ97","v":""},{"$f":"'T4'!AQ97","v":""},{"$f":"'T5'!AQ97","v":""},{"$f":"'T6'!AQ97","v":""},{"$f":"'T1'!AR97","v":""},{"$f":"'T2'!AR97","v":""},{"$f":"'T3'!AR97","v":""},{"$f":"'T4'!AR97","v":""},{"$f":"'T5'!AR97","v":""},{"$f":"'T6'!AR97","v":""},{"$f":"'T1'!AS97","v":""},{"$f":"'T2'!AS97","v":""},{"$f":"'T3'!AS97","v":""},{"$f":"'T4'!AS97","v":""},{"$f":"'T5'!AS97","v":""},{"$f":"'T6'!AS97","v":""},{"$f":"'T1'!AT97","v":""},{"$f":"'T2'!AT97","v":""},{"$f":"'T3'!AT97","v":""},{"$f":"'T4'!AT97","v":""},{"$f":"'T5'!AT97","v":""},{"$f":"'T6'!AT97","v":""},{"$f":"'T1'!AU97","v":""},{"$f":"'T2'!AU97","v":""},{"$f":"'T3'!AU97","v":""},{"$f":"'T4'!AU97","v":""},{"$f":"'T5'!AU97","v":""},{"$f":"'T6'!AU97","v":""},"","","","","",""]
[null,87,null,null,{"$f":"SW!G96","v":0},{"$f":"'T1'!AP98","v":""},{"$f":"'T2'!AP98","v":""},{"$f":"'T3'!AP98","v":""},{"$f":"'T4'!AP98","v":""},{"$f":"'T5'!AP98","v":""},{"$f":"'T6'!AP98","v":""},{"$f":"'T1'!AQ98","v":""},{"$f":"'T2'!AQ98","v":""},{"$f":"'T3'!AQ98","v":""},{"$f":"'T4'!AQ98","v":""},{"$f":"'T5'!AQ98","v":""},{"$f":"'T6'!AQ98","v":""},{"$f":"'T1'!AR98","v":""},{"$f":"'T2'!AR98","v":""},{"$f":"'T3'!AR98","v":""},{"$f":"'T4'!AR98","v":""},{"$f":"'T5'!AR98","v":""},{"$f":"'T6'!AR98","v":""},{"$f":"'T1'!AS98","v":""},{"$f":"'T2'!AS98","v":""},{"$f":"'T3'!AS98","v":""},{"$f":"'T4'!AS98","v":""},{"$f":"'T5'!AS98","v":""},{"$f":"'T6'!AS98","v":""},{"$f":"'T1'!AT98","v":""},{"$f":"'T2'!AT98","v":""},{"$f":"'T3'!AT98","v":""},{"$f":"'T4'!AT98","v":""},{"$f":"'T5'!AT98","v":""},{"$f":"'T6'!AT98","v":""},{"$f":"'T1'!AU98","v":""},{"$f":"'T2'!AU98","v":""},{"$f":"'T3'!AU98","v":""},{"$f":"'T4'!AU98","v":""},{"$f":"'T5'!AU98","v":""},{"$f":"'T6'!AU98","v":""},"","","","","",""]
[null,88,null,null,{"$f":"SW!G97","v":0},{"$f":"'T1'!AP99","v":""},{"$f":"'T2'!AP99","v":""},{"$f":"'T3'!AP99","v":""},{"$f":"'T4'!AP99","v":""},{"$f":"'T5'!AP99","v":""},{"$f":"'T6'!AP99","v":""},{"$f":"'T1'!AQ99","v":""},{"$f":"'T2'!AQ99","v":""},{"$f":"'T3'!AQ99","v":""},{"$f":"'T4'!AQ99","v":""},{"$f":"'T5'!AQ99","v":""},{"$f":"'T6'!AQ99","v":""},{"$f":"'T1'!AR99","v":""},{"$f":"'T2'!AR99","v":""},{"$f":"'T3'!AR99","v":""},{"$f":"'T4'!AR99","v":""},{"$f":"'T5'!AR99","v":""},{"$f":"'T6'!AR99","v":""},{"$f":"'T1'!AS99","v":""},{"$f":"'T2'!AS99","v":""},{"$f":"'T3'!AS99","v":""},{"$f":"'T4'!AS99","v":""},{"$f":"'T5'!AS99","v":""},{"$f":"'T6'!AS99","v":""},{"$f":"'T1'!AT99","v":""},{"$f":"'T2'!AT99","v":""},{"$f":"'T3'!AT99","v":""},{"$f":"'T4'!AT99","v":""},{"$f":"'T5'!AT99","v":""},{"$f":"'T6'!AT99","v":""},{"$f":"'T1'!AU99","v":""},{"$f":"'T2'!AU99","v":""},{"$f":"'T3'!AU99","v":""},{"$f":"'T4'!AU99","v":""},{"$f":"'T5'!AU99","v":""},{"$f":"'T6'!AU99","v":""},"","","","","",""]
[null,89,null,null,{"$f":"SW!G98","v":0},{"$f":"'T1'!AP100","v":""},{"$f":"'T2'!AP100","v":""},{"$f":"'T3'!AP100","v":""},{"$f":"'T4'!AP100","v":""},{"$f":"'T5'!AP100","v":""},{"$f":"'T6'!AP100","v":""},{"$f":"'T1'!AQ100","v":""},{"$f":"'T2'!AQ100","v":""},{"$f":"'T3'!AQ100","v":""},{"$f":"'T4'!AQ100","v":""},{"$f":"'T5'!AQ100","v":""},{"$f":"'T6'!AQ100","v":""},{"$f":"'T1'!AR100","v":""},{"$f":"'T2'!AR100","v":""},{"$f":"'T3'!AR100","v":""},{"$f":"'T4'!AR100","v":""},{"$f":"'T5'!AR100","v":""},{"$f":"'T6'!AR100","v":""},{"$f":"'T1'!AS100","v":""},{"$f":"'T2'!AS100","v":""},{"$f":"'T3'!AS100","v":""},{"$f":"'T4'!AS100","v":""},{"$f":"'T5'!AS100","v":""},{"$f":"'T6'!AS100","v":""},{"$f":"'T1'!AT100","v":""},{"$f":"'T2'!AT100","v":""},{"$f":"'T3'!AT100","v":""},{"$f":"'T4'!AT100","v":""},{"$f":"'T5'!AT100","v":""},{"$f":"'T6'!AT100","v":""},{"$f":"'T1'!AU100","v":""},{"$f":"'T2'!AU100","v":""},{"$f":"'T3'!AU100","v":""},{"$f":"'T4'!AU100","v":""},{"$f":"'T5'!AU100","v":""},{"$f":"'T6'!AU100","v":""},"","","","","",""]

{"sheet":"MTK","index":7,"n_rows":99,"n_cols":16,"rows_kept":99,"cut":false,"hidden":false,"merged":[[98,6,98,8],[98,10,98,12],[98,14,98,17],[8,6,8,13],[96,6,96,8],[96,10,96,12],[96,14,96,17],[97,6,97,8],[97,10,97,12],[97,14,97,17],[94,6,94,8],[94,10,94,12],[94,14,94,17],[95,6,95,8],[95,10,95,12],[95,14,95,17],[92,6,92,8],[92,10,92,12],[92,14,92,17],[93,6,93,8],[93,10,93,12],[93,14,93,17],[90,6,90,8],[90,10,90,12],[90,14,90,17],[91,6,91,8],[91,10,91,12],[91,14,91,17],[88,6,88,8],[88,10,88,12],[88,14,88,17],[89,6,89,8],[89,10,89,12],[89,14,89,17],[86,6,86,8],[86,10,86,12],[86,14,86,17],[87,6,87,8],[87,10,87,12],[87,14,87,17],[84,6,84,8],[84,10,84,12],[84,14,84,17],[85,6,85,8],[85,10,85,12],[85,14,85,17],[82,6,82,8],[82,10,82,12],[82,14,82,17],[83,6,83,8],[83,10,83,12],[83,14,83,17],[80,6,80,8],[80,10,80,12],[80,14,80,17],[81,6,81,8],[81,10,81,12],[81,14,81,17],[78,6,78,8],[78,10,78,12],[78,14,78,17],[79,6,79,8],[79,10,79,12],[79,14,79,17],[76,6,76,8],[76,10,76,12],[76,14,76,17],[77,6,77,8],[77,10,77,12],[77,14,77,17],[74,6,74,8],[74,10,74,12],[74,14,74,17],[75,6,75,8],[75,10,75,12],[75,14,75,17],[72,6,72,8],[72,10,72,12],[72,14,72,17],[73,6,73,8],[73,10,73,12],[73,14,73,17],[70,6,70,8],[70,10,70,12],[70,14,70,17],[71,6,71,8],[71,10,71,12],[71,14,71,17],[68,6,68,8],[68,10,68,12],[68,14,68,17],[69,6,69,8],[69,10,69,12],[69,14,69,17],[66,6,66,8],[66,10,66,12],[66,14,66,17],[67,6,67,8],[67,10,67,12],[67,14,67,17],[64,6,64,8],[64,10,64,12],[64,14,64,17],[65,6,65,8],[65,10,65,12],[65,14,65,17],[62,6,62,8],[62,10,62,12],[62,14,62,17],[63,6,63,8],[63,10,63,12],[63,14,63,17],[60,6,60,8],[60,10,60,12],[60,14,60,17],[61,6,61,8],[61,10,61,12],[61,14,61,17],[58,6,58,8],[58,10,58,12],[58,14,58,17],[59,6,59,8],[59,10,59,12],[59,14,59,17],[56,6,56,8],[56,10,56,12],[56,14,56,17],[57,6,57,8],[57,10,57,12],[57,14,57,17],[54,6,54,8],[54,10,54,12],[54,14,54,17],[55,6,55,8],[55,10,55,12],[55,14,55,17],[52,6,52,8],[52,10,52,12],[52,14,52,17],[53,6,53,8],[53,10,53,12],[53,14,53,17],[50,6,50,8],[50,10,50,12],[50,14,50,17],[51,6,51,8],[51,10,51,12],[51,14,51,17],[48,6,48,8],[48,10,48,12],[48,14,48,17],[49,6,49,8],[49,10,49,12],[49,14,49,17],[46,6,46,8],[46,10,46,12],[46,14,46,17],[47,6,47,8],[47,10,47,12],[47,14,47,17],[44,6,44,8],[44,10,44,12],[44,14,44,17],[45,6,45,8],[45,10,45,12],[45,14,45,17],[42,6,42,8],[42,10,42,12],[42,14,42,17],[43,6,43,8],[43,10,43,12],[43,14,43,17],[40,6,40,8],[40,10,40,12],[40,14,40,17],[41,6,41,8],[41,10,41,12],[41,14,41,17],[38,6,38,8],[38,10,38,12],[38,14,38,17],[39,6,39,8],[39,10,39,12],[39,14,39,17],[36,6,36,8],[36,10,36,12],[36,14,36,17],[37,6,37,8],[37,10,37,12],[37,14,37,17],[34,6,34,8],[34,10,34,12],[34,14,34,17],[35,6,35,8],[35,10,35,12],[35,14,35,17],[32,6,32,8],[32,10,32,12],[32,14,32,17],[33,6,33,8],[33,10,33,12],[33,14,33,17],[30,6,30,8],[30,10,30,12],[30,14,30,17],[31,6,31,8],[31,10,31,12],[31,14,31,17],[28,6,28,8],[28,10,28,12],[28,14,28,17],[29,6,29,8],[29,10,29,12],[29,14,29,17],[26,6,26,8],[26,10,26,12],[26,14,26,17],[27,6,27,8],[27,10,27,12],[27,14,27,17],[24,6,24,8],[24,10,24,12],[24,14,24,17],[25,6,25,8],[25,10,25,12],[25,14,25,17],[22,6,22,8],[22,10,22,12],[22,14,22,17],[23,6,23,8],[23,10,23,12],[23,14,23,17],[20,6,20,8],[20,10,20,12],[20,14,20,17],[21,6,21,8],[21,10,21,12],[21,14,21,17],[18,6,18,8],[18,10,18,12],[18,14,18,17],[19,6,19,8],[19,10,19,12],[19,14,19,17],[16,6,16,8],[16,10,16,12],[16,14,16,17],[17,6,17,8],[17,10,17,12],[17,14,17,17],[14,6,14,8],[14,10,14,12],[14,14,14,17],[15,6,15,8],[15,10,15,12],[15,14,15,17],[12,6,12,8],[12,10,12,12],[12,14,12,17],[13,6,13,8],[13,10,13,12],[13,14,13,17],[10,6,10,8],[10,10,10,12],[10,14,10,17],[11,6,11,8],[11,10,11,12],[11,14,11,17],[1,1,1,17],[3,7,3,13],[3,15,5,16],[4,7,4,13],[5,7,5,13],[8,14,9,17],[9,6,9,8],[9,10,9,12],[8,1,9,1],[8,4,9,4],[8,5,9,5],[3,1,3,5],[4,1,4,5],[5,1,5,5]]}
[]
[null,"D A F T A R   N I L A I"]
[]
[null,"MATA PELAJARAN",null,null,null,null,":","MATEMATIKA",null,null,null,null,null,null,null,"↗"]
[null,"KELAS",null,null,null,null,":",{"$f":"UPPER(MN!D22)","v":"V B"}]
[null,"TAHUN PELAJARAN",null,null,null,null,":",{"$f":"MN!D18","v":"2019 - 2020"}]
[]
[]
[null,"No","No. Induk","NISN","Nama Siswa","MATEMATIKA (TEMA)","NILAI",null,null,null,null,null,null,null,"JUMLAH"]
[null,null,null,null,null,null,"PG",null,null,0.5,"ESSAY",null,null,{"$f":"100%-J10","v":0.5}]
[null,1,null,null,{"$f":"SW!G10","v":"ABD. ROCHMAN NAJA FATLAN PRATAMA"},{"$f":"RTM!AQ11","v":""},7,7,7,{"$f":"$J$10*G11","v":3.5},40,null,null,{"$f":"K11*$N$10","v":20},{"$f":"J11+N11","v":23.5}]
[null,2,null,null,{"$f":"SW!G11","v":"ABDURRAHMAN FAQIH"},{"$f":"RTM!AQ12","v":""},20,20,20,{"$f":"$J$10*G12","v":10},40,null,null,{"$f":"K12*$N$10","v":20},{"$f":"J12+N12","v":30}]
[null,3,null,null,{"$f":"SW!G12","v":"ACHMAD FARROIHUN MUSHOBIRONILLAH"},{"$f":"RTM!AQ13","v":""},13,13,13,6.5,25,null,null,12.5,20]
[null,4,null,null,{"$f":"SW!G13","v":"ACHMAD HASBI ASSIDDIQI"},{"$f":"RTM!AQ14","v":""},27,27,27,13.5,25,null,null,12.5,27]
[null,5,null,null,{"$f":"SW!G14","v":"ACHMAD REZA AKRAM ALAUDDIN"},{"$f":"RTM!AQ15","v":""},33,33,33,16.5,20,null,null,10,26.5]
[null,6,null,null,{"$f":"SW!G15","v":"ACHMAD YANI"},{"$f":"RTM!AQ16","v":""},"0",0,0,0,25,null,null,12.5,12.5]
[null,7,null,null,{"$f":"SW!G16","v":"AKHMAD RIDWAN"},{"$f":"RTM!AQ17","v":""},13,13,13,6.5,40,null,null,20,26.5]
[null,8,null,null,{"$f":"SW!G17","v":"ANDREAN DWI YULIANO"},{"$f":"RTM!AQ18","v":""},20,20,20,10,40,null,null,20,30]
[null,9,null,null,{"$f":"SW!G18","v":"ASFAN FAKHRI BARANI"},{"$f":"RTM!AQ19","v":""},20,20,20,10,25,null,null,12.5,22.5]
[null,10,null,null,{"$f":"SW!G19","v":"DEVAN ADITYA SAPUTRA"},{"$f":"RTM!AQ20","v":""},13,13,13,6.5,40,null,null,20,26.5]
[null,11,null,null,{"$f":"SW!G20","v":"FAHRUL AHMAD FAHREZA"},{"$f":"RTM!AQ21","v":""},20,20,20,10,25,null,null,12.5,22.5]
[null,12,null,null,{"$f":"SW!G21","v":"FAUZIA AMELIA PUTRI"},{"$f":"RTM!AQ22","v":""},33,33,33,16.5,25,null,null,12.5,30]
[null,13,null,null,{"$f":"SW!G22","v":"FAZA AZIFAH SALSABILA"},{"$f":"RTM!AQ23","v":""},13,13,13,6.5,25,null,null,12.5,20]
[null,14,null,null,{"$f":"SW!G23","v":"HABIBIE NURUSSALAM"},{"$f":"RTM!AQ24","v":""},40,40,40,20,25,null,null,12.5,32.5]
[null,15,null,null,{"$f":"SW!G24","v":"HIMATURROSYIDAH"},{"$f":"RTM!AQ25","v":""},13,13,13,6.5,25,null,null,12.5,20]
[null,16,null,null,{"$f":"SW!G25","v":"IFKARINA NAILA SAUQYA"},{"$f":"RTM!AQ26","v":""},33,33,33,16.5,40,null,null,20,36.5]
[null,17,null,null,{"$f":"SW!G26","v":"KEISA AYU SASKIYAH"},{"$f":"RTM!AQ27","v":""},13,13,13,6.5,25,null,null,12.5,20]
[null,18,null,null,{"$f":"SW!G27","v":"MOCHAMMAD RENO FIRMANSYAH"},{"$f":"RTM!AQ28","v":""},20,20,20,10,25,null,null,12.5,22.5]
[null,19,null,null,{"$f":"SW!G28","v":"MOHAMAD NUR KHAFID KHABIBULLOH"},{"$f":"RTM!AQ29","v":""},53,53,53,26.5,25,null,null,12.5,40]
[null,20,null,null,{"$f":"SW!G29","v":"MOHAMMAD NAUFAL NAWWARUDDIN"},{"$f":"RTM!AQ30","v":""},20,20,20,10,40,null,null,20,30]
[null,21,null,null,{"$f":"SW!G30","v":"MUCHAMAD PRIMA PAMBUDI"},{"$f":"RTM!AQ31","v":""},20,20,20,10,25,null,null,12.5,22.5]
[null,22,null,null,{"$f":"SW!G31","v":"MUHAMMAD ALFAN FATHONI"},{"$f":"RTM!AQ32","v":""},13,13,13,6.5,25,null,null,12.5,20]
[null,23,null,null,{"$f":"SW!G32","v":"MUHAMMAD AMINULLAH MAULUDANI"},{"$f":"RTM!AQ33","v":""},20,20,20,10,25,null,null,12.5,22.5]
[null,24,null,null,{"$f":"SW!G33","v":"MUHAMMAD DAVIN  LEVANTINO"},{"$f":"RTM!AQ34","v":""},27,27,27,13.5,40,null,null,20,33.5]
[null,25,null,null,{"$f":"SW!G34","v":"MUHAMMAD MAULANA PAHLEVY"},{"$f":"RTM!AQ35","v":""},40,40,40,20,40,null,null,20,40]
[null,26,null,null,{"$f":"SW!G35","v":"RADITYA NIRWANSYAH"},{"$f":"RTM!AQ36","v":""},13,13,13,6.5,40,null,null,20,26.5]
[null,27,null,null,{"$f":"SW!G36","v":"REVINA SRI UTARI"},{"$f":"RTM!AQ37","v":""},7,7,7,3.5,40,null,null,20,23.5]
[null,28,null,null,{"$f":"SW!G37","v":"REYHAN DWI ANDIKA"},{"$f":"RTM!AQ38","v":""},20,20,20,10,25,null,null,12.5,22.5]
[null,29,null,null,{"$f":"SW!G38","v":"RISKA LAURA TRIA OCTAVIA"},{"$f":"RTM!AQ39","v":""},33,33,33,16.5,25,null,null,12.5,30]
[null,30,null,null,{"$f":"SW!G39","v":"ROHMADONA DWI SAFITRI"},{"$f":"RTM!AQ40","v":""},20,20,20,10,40,null,null,20,30]
[null,31,null,null,{"$f":"SW!G40","v":"SALMAN ALFARIZI"},{"$f":"RTM!AQ41","v":""},20,20,20,10,25,null,null,12.5,22.5]
[null,32,null,null,{"$f":"SW!G41","v":"TAUFIQ KURROHMAN"},{"$f":"RTM!AQ42","v":""},7,7,7,3.5,25,null,null,12.5,17]
[null,33,null,null,{"$f":"SW!G42","v":0},{"$f":"RTM!AQ43","v":""},null,null,null,0,null,null,null,0,{"$f":"IFERROR(ROUND(AVERAGE(F43+N43+J43),0),\"\")","v":""}]
[null,34,null,null,{"$f":"SW!G43","v":0},{"$f":"RTM!AQ44","v":""},null,null,null,0,null,null,null,0,""]
[null,35,null,null,{"$f":"SW!G44","v":0},{"$f":"RTM!AQ45","v":""},null,null,null,0,null,null,null,0,""]
[null,36,null,null,{"$f":"SW!G45","v":0},{"$f":"RTM!AQ46","v":""},null,null,null,0,null,null,null,0,""]
[null,37,null,null,{"$f":"SW!G46","v":0},{"$f":"RTM!AQ47","v":""},null,null,null,0,null,null,null,0,""]
[null,38,null,null,{"$f":"SW!G47","v":0},{"$f":"RTM!AQ48","v":""},null,null,null,0,null,null,null,0,""]
[null,39,null,null,{"$f":"SW!G48","v":0},{"$f":"RTM!AQ49","v":""},null,null,null,0,null,null,null,0,""]
[null,40,null,null,{"$f":"SW!G49","v":0},{"$f":"RTM!AQ50","v":""},null,null,null,0,null,null,null,0,""]
[null,41,null,null,{"$f":"SW!G50","v":0},{"$f":"RTM!AQ51","v":""},null,null,null,0,null,null,null,0,""]
[null,42,null,null,{"$f":"SW!G51","v":0},{"$f":"RTM!AQ52","v":""},null,null,null,0,null,null,null,0,""]
[null,43,null,null,{"$f":"SW!G52","v":0},{"$f":"RTM!AQ53","v":""},null,null,null,0,null,null,null,0,""]
[null,44,null,null,{"$f":"SW!G53","v":0},{"$f":"RTM!AQ54","v":""},null,null,null,0,null,null,null,0,""]
[null,45,null,null,{"$f":"SW!G54","v":0},{"$f":"RTM!AQ55","v":""},null,null,null,0,null,null,null,0,""]
[null,46,null,null,{"$f":"SW!G55","v":0},{"$f":"RTM!AQ56","v":""},null,null,null,0,null,null,null,0,""]
[null,47,null,null,{"$f":"SW!G56","v":0},{"$f":"RTM!AQ57","v":""},null,null,null,0,null,null,null,0,""]
[null,48,null,null,{"$f":"SW!G57","v":0},{"$f":"RTM!AQ58","v":""},null,null,null,0,null,null,null,0,""]
[null,49,null,null,{"$f":"SW!G58","v":0},{"$f":"RTM!AQ59","v":""},null,null,null,0,null,null,null,0,""]
[null,50,null,null,{"$f":"SW!G59","v":0},{"$f":"RTM!AQ60","v":""},null,null,null,0,null,null,null,0,""]
[null,51,null,null,{"$f":"SW!G60","v":0},{"$f":"RTM!AQ61","v":""},null,null,null,0,null,null,null,0,""]
[null,52,null,null,{"$f":"SW!G61","v":0},{"$f":"RTM!AQ62","v":""},null,null,null,0,null,null,null,0,""]
[null,53,null,null,{"$f":"SW!G62","v":0},{"$f":"RTM!AQ63","v":""},null,null,null,0,null,null,null,0,""]
[null,54,null,null,{"$f":"SW!G63","v":0},{"$f":"RTM!AQ64","v":""},null,null,null,0,null,null,null,0,""]
[null,55,null,null,{"$f":"SW!G64","v":0},{"$f":"RTM!AQ65","v":""},null,null,null,0,null,null,null,0,""]
[null,56,null,null,{"$f":"SW!G65","v":0},{"$f":"RTM!AQ66","v":""},null,null,null,0,null,null,null,0,""]
[null,57,null,null,{"$f":"SW!G66","v":0},{"$f":"RTM!AQ67","v":""},null,null,null,0,null,null,null,0,""]
[null,58,null,null,{"$f":"SW!G67","v":0},{"$f":"RTM!AQ68","v":""},null,null,null,0,null,null,null,0,""]
[null,59,null,null,{"$f":"SW!G68","v":0},{"$f":"RTM!AQ69","v":""},null,null,null,0,null,null,null,0,""]
[null,60,null,null,{"$f":"SW!G69","v":0},{"$f":"RTM!AQ70","v":""},null,null,null,0,null,null,null,0,""]
[null,61,null,null,{"$f":"SW!G70","v":0},{"$f":"RTM!AQ71","v":""},null,null,null,0,null,null,null,0,""]
[null,62,null,null,{"$f":"SW!G71","v":0},{"$f":"RTM!AQ72","v":""},null,null,null,0,null,null,null,0,""]
[null,63,null,null,{"$f":"SW!G72","v":0},{"$f":"RTM!AQ73","v":""},null,null,null,0,null,null,null,0,""]
[null,64,null,null,{"$f":"SW!G73","v":0},{"$f":"RTM!AQ74","v":""},null,null,null,0,null,null,null,0,""]
[null,65,null,null,{"$f":"SW!G74","v":0},{"$f":"RTM!AQ75","v":""},null,null,null,0,null,null,null,0,""]
[null,66,null,null,{"$f":"SW!G75","v":0},{"$f":"RTM!AQ76","v":""},null,null,null,{"$f":"$J$10*G76","v":0},null,null,null,{"$f":"K76*$N$10","v":0},{"$f":"IFERROR(ROUND(AVERAGE(F76+N76+J76),0),\"\")","v":""}]
[null,67,null,null,{"$f":"SW!G76","v":0},{"$f":"RTM!AQ77","v":""},null,null,null,0,null,null,null,0,""]
[null,68,null,null,{"$f":"SW!G77","v":0},{"$f":"RTM!AQ78","v":""},null,null,null,0,null,null,null,0,""]
[null,69,null,null,{"$f":"SW!G78","v":0},{"$f":"RTM!AQ79","v":""},null,null,null,0,null,null,null,0,""]
[null,70,null,null,{"$f":"SW!G79","v":0},{"$f":"RTM!AQ80","v":""},null,null,null,0,null,null,null,0,""]
[null,71,null,null,{"$f":"SW!G80","v":0},{"$f":"RTM!AQ81","v":""},null,null,null,0,null,null,null,0,""]
[null,72,null,null,{"$f":"SW!G81","v":0},{"$f":"RTM!AQ82","v":""},null,null,null,0,null,null,null,0,""]
[null,73,null,null,{"$f":"SW!G82","v":0},{"$f":"RTM!AQ83","v":""},null,null,null,0,null,null,null,0,""]
[null,74,null,null,{"$f":"SW!G83","v":0},{"$f":"RTM!AQ84","v":""},null,null,null,0,null,null,null,0,""]
[null,75,null,null,{"$f":"SW!G84","v":0},{"$f":"RTM!AQ85","v":""},null,null,null,0,null,null,null,0,""]
[null,76,null,null,{"$f":"SW!G85","v":0},{"$f":"RTM!AQ86","v":""},null,null,null,0,null,null,null,0,""]
[null,77,null,null,{"$f":"SW!G86","v":0},{"$f":"RTM!AQ87","v":""},null,null,null,0,null,null,null,0,""]
[null,78,null,null,{"$f":"SW!G87","v":0},{"$f":"RTM!AQ88","v":""},null,null,null,0,null,null,null,0,""]
[null,79,null,null,{"$f":"SW!G88","v":0},{"$f":"RTM!AQ89","v":""},null,null,null,0,null,null,null,0,""]
[null,80,null,null,{"$f":"SW!G89","v":0},{"$f":"RTM!AQ90","v":""},null,null,null,0,null,null,null,0,""]
[null,81,null,null,{"$f":"SW!G90","v":0},{"$f":"RTM!AQ91","v":""},null,null,null,0,null,null,null,0,""]
[null,82,null,null,{"$f":"SW!G91","v":0},{"$f":"RTM!AQ92","v":""},null,null,null,0,null,null,null,0,""]
[null,83,null,null,{"$f":"SW!G92","v":0},{"$f":"RTM!AQ93","v":""},null,null,null,0,null,null,null,0,""]
[null,84,null,null,{"$f":"SW!G93","v":0},{"$f":"RTM!AQ94","v":""},null,null,null,0,null,null,null,0,""]
[null,85,null,null,{"$f":"SW!G94","v":0},{"$f":"RTM!AQ95","v":""},null,null,null,0,null,null,null,0,""]
[null,86,null,null,{"$f":"SW!G95","v":0},{"$f":"RTM!AQ96","v":""},null,null,null,0,null,null,null,0,""]
[null,87,null,null,{"$f":"SW!G96","v":0},{"$f":"RTM!AQ97","v":""},null,null,null,0,null,null,null,0,""]
[null,88,null,null,{"$f":"SW!G97","v":0},{"$f":"RTM!AQ98","v":""},null,null,null,0,null,null,null,0,""]
[null,89,null,null,{"$f":"SW!G98","v":0},{"$f":"RTM!AQ99","v":""},null,null,null,0,null,null,null,0,""]

{"sheet":"PJOK","index":8,"n_rows":99,"n_cols":15,"rows_kept":99,"cut":false,"hidden":false,"merged":[[98,5,98,7],[98,9,98,11],[98,13,98,16],[96,5,96,7],[96,9,96,11],[96,13,96,16],[97,5,97,7],[97,9,97,11],[97,13,97,16],[94,5,94,7],[94,9,94,11],[94,13,94,16],[95,5,95,7],[95,9,95,11],[95,13,95,16],[92,5,92,7],[92,9,92,11],[92,13,92,16],[93,5,93,7],[93,9,93,11],[93,13,93,16],[90,5,90,7],[90,9,90,11],[90,13,90,16],[91,5,91,7],[91,9,91,11],[91,13,91,16],[88,5,88,7],[88,9,88,11],[88,13,88,16],[89,5,89,7],[89,9,89,11],[89,13,89,16],[86,5,86,7],[86,9,86,11],[86,13,86,16],[87,5,87,7],[87,9,87,11],[87,13,87,16],[84,5,84,7],[84,9,84,11],[84,13,84,16],[85,5,85,7],[85,9,85,11],[85,13,85,16],[82,5,82,7],[82,9,82,11],[82,13,82,16],[83,5,83,7],[83,9,83,11],[83,13,83,16],[80,5,80,7],[80,9,80,11],[80,13,80,16],[81,5,81,7],[81,9,81,11],[81,13,81,16],[78,5,78,7],[78,9,78,11],[78,13,78,16],[79,5,79,7],[79,9,79,11],[79,13,79,16],[76,5,76,7],[76,9,76,11],[76,13,76,16],[77,5,77,7],[77,9,77,11],[77,13,77,16],[74,5,74,7],[74,9,74,11],[74,13,74,16],[75,5,75,7],[75,9,75,11],[75,13,75,16],[72,5,72,7],[72,9,72,11],[72,13,72,16],[73,5,73,7],[73,9,73,11],[73,13,73,16],[70,5,70,7],[70,9,70,11],[70,13,70,16],[71,5,71,7],[71,9,71,11],[71,13,71,16],[68,5,68,7],[68,9,68,11],[68,13,68,16],[69,5,69,7],[69,9,69,11],[69,13,69,16],[66,5,66,7],[66,9,66,11],[66,13,66,16],[67,5,67,7],[67,9,67,11],[67,13,67,16],[64,5,64,7],[64,9,64,11],[64,13,64,16],[65,5,65,7],[65,9,65,11],[65,13,65,16],[62,5,62,7],[62,9,62,11],[62,13,62,16],[63,5,63,7],[63,9,63,11],[63,13,63,16],[60,5,60,7],[60,9,60,11],[60,13,60,16],[61,5,61,7],[61,9,61,11],[61,13,61,16],[58,5,58,7],[58,9,58,11],[58,13,58,16],[59,5,59,7],[59,9,59,11],[59,13,59,16],[56,5,56,7],[56,9,56,11],[56,13,56,16],[57,5,57,7],[57,9,57,11],[57,13,57,16],[54,5,54,7],[54,9,54,11],[54,13,54,16],[55,5,55,7],[55,9,55,11],[55,13,55,16],[52,5,52,7],[52,9,52,11],[52,13,52,16],[53,5,53,7],[53,9,53,11],[53,13,53,16],[50,5,50,7],[50,9,50,11],[50,13,50,16],[51,5,51,7],[51,9,51,11],[51,13,51,16],[48,5,48,7],[48,9,48,11],[48,13,48,16],[49,5,49,7],[49,9,49,11],[49,13,49,16],[46,5,46,7],[46,9,46,11],[46,13,46,16],[47,5,47,7],[47,9,47,11],[47,13,47,16],[44,5,44,7],[44,9,44,11],[44,13,44,16],[45,5,45,7],[45,9,45,11],[45,13,45,16],[42,5,42,7],[42,9,42,11],[42,13,42,16],[43,5,43,7],[43,9,43,11],[43,13,43,16],[40,5,40,7],[40,9,40,11],[40,13,40,16],[41,5,41,7],[41,9,41,11],[41,13,41,16],[38,5,38,7],[38,9,38,11],[38,13,38,16],[39,5,39,7],[39,9,39,11],[39,13,39,16],[36,5,36,7],[36,9,36,11],[36,13,36,16],[37,5,37,7],[37,9,37,11],[37,13,37,16],[34,5,34,7],[34,9,34,11],[34,13,34,16],[35,5,35,7],[35,9,35,11],[35,13,35,16],[32,5,32,7],[32,9,32,11],[32,13,32,16],[33,5,33,7],[33,9,33,11],[33,13,33,16],[30,5,30,7],[30,9,30,11],[30,13,30,16],[31,5,31,7],[31,9,31,11],[31,13,31,16],[28,5,28,7],[28,9,28,11],[28,13,28,16],[29,5,29,7],[29,9,29,11],[29,13,29,16],[26,5,26,7],[26,9,26,11],[26,13,26,16],[27,5,27,7],[27,9,27,11],[27,13,27,16],[24,5,24,7],[24,9,24,11],[24,13,24,16],[25,5,25,7],[25,9,25,11],[25,13,25,16],[22,5,22,7],[22,9,22,11],[22,13,22,16],[23,5,23,7],[23,9,23,11],[23,13,23,16],[20,5,20,7],[20,9,20,11],[20,13,20,16],[21,5,21,7],[21,9,21,11],[21,13,21,16],[18,5,18,7],[18,9,18,11],[18,13,18,16],[19,5,19,7],[19,9,19,11],[19,13,19,16],[16,5,16,7],[16,9,16,11],[16,13,16,16],[17,5,17,7],[17,9,17,11],[17,13,17,16],[14,5,14,7],[14,9,14,11],[14,13,14,16],[15,5,15,7],[15,9,15,11],[15,13,15,16],[12,5,12,7],[12,9,12,11],[12,13,12,16],[13,5,13,7],[13,9,13,11],[13,13,13,16],[9,9,9,11],[10,5,10,7],[10,9,10,11],[10,13,10,16],[11,5,11,7],[11,9,11,11],[11,13,11,16],[1,1,1,16],[3,6,3,12],[3,14,5,15],[4,6,4,12],[5,6,5,12],[8,1,9,1],[8,4,9,4],[8,5,8,12],[8,13,9,16],[9,5,9,7]]}
[]
[null,"D A F T A R   N I L A I"]
[]
[null,"MATA PELAJARAN",null,null,null,":","Pendidikan Jasmani dan Kesehatan",null,null,null,null,null,null,null,"↗"]
[null,"KELAS",null,null,null,":",{"$f":"UPPER(MN!D22)","v":"V B"}]
[null,"TAHUN PELAJARAN",null,null,null,":",{"$f":"MN!D18","v":"2019 - 2020"}]
[]
[]
[null,"No","No. Induk","NISN","Nama Siswa","NILAI",null,null,null,null,null,null,null,"JUMLAH"]
[null,null,null,null,null,"PG",null,null,0.5,"ESSAY",null,null,{"$f":"100%-I10","v":0.5}]
[null,1,null,null,{"$f":"SW!G10","v":"ABD. ROCHMAN NAJA FATLAN PRATAMA"},33,33,33,{"$f":"$I$10*F11","v":16.5},60,60,60,{"$f":"J11*$M$10","v":30},{"$f":"IFERROR(ROUND(AVERAGE(M11+I11),0),\"\")","v":47}]
[null,2,null,null,{"$f":"SW!G11","v":"ABDURRAHMAN FAQIH"},27,27,27,{"$f":"$I$10*F12","v":13.5},50,50,50,{"$f":"J12*$M$10","v":25},{"$f":"IFERROR(ROUND(AVERAGE(M12+I12),0),\"\")","v":39}]
[null,3,null,null,{"$f":"SW!G12","v":"ACHMAD FARROIHUN MUSHOBIRONILLAH"},17,17,17,8.5,70,70,70,35,44]
[null,4,null,null,{"$f":"SW!G13","v":"ACHMAD HASBI ASSIDDIQI"},20,20,20,10,50,50,50,25,35]
[null,5,null,null,{"$f":"SW!G14","v":"ACHMAD REZA AKRAM ALAUDDIN"},37,37,37,18.5,70,70,70,35,54]
[null,6,null,null,{"$f":"SW!G15","v":"ACHMAD YANI"},20,20,20,10,60,60,60,30,40]
[null,7,null,null,{"$f":"SW!G16","v":"AKHMAD RIDWAN"},43,43,43,21.5,60,60,60,30,52]
[null,8,null,null,{"$f":"SW!G17","v":"ANDREAN DWI YULIANO"},17,17,17,8.5,50,50,50,25,34]
[null,9,null,null,{"$f":"SW!G18","v":"ASFAN FAKHRI BARANI"},47,47,47,23.5,80,80,80,40,64]
[null,10,null,null,{"$f":"SW!G19","v":"DEVAN ADITYA SAPUTRA"},20,20,20,10,60,60,60,30,40]
[null,11,null,null,{"$f":"SW!G20","v":"FAHRUL AHMAD FAHREZA"},27,27,27,13.5,70,70,70,35,49]
[null,12,null,null,{"$f":"SW!G21","v":"FAUZIA AMELIA PUTRI"},50,50,50,25,60,60,60,30,55]
[null,13,null,null,{"$f":"SW!G22","v":"FAZA AZIFAH SALSABILA"},33,33,33,16.5,60,60,60,30,47]
[null,14,null,null,{"$f":"SW!G23","v":"HABIBIE NURUSSALAM"},40,40,40,20,80,80,80,40,60]
[null,15,null,null,{"$f":"SW!G24","v":"HIMATURROSYIDAH"},43,43,43,21.5,60,60,60,30,52]
[null,16,null,null,{"$f":"SW!G25","v":"IFKARINA NAILA SAUQYA"},33,33,33,16.5,60,60,60,30,47]
[null,17,null,null,{"$f":"SW!G26","v":"KEISA AYU SASKIYAH"},30,30,30,15,60,60,60,30,45]
[null,18,null,null,{"$f":"SW!G27","v":"MOCHAMMAD RENO FIRMANSYAH"},27,27,27,13.5,50,50,50,25,39]
[null,19,null,null,{"$f":"SW!G28","v":"MOHAMAD NUR KHAFID KHABIBULLOH"},57,57,57,28.5,60,60,60,30,59]
[null,20,null,null,{"$f":"SW!G29","v":"MOHAMMAD NAUFAL NAWWARUDDIN"},10,10,10,5,60,60,60,30,35]
[null,21,null,null,{"$f":"SW!G30","v":"MUCHAMAD PRIMA PAMBUDI"},23,23,23,11.5,70,70,70,35,47]
[null,22,null,null,{"$f":"SW!G31","v":"MUHAMMAD ALFAN FATHONI"},33,33,33,16.5,60,60,60,30,47]
[null,23,null,null,{"$f":"SW!G32","v":"MUHAMMAD AMINULLAH MAULUDANI"},27,27,27,13.5,70,70,70,35,49]
[null,24,null,null,{"$f":"SW!G33","v":"MUHAMMAD DAVIN  LEVANTINO"},27,27,27,13.5,70,70,70,35,49]
[null,25,null,null,{"$f":"SW!G34","v":"MUHAMMAD MAULANA PAHLEVY"},30,30,30,15,60,60,60,30,45]
[null,26,null,null,{"$f":"SW!G35","v":"RADITYA NIRWANSYAH"},30,30,30,15,60,60,60,30,45]
[null,27,null,null,{"$f":"SW!G36","v":"REVINA SRI UTARI"},20,20,20,10,60,60,60,30,40]
[null,28,null,null,{"$f":"SW!G37","v":"REYHAN DWI ANDIKA"},30,30,30,15,60,60,60,30,45]
[null,29,null,null,{"$f":"SW!G38","v":"RISKA LAURA TRIA OCTAVIA"},33,33,33,16.5,70,70,70,35,52]
[null,30,null,null,{"$f":"SW!G39","v":"ROHMADONA DWI SAFITRI"},50,50,50,25,80,80,80,40,65]
[null,31,null,null,{"$f":"SW!G40","v":"SALMAN ALFARIZI"},33,33,33,16.5,60,60,60,30,47]
[null,32,null,null,{"$f":"SW!G41","v":"TAUFIQ KURROHMAN"},33,33,33,16.5,60,60,60,30,47]
[null,33,null,null,{"$f":"SW!G42","v":0},null,null,null,0,null,null,null,0,0]
[null,34,null,null,{"$f":"SW!G43","v":0},null,null,null,0,null,null,null,0,0]
[null,35,null,null,{"$f":"SW!G44","v":0},null,null,null,0,null,null,null,0,0]
[null,36,null,null,{"$f":"SW!G45","v":0},null,null,null,0,null,null,null,0,0]
[null,37,null,null,{"$f":"SW!G46","v":0},null,null,null,0,null,null,null,0,0]
[null,38,null,null,{"$f":"SW!G47","v":0},null,null,null,0,null,null,null,0,0]
[null,39,null,null,{"$f":"SW!G48","v":0},null,null,null,0,null,null,null,0,0]
[null,40,null,null,{"$f":"SW!G49","v":0},null,null,null,0,null,null,null,0,0]
[null,41,null,null,{"$f":"SW!G50","v":0},null,null,null,0,null,null,null,0,0]
[null,42,null,null,{"$f":"SW!G51","v":0},null,null,null,0,null,null,null,0,0]
[null,43,null,null,{"$f":"SW!G52","v":0},null,null,null,0,null,null,null,0,0]
[null,44,null,null,{"$f":"SW!G53","v":0},null,null,null,0,null,null,null,0,0]
[null,45,null,null,{"$f":"SW!G54","v":0},null,null,null,0,null,null,null,0,0]
[null,46,null,null,{"$f":"SW!G55","v":0},null,null,null,0,null,null,null,0,0]
[null,47,null,null,{"$f":"SW!G56","v":0},null,null,null,0,null,null,null,0,0]
[null,48,null,null,{"$f":"SW!G57","v":0},null,null,null,0,null,null,null,0,0]
[null,49,null,null,{"$f":"SW!G58","v":0},null,null,null,0,null,null,null,0,0]
[null,50,null,null,{"$f":"SW!G59","v":0},null,null,null,0,null,null,null,0,0]
[null,51,null,null,{"$f":"SW!G60","v":0},null,null,null,0,null,null,null,0,0]
[null,52,null,null,{"$f":"SW!G61","v":0},null,null,null,0,null,null,null,0,0]
[null,53,null,null,{"$f":"SW!G62","v":0},null,null,null,0,null,null,null,0,0]
[null,54,null,null,{"$f":"SW!G63","v":0},null,null,null,0,null,null,null,0,0]
[null,55,null,null,{"$f":"SW!G64","v":0},null,null,null,0,null,null,null,0,0]
[null,56,null,null,{"$f":"SW!G65","v":0},null,null,null,0,null,null,null,0,0]
[null,57,null,null,{"$f":"SW!G66","v":0},null,null,null,0,null,null,null,0,0]
[null,58,null,null,{"$f":"SW!G67","v":0},null,null,null,0,null,null,null,0,0]
[null,59,null,null,{"$f":"SW!G68","v":0},null,null,null,0,null,null,null,0,0]
[null,60,null,null,{"$f":"SW!G69","v":0},null,null,null,0,null,null,null,0,0]
[null,61,null,null,{"$f":"SW!G70","v":0},null,null,null,0,null,null,null,0,0]
[null,62,null,null,{"$f":"SW!G71","v":0},null,null,null,0,null,null,null,0,0]
[null,63,null,null,{"$f":"SW!G72","v":0},null,null,null,0,null,null,null,0,0]
[null,64,null,null,{"$f":"SW!G73","v":0},null,null,null,0,null,null,null,0,0]
[null,65,null,null,{"$f":"SW!G74","v":0},null,null,null,0,null,null,null,0,0]
[null,66,null,null,{"$f":"SW!G75","v":0},null,null,null,{"$f":"$I$10*F76","v":0},null,null,null,{"$f":"J76*$M$10","v":0},{"$f":"IFERROR(ROUND(AVERAGE(M76+I76),0),\"\")","v":0}]
[null,67,null,null,{"$f":"SW!G76","v":0},null,null,null,0,null,null,null,0,0]
[null,68,null,null,{"$f":"SW!G77","v":0},null,null,null,0,null,null,null,0,0]
[null,69,null,null,{"$f":"SW!G78","v":0},null,null,null,0,null,null,null,0,0]
[null,70,null,null,{"$f":"SW!G79","v":0},null,null,null,0,null,null,null,0,0]
[null,71,null,null,{"$f":"SW!G80","v":0},null,null,null,0,null,null,null,0,0]
[null,72,null,null,{"$f":"SW!G81","v":0},null,null,null,0,null,null,null,0,0]
[null,73,null,null,{"$f":"SW!G82","v":0},null,null,null,0,null,null,null,0,0]
[null,74,null,null,{"$f":"SW!G83","v":0},null,null,null,0,null,null,null,0,0]
[null,75,null,null,{"$f":"SW!G84","v":0},null,null,null,0,null,null,null,0,0]
[null,76,null,null,{"$f":"SW!G85","v":0},null,null,null,0,null,null,null,0,0]
[null,77,null,null,{"$f":"SW!G86","v":0},null,null,null,0,null,null,null,0,0]
[null,78,null,null,{"$f":"SW!G87","v":0},null,null,null,0,null,null,null,0,0]
[null,79,null,null,{"$f":"SW!G88","v":0},null,null,null,0,null,null,null,0,0]
[null,80,null,null,{"$f":"SW!G89","v":0},null,null,null,0,null,null,null,0,0]
[null,81,null,null,{"$f":"SW!G90","v":0},null,null,null,0,null,null,null,0,0]
[null,82,null,null,{"$f":"SW!G91","v":0},null,null,null,0,null,null,null,0,0]
[null,83,null,null,{"$f":"SW!G92","v":0},null,null,null,0,null,null,null,0,0]
[null,84,null,null,{"$f":"SW!G93","v":0},null,null,null,0,null,null,null,0,0]
[null,85,null,null,{"$f":"SW!G94","v":0},null,null,null,0,null,null,null,0,0]
[null,86,null,null,{"$f":"SW!G95","v":0},null,null,null,0,null,null,null,0,0]
[null,87,null,null,{"$f":"SW!G96","v":0},null,null,null,0,null,null,null,0,0]
[null,88,null,null,{"$f":"SW!G97","v":0},null,null,null,0,null,null,null,0,0]
[null,89,null,null,{"$f":"SW!G98","v":0},null,null,null,0,null,null,null,0,0]

{"sheet":"BD","index":9,"n_rows":99,"n_cols":15,"rows_kept":99,"cut":false,"hidden":false,"merged":[[98,5,98,7],[98,9,98,11],[98,13,98,16],[96,5,96,7],[96,9,96,11],[96,13,96,16],[97,5,97,7],[97,9,97,11],[97,13,97,16],[94,5,94,7],[94,9,94,11],[94,13,94,16],[95,5,95,7],[95,9,95,11],[95,13,95,16],[92,5,92,7],[92,9,92,11],[92,13,92,16],[93,5,93,7],[93,9,93,11],[93,13,93,16],[90,5,90,7],[90,9,90,11],[90,13,90,16],[91,5,91,7],[91,9,91,11],[91,13,91,16],[88,5,88,7],[88,9,88,11],[88,13,88,16],[89,5,89,7],[89,9,89,11],[89,13,89,16],[86,5,86,7],[86,9,86,11],[86,13,86,16],[87,5,87,7],[87,9,87,11],[87,13,87,16],[84,5,84,7],[84,9,84,11],[84,13,84,16],[85,5,85,7],[85,9,85,11],[85,13,85,16],[82,5,82,7],[82,9,82,11],[82,13,82,16],[83,5,83,7],[83,9,83,11],[83,13,83,16],[80,5,80,7],[80,9,80,11],[80,13,80,16],[81,5,81,7],[81,9,81,11],[81,13,81,16],[78,5,78,7],[78,9,78,11],[78,13,78,16],[79,5,79,7],[79,9,79,11],[79,13,79,16],[76,5,76,7],[76,9,76,11],[76,13,76,16],[77,5,77,7],[77,9,77,11],[77,13,77,16],[74,5,74,7],[74,9,74,11],[74,13,74,16],[75,5,75,7],[75,9,75,11],[75,13,75,16],[72,5,72,7],[72,9,72,11],[72,13,72,16],[73,5,73,7],[73,9,73,11],[73,13,73,16],[70,5,70,7],[70,9,70,11],[70,13,70,16],[71,5,71,7],[71,9,71,11],[71,13,71,16],[68,5,68,7],[68,9,68,11],[68,13,68,16],[69,5,69,7],[69,9,69,11],[69,13,69,16],[66,5,66,7],[66,9,66,11],[66,13,66,16],[67,5,67,7],[67,9,67,11],[67,13,67,16],[64,5,64,7],[64,9,64,11],[64,13,64,16],[65,5,65,7],[65,9,65,11],[65,13,65,16],[62,5,62,7],[62,9,62,11],[62,13,62,16],[63,5,63,7],[63,9,63,11],[63,13,63,16],[60,5,60,7],[60,9,60,11],[60,13,60,16],[61,5,61,7],[61,9,61,11],[61,13,61,16],[58,5,58,7],[58,9,58,11],[58,13,58,16],[59,5,59,7],[59,9,59,11],[59,13,59,16],[56,5,56,7],[56,9,56,11],[56,13,56,16],[57,5,57,7],[57,9,57,11],[57,13,57,16],[54,5,54,7],[54,9,54,11],[54,13,54,16],[55,5,55,7],[55,9,55,11],[55,13,55,16],[52,5,52,7],[52,9,52,11],[52,13,52,16],[53,5,53,7],[53,9,53,11],[53,13,53,16],[50,5,50,7],[50,9,50,11],[50,13,50,16],[51,5,51,7],[51,9,51,11],[51,13,51,16],[48,5,48,7],[48,9,48,11],[48,13,48,16],[49,5,49,7],[49,9,49,11],[49,13,49,16],[46,5,46,7],[46,9,46,11],[46,13,46,16],[47,5,47,7],[47,9,47,11],[47,13,47,16],[44,5,44,7],[44,9,44,11],[44,13,44,16],[45,5,45,7],[45,9,45,11],[45,13,45,16],[42,5,42,7],[42,9,42,11],[42,13,42,16],[43,5,43,7],[43,9,43,11],[43,13,43,16],[40,5,40,7],[40,9,40,11],[40,13,40,16],[41,5,41,7],[41,9,41,11],[41,13,41,16],[38,5,38,7],[38,9,38,11],[38,13,38,16],[39,5,39,7],[39,9,39,11],[39,13,39,16],[36,5,36,7],[36,9,36,11],[36,13,36,16],[37,5,37,7],[37,9,37,11],[37,13,37,16],[34,5,34,7],[34,9,34,11],[34,13,34,16],[35,5,35,7],[35,9,35,11],[35,13,35,16],[32,5,32,7],[32,9,32,11],[32,13,32,16],[33,5,33,7],[33,9,33,11],[33,13,33,16],[30,5,30,7],[30,9,30,11],[30,13,30,16],[31,5,31,7],[31,9,31,11],[31,13,31,16],[28,5,28,7],[28,9,28,11],[28,13,28,16],[29,5,29,7],[29,9,29,11],[29,13,29,16],[26,5,26,7],[26,9,26,11],[26,13,26,16],[27,5,27,7],[27,9,27,11],[27,13,27,16],[24,5,24,7],[24,9,24,11],[24,13,24,16],[25,5,25,7],[25,9,25,11],[25,13,25,16],[22,5,22,7],[22,9,22,11],[22,13,22,16],[23,5,23,7],[23,9,23,11],[23,13,23,16],[20,5,20,7],[20,9,20,11],[20,13,20,16],[21,5,21,7],[21,9,21,11],[21,13,21,16],[18,5,18,7],[18,9,18,11],[18,13,18,16],[19,5,19,7],[19,9,19,11],[19,13,19,16],[16,5,16,7],[16,9,16,11],[16,13,16,16],[17,5,17,7],[17,9,17,11],[17,13,17,16],[14,5,14,7],[14,9,14,11],[14,13,14,16],[15,5,15,7],[15,9,15,11],[15,13,15,16],[12,5,12,7],[12,9,12,11],[12,13,12,16],[13,5,13,7],[13,9,13,11],[13,13,13,16],[9,9,9,11],[10,5,10,7],[10,9,10,11],[10,13,10,16],[11,5,11,7],[11,9,11,11],[11,13,11,16],[1,1,1,16],[3,6,3,12],[3,14,5,15],[4,6,4,12],[5,6,5,12],[8,1,9,1],[8,4,9,4],[8,5,8,12],[8,13,9,16],[9,5,9,7]]}
[]
[null,"D A F T A R   N I L A I"]
[]
[null,"MATA PELAJARAN",null,null,null,":","Bahasa Daerah",null,null,null,null,null,null,null,"↗"]
[null,"KELAS",null,null,null,":",{"$f":"UPPER(MN!D22)","v":"V B"}]
[null,"TAHUN PELAJARAN",null,null,null,":",{"$f":"MN!D18","v":"2019 - 2020"}]
[]
[]
[null,"No","No. Induk","NISN","Nama Siswa","NILAI",null,null,null,null,null,null,null,"JUMLAH"]
[null,null,null,null,null,"PG",null,null,0.5,"ESSAY",null,null,{"$f":"100%-I10","v":0.5}]
[null,1,null,null,{"$f":"SW!G10","v":"ABD. ROCHMAN NAJA FATLAN PRATAMA"},32,null,null,{"$f":"$I$10*F11","v":16},32,null,null,{"$f":"J11*$M$10","v":16},{"$f":"IFERROR(ROUND(AVERAGE(M11+I11),0),\"\")","v":32}]
[null,2,null,null,{"$f":"SW!G11","v":"ABDURRAHMAN FAQIH"},43,null,null,{"$f":"$I$10*F12","v":21.5},43,null,null,{"$f":"J12*$M$10","v":21.5},{"$f":"IFERROR(ROUND(AVERAGE(M12+I12),0),\"\")","v":43}]
[null,3,null,null,{"$f":"SW!G12","v":"ACHMAD FARROIHUN MUSHOBIRONILLAH"},51,null,null,25.5,51,null,null,25.5,51]
[null,4,null,null,{"$f":"SW!G13","v":"ACHMAD HASBI ASSIDDIQI"},31,null,null,15.5,31,null,null,15.5,31]
[null,5,null,null,{"$f":"SW!G14","v":"ACHMAD REZA AKRAM ALAUDDIN"},48,null,null,24,48,null,null,24,48]
[null,6,null,null,{"$f":"SW!G15","v":"ACHMAD YANI"},67,null,null,33.5,67,null,null,33.5,67]
[null,7,null,null,{"$f":"SW!G16","v":"AKHMAD RIDWAN"},58,null,null,29,58,null,null,29,58]
[null,8,null,null,{"$f":"SW!G17","v":"ANDREAN DWI YULIANO"},64,null,null,32,64,null,null,32,64]
[null,9,null,null,{"$f":"SW!G18","v":"ASFAN FAKHRI BARANI"},59,null,null,29.5,59,null,null,29.5,59]
[null,10,null,null,{"$f":"SW!G19","v":"DEVAN ADITYA SAPUTRA"},52,null,null,26,52,null,null,26,52]
[null,11,null,null,{"$f":"SW!G20","v":"FAHRUL AHMAD FAHREZA"},64,null,null,32,64,null,null,32,64]
[null,12,null,null,{"$f":"SW!G21","v":"FAUZIA AMELIA PUTRI"},68,null,null,34,68,null,null,34,68]
[null,13,null,null,{"$f":"SW!G22","v":"FAZA AZIFAH SALSABILA"},51,null,null,25.5,51,null,null,25.5,51]
[null,14,null,null,{"$f":"SW!G23","v":"HABIBIE NURUSSALAM"},43,null,null,21.5,43,null,null,21.5,43]
[null,15,null,null,{"$f":"SW!G24","v":"HIMATURROSYIDAH"},68,null,null,34,68,null,null,34,68]
[null,16,null,null,{"$f":"SW!G25","v":"IFKARINA NAILA SAUQYA"},72,null,null,36,72,null,null,36,72]
[null,17,null,null,{"$f":"SW!G26","v":"KEISA AYU SASKIYAH"},68,null,null,34,68,null,null,34,68]
[null,18,null,null,{"$f":"SW!G27","v":"MOCHAMMAD RENO FIRMANSYAH"},47,null,null,23.5,47,null,null,23.5,47]
[null,19,null,null,{"$f":"SW!G28","v":"MOHAMAD NUR KHAFID KHABIBULLOH"},62,null,null,31,62,null,null,31,62]
[null,20,null,null,{"$f":"SW!G29","v":"MOHAMMAD NAUFAL NAWWARUDDIN"},37,null,null,18.5,37,null,null,18.5,37]
[null,21,null,null,{"$f":"SW!G30","v":"MUCHAMAD PRIMA PAMBUDI"},52,null,null,26,52,null,null,26,52]
[null,22,null,null,{"$f":"SW!G31","v":"MUHAMMAD ALFAN FATHONI"},58,null,null,29,58,null,null,29,58]
[null,23,null,null,{"$f":"SW!G32","v":"MUHAMMAD AMINULLAH MAULUDANI"},30,null,null,15,30,null,null,15,30]
[null,24,null,null,{"$f":"SW!G33","v":"MUHAMMAD DAVIN  LEVANTINO"},50,null,null,25,50,null,null,25,50]
[null,25,null,null,{"$f":"SW!G34","v":"MUHAMMAD MAULANA PAHLEVY"},48,null,null,24,48,null,null,24,48]
[null,26,null,null,{"$f":"SW!G35","v":"RADITYA NIRWANSYAH"},40,null,null,20,40,null,null,20,40]
[null,27,null,null,{"$f":"SW!G36","v":"REVINA SRI UTARI"},47,null,null,23.5,47,null,null,23.5,47]
[null,28,null,null,{"$f":"SW!G37","v":"REYHAN DWI ANDIKA"},49,null,null,24.5,49,null,null,24.5,49]
[null,29,null,null,{"$f":"SW!G38","v":"RISKA LAURA TRIA OCTAVIA"},76,null,null,38,76,null,null,38,76]
[null,30,null,null,{"$f":"SW!G39","v":"ROHMADONA DWI SAFITRI"},44,null,null,22,44,null,null,22,44]
[null,31,null,null,{"$f":"SW!G40","v":"SALMAN ALFARIZI"},55,null,null,27.5,55,null,null,27.5,55]
[null,32,null,null,{"$f":"SW!G41","v":"TAUFIQ KURROHMAN"},45,null,null,22.5,45,null,null,22.5,45]
[null,33,null,null,{"$f":"SW!G42","v":0},null,null,null,0,null,null,null,0,0]
[null,34,null,null,{"$f":"SW!G43","v":0},null,null,null,0,null,null,null,0,0]
[null,35,null,null,{"$f":"SW!G44","v":0},null,null,null,0,null,null,null,0,0]
[null,36,null,null,{"$f":"SW!G45","v":0},null,null,null,0,null,null,null,0,0]
[null,37,null,null,{"$f":"SW!G46","v":0},null,null,null,0,null,null,null,0,0]
[null,38,null,null,{"$f":"SW!G47","v":0},null,null,null,0,null,null,null,0,0]
[null,39,null,null,{"$f":"SW!G48","v":0},null,null,null,0,null,null,null,0,0]
[null,40,null,null,{"$f":"SW!G49","v":0},null,null,null,0,null,null,null,0,0]
[null,41,null,null,{"$f":"SW!G50","v":0},null,null,null,0,null,null,null,0,0]
[null,42,null,null,{"$f":"SW!G51","v":0},null,null,null,0,null,null,null,0,0]
[null,43,null,null,{"$f":"SW!G52","v":0},null,null,null,0,null,null,null,0,0]
[null,44,null,null,{"$f":"SW!G53","v":0},null,null,null,0,null,null,null,0,0]
[null,45,null,null,{"$f":"SW!G54","v":0},null,null,null,0,null,null,null,0,0]
[null,46,null,null,{"$f":"SW!G55","v":0},null,null,null,0,null,null,null,0,0]
[null,47,null,null,{"$f":"SW!G56","v":0},null,null,null,0,null,null,null,0,0]
[null,48,null,null,{"$f":"SW!G57","v":0},null,null,null,0,null,null,null,0,0]
[null,49,null,null,{"$f":"SW!G58","v":0},null,null,null,0,null,null,null,0,0]
[null,50,null,null,{"$f":"SW!G59","v":0},null,null,null,0,null,null,null,0,0]
[null,51,null,null,{"$f":"SW!G60","v":0},null,null,null,0,null,null,null,0,0]
[null,52,null,null,{"$f":"SW!G61","v":0},null,null,null,0,null,null,null,0,0]
[null,53,null,null,{"$f":"SW!G62","v":0},null,null,null,0,null,null,null,0,0]
[null,54,null,null,{"$f":"SW!G63","v":0},null,null,null,0,null,null,null,0,0]
[null,55,null,null,{"$f":"SW!G64","v":0},null,null,null,0,null,null,null,0,0]
[null,56,null,null,{"$f":"SW!G65","v":0},null,null,null,0,null,null,null,0,0]
[null,57,null,null,{"$f":"SW!G66","v":0},null,null,null,0,null,null,null,0,0]
[null,58,null,null,{"$f":"SW!G67","v":0},null,null,null,0,null,null,null,0,0]
[null,59,null,null,{"$f":"SW!G68","v":0},null,null,null,0,null,null,null,0,0]
[null,60,null,null,{"$f":"SW!G69","v":0},null,null,null,0,null,null,null,0,0]
[null,61,null,null,{"$f":"SW!G70","v":0},null,null,null,0,null,null,null,0,0]
[null,62,null,null,{"$f":"SW!G71","v":0},null,null,null,0,null,null,null,0,0]
[null,63,null,null,{"$f":"SW!G72","v":0},null,null,null,0,null,null,null,0,0]
[null,64,null,null,{"$f":"SW!G73","v":0},null,null,null,0,null,null,null,0,0]
[null,65,null,null,{"$f":"SW!G74","v":0},null,null,null,0,null,null,null,0,0]
[null,66,null,null,{"$f":"SW!G75","v":0},null,null,null,{"$f":"$I$10*F76","v":0},null,null,null,{"$f":"J76*$M$10","v":0},{"$f":"IFERROR(ROUND(AVERAGE(M76+I76),0),\"\")","v":0}]
[null,67,null,null,{"$f":"SW!G76","v":0},null,null,null,0,null,null,null,0,0]
[null,68,null,null,{"$f":"SW!G77","v":0},null,null,null,0,null,null,null,0,0]
[null,69,null,null,{"$f":"SW!G78","v":0},null,null,null,0,null,null,null,0,0]
[null,70,null,null,{"$f":"SW!G79","v":0},null,null,null,0,null,null,null,0,0]
[null,71,null,null,{"$f":"SW!G80","v":0},null,null,null,0,null,null,null,0,0]
[null,72,null,null,{"$f":"SW!G81","v":0},null,null,null,0,null,null,null,0,0]
[null,73,null,null,{"$f":"SW!G82","v":0},null,null,null,0,null,null,null,0,0]
[null,74,null,null,{"$f":"SW!G83","v":0},null,null,null,0,null,null,null,0,0]
[null,75,null,null,{"$f":"SW!G84","v":0},null,null,null,0,null,null,null,0,0]
[null,76,null,null,{"$f":"SW!G85","v":0},null,null,null,0,null,null,null,0,0]
[null,77,null,null,{"$f":"SW!G86","v":0},null,null,null,0,null,null,null,0,0]
[null,78,null,null,{"$f":"SW!G87","v":0},null,null,null,0,null,null,null,0,0]
[null,79,null,null,{"$f":"SW!G88","v":0},null,null,null,0,null,null,null,0,0]
[null,80,null,null,{"$f":"SW!G89","v":0},null,null,null,0,null,null,null,0,0]
[null,81,null,null,{"$f":"SW!G90","v":0},null,null,null,0,null,null,null,0,0]
[null,82,null,null,{"$f":"SW!G91","v":0},null,null,null,0,null,null,null,0,0]
[null,83,null,null,{"$f":"SW!G92","v":0},null,null,null,0,null,null,null,0,0]
[null,84,null,null,{"$f":"SW!G93","v":0},null,null,null,0,null,null,null,0,0]
[null,85,null,null,{"$f":"SW!G94","v":0},null,null,null,0,null,null,null,0,0]
[null,86,null,null,{"$f":"SW!G95","v":0},null,null,null,0,null,null,null,0,0]
[null,87,null,null,{"$f":"SW!G96","v":0},null,null,null,0,null,null,null,0,0]
[null,88,null,null,{"$f":"SW!G97","v":0},null,null,null,0,null,null,null,0,0]
[null,89,null,null,{"$f":"SW!G98","v":0},null,null,null,0,null,null,null,0,0]

{"sheet":"BIG","index":10,"n_rows":99,"n_cols":15,"rows_kept":99,"cut":false,"hidden":false,"merged":[[98,5,98,7],[98,9,98,11],[98,13,98,16],[96,5,96,7],[96,9,96,11],[96,13,96,16],[97,5,97,7],[97,9,97,11],[97,13,97,16],[94,5,94,7],[94,9,94,11],[94,13,94,16],[95,5,95,7],[95,9,95,11],[95,13,95,16],[92,5,92,7],[92,9,92,11],[92,13,92,16],[93,5,93,7],[93,9,93,11],[93,13,93,16],[90,5,90,7],[90,9,90,11],[90,13,90,16],[91,5,91,7],[91,9,91,11],[91,13,91,16],[88,5,88,7],[88,9,88,11],[88,13,88,16],[89,5,89,7],[89,9,89,11],[89,13,89,16],[86,5,86,7],[86,9,86,11],[86,13,86,16],[87,5,87,7],[87,9,87,11],[87,13,87,16],[84,5,84,7],[84,9,84,11],[84,13,84,16],[85,5,85,7],[85,9,85,11],[85,13,85,16],[82,5,82,7],[82,9,82,11],[82,13,82,16],[83,5,83,7],[83,9,83,11],[83,13,83,16],[80,5,80,7],[80,9,80,11],[80,13,80,16],[81,5,81,7],[81,9,81,11],[81,13,81,16],[78,5,78,7],[78,9,78,11],[78,13,78,16],[79,5,79,7],[79,9,79,11],[79,13,79,16],[76,5,76,7],[76,9,76,11],[76,13,76,16],[77,5,77,7],[77,9,77,11],[77,13,77,16],[74,5,74,7],[74,9,74,11],[74,13,74,16],[75,5,75,7],[75,9,75,11],[75,13,75,16],[72,5,72,7],[72,9,72,11],[72,13,72,16],[73,5,73,7],[73,9,73,11],[73,13,73,16],[70,5,70,7],[70,9,70,11],[70,13,70,16],[71,5,71,7],[71,9,71,11],[71,13,71,16],[68,5,68,7],[68,9,68,11],[68,13,68,16],[69,5,69,7],[69,9,69,11],[69,13,69,16],[66,5,66,7],[66,9,66,11],[66,13,66,16],[67,5,67,7],[67,9,67,11],[67,13,67,16],[64,5,64,7],[64,9,64,11],[64,13,64,16],[65,5,65,7],[65,9,65,11],[65,13,65,16],[62,5,62,7],[62,9,62,11],[62,13,62,16],[63,5,63,7],[63,9,63,11],[63,13,63,16],[60,5,60,7],[60,9,60,11],[60,13,60,16],[61,5,61,7],[61,9,61,11],[61,13,61,16],[58,5,58,7],[58,9,58,11],[58,13,58,16],[59,5,59,7],[59,9,59,11],[59,13,59,16],[56,5,56,7],[56,9,56,11],[56,13,56,16],[57,5,57,7],[57,9,57,11],[57,13,57,16],[54,5,54,7],[54,9,54,11],[54,13,54,16],[55,5,55,7],[55,9,55,11],[55,13,55,16],[52,5,52,7],[52,9,52,11],[52,13,52,16],[53,5,53,7],[53,9,53,11],[53,13,53,16],[50,5,50,7],[50,9,50,11],[50,13,50,16],[51,5,51,7],[51,9,51,11],[51,13,51,16],[48,5,48,7],[48,9,48,11],[48,13,48,16],[49,5,49,7],[49,9,49,11],[49,13,49,16],[46,5,46,7],[46,9,46,11],[46,13,46,16],[47,5,47,7],[47,9,47,11],[47,13,47,16],[44,5,44,7],[44,9,44,11],[44,13,44,16],[45,5,45,7],[45,9,45,11],[45,13,45,16],[42,5,42,7],[42,9,42,11],[42,13,42,16],[43,5,43,7],[43,9,43,11],[43,13,43,16],[40,5,40,7],[40,9,40,11],[40,13,40,16],[41,5,41,7],[41,9,41,11],[41,13,41,16],[38,5,38,7],[38,9,38,11],[38,13,38,16],[39,5,39,7],[39,9,39,11],[39,13,39,16],[36,5,36,7],[36,9,36,11],[36,13,36,16],[37,5,37,7],[37,9,37,11],[37,13,37,16],[34,5,34,7],[34,9,34,11],[34,13,34,16],[35,5,35,7],[35,9,35,11],[35,13,35,16],[32,5,32,7],[32,9,32,11],[32,13,32,16],[33,5,33,7],[33,9,33,11],[33,13,33,16],[30,5,30,7],[30,9,30,11],[30,13,30,16],[31,5,31,7],[31,9,31,11],[31,13,31,16],[28,5,28,7],[28,9,28,11],[28,13,28,16],[29,5,29,7],[29,9,29,11],[29,13,29,16],[26,5,26,7],[26,9,26,11],[26,13,26,16],[27,5,27,7],[27,9,27,11],[27,13,27,16],[24,5,24,7],[24,9,24,11],[24,13,24,16],[25,5,25,7],[25,9,25,11],[25,13,25,16],[22,5,22,7],[22,9,22,11],[22,13,22,16],[23,5,23,7],[23,9,23,11],[23,13,23,16],[20,5,20,7],[20,9,20,11],[20,13,20,16],[21,5,21,7],[21,9,21,11],[21,13,21,16],[18,5,18,7],[18,9,18,11],[18,13,18,16],[19,5,19,7],[19,9,19,11],[19,13,19,16],[16,5,16,7],[16,9,16,11],[16,13,16,16],[17,5,17,7],[17,9,17,11],[17,13,17,16],[14,5,14,7],[14,9,14,11],[14,13,14,16],[15,5,15,7],[15,9,15,11],[15,13,15,16],[12,5,12,7],[12,9,12,11],[12,13,12,16],[13,5,13,7],[13,9,13,11],[13,13,13,16],[9,9,9,11],[10,5,10,7],[10,9,10,11],[10,13,10,16],[11,5,11,7],[11,9,11,11],[11,13,11,16],[1,1,1,16],[3,6,3,12],[3,14,5,15],[4,6,4,12],[5,6,5,12],[8,1,9,1],[8,4,9,4],[8,5,8,12],[8,13,9,16],[9,5,9,7]]}
[]
[null,"D A F T A R   N I L A I"]
[]
[null,"MATA PELAJARAN",null,null,null,":","Bahasa Inggris",null,null,null,null,null,null,null,"↗"]
[null,"KELAS",null,null,null,":",{"$f":"UPPER(MN!D22)","v":"V B"}]
[null,"TAHUN PELAJARAN",null,null,null,":",{"$f":"MN!D18","v":"2019 - 2020"}]
[]
[]
[null,"No","No. Induk","NISN","Nama Siswa","NILAI",null,null,null,null,null,null,null,"JUMLAH"]
[null,null,null,null,null,"PG",null,null,0.5,"ESSAY",null,null,{"$f":"100%-I10","v":0.5}]
[null,1,null,null,{"$f":"SW!G10","v":"ABD. ROCHMAN NAJA FATLAN PRATAMA"},35,null,null,{"$f":"$I$10*F11","v":17.5},35,null,null,{"$f":"J11*$M$10","v":17.5},{"$f":"IFERROR(ROUND(AVERAGE(M11+I11),0),\"\")","v":35}]
[null,2,null,null,{"$f":"SW!G11","v":"ABDURRAHMAN FAQIH"},38,null,null,{"$f":"$I$10*F12","v":19},38,null,null,{"$f":"J12*$M$10","v":19},{"$f":"IFERROR(ROUND(AVERAGE(M12+I12),0),\"\")","v":38}]
[null,3,null,null,{"$f":"SW!G12","v":"ACHMAD FARROIHUN MUSHOBIRONILLAH"},43,null,null,21.5,43,null,null,21.5,43]
[null,4,null,null,{"$f":"SW!G13","v":"ACHMAD HASBI ASSIDDIQI"},25,null,null,12.5,25,null,null,12.5,25]
[null,5,null,null,{"$f":"SW!G14","v":"ACHMAD REZA AKRAM ALAUDDIN"},72,null,null,36,72,null,null,36,72]
[null,6,null,null,{"$f":"SW!G15","v":"ACHMAD YANI"},45,null,null,22.5,45,null,null,22.5,45]
[null,7,null,null,{"$f":"SW!G16","v":"AKHMAD RIDWAN"},81,null,null,40.5,81,null,null,40.5,81]
[null,8,null,null,{"$f":"SW!G17","v":"ANDREAN DWI YULIANO"},10,null,null,5,10,null,null,5,10]
[null,9,null,null,{"$f":"SW!G18","v":"ASFAN FAKHRI BARANI"},55,null,null,27.5,55,null,null,27.5,55]
[null,10,null,null,{"$f":"SW!G19","v":"DEVAN ADITYA SAPUTRA"},84,null,null,42,84,null,null,42,84]
[null,11,null,null,{"$f":"SW!G20","v":"FAHRUL AHMAD FAHREZA"},60,null,null,30,60,null,null,30,60]
[null,12,null,null,{"$f":"SW!G21","v":"FAUZIA AMELIA PUTRI"},61,null,null,30.5,61,null,null,30.5,61]
[null,13,null,null,{"$f":"SW!G22","v":"FAZA AZIFAH SALSABILA"},53,null,null,26.5,53,null,null,26.5,53]
[null,14,null,null,{"$f":"SW!G23","v":"HABIBIE NURUSSALAM"},77,null,null,38.5,77,null,null,38.5,77]
[null,15,null,null,{"$f":"SW!G24","v":"HIMATURROSYIDAH"},50,null,null,25,50,null,null,25,50]
[null,16,null,null,{"$f":"SW!G25","v":"IFKARINA NAILA SAUQYA"},62,null,null,31,62,null,null,31,62]
[null,17,null,null,{"$f":"SW!G26","v":"KEISA AYU SASKIYAH"},53,null,null,26.5,53,null,null,26.5,53]
[null,18,null,null,{"$f":"SW!G27","v":"MOCHAMMAD RENO FIRMANSYAH"},20,null,null,10,20,null,null,10,20]
[null,19,null,null,{"$f":"SW!G28","v":"MOHAMAD NUR KHAFID KHABIBULLOH"},38,null,null,19,38,null,null,19,38]
[null,20,null,null,{"$f":"SW!G29","v":"MOHAMMAD NAUFAL NAWWARUDDIN"},25,null,null,12.5,25,null,null,12.5,25]
[null,21,null,null,{"$f":"SW!G30","v":"MUCHAMAD PRIMA PAMBUDI"},36,null,null,18,36,null,null,18,36]
[null,22,null,null,{"$f":"SW!G31","v":"MUHAMMAD ALFAN FATHONI"},71,null,null,35.5,71,null,null,35.5,71]
[null,23,null,null,{"$f":"SW!G32","v":"MUHAMMAD AMINULLAH MAULUDANI"},30,null,null,15,30,null,null,15,30]
[null,24,null,null,{"$f":"SW!G33","v":"MUHAMMAD DAVIN  LEVANTINO"},74,null,null,37,74,null,null,37,74]
[null,25,null,null,{"$f":"SW!G34","v":"MUHAMMAD MAULANA PAHLEVY"},72,null,null,36,72,null,null,36,72]
[null,26,null,null,{"$f":"SW!G35","v":"RADITYA NIRWANSYAH"},45,null,null,22.5,45,null,null,22.5,45]
[null,27,null,null,{"$f":"SW!G36","v":"REVINA SRI UTARI"},53,null,null,26.5,53,null,null,26.5,53]
[null,28,null,null,{"$f":"SW!G37","v":"REYHAN DWI ANDIKA"},30,null,null,15,30,null,null,15,30]
[null,29,null,null,{"$f":"SW!G38","v":"RISKA LAURA TRIA OCTAVIA"},75,null,null,37.5,75,null,null,37.5,75]
[null,30,null,null,{"$f":"SW!G39","v":"ROHMADONA DWI SAFITRI"},60,null,null,30,60,null,null,30,60]
[null,31,null,null,{"$f":"SW!G40","v":"SALMAN ALFARIZI"},35,null,null,17.5,35,null,null,17.5,35]
[null,32,null,null,{"$f":"SW!G41","v":"TAUFIQ KURROHMAN"},42,null,null,21,42,null,null,21,42]
[null,33,null,null,{"$f":"SW!G42","v":0},null,null,null,0,null,null,null,0,0]
[null,34,null,null,{"$f":"SW!G43","v":0},null,null,null,0,null,null,null,0,0]
[null,35,null,null,{"$f":"SW!G44","v":0},null,null,null,0,null,null,null,0,0]
[null,36,null,null,{"$f":"SW!G45","v":0},null,null,null,0,null,null,null,0,0]
[null,37,null,null,{"$f":"SW!G46","v":0},null,null,null,0,null,null,null,0,0]
[null,38,null,null,{"$f":"SW!G47","v":0},null,null,null,0,null,null,null,0,0]
[null,39,null,null,{"$f":"SW!G48","v":0},null,null,null,0,null,null,null,0,0]
[null,40,null,null,{"$f":"SW!G49","v":0},null,null,null,0,null,null,null,0,0]
[null,41,null,null,{"$f":"SW!G50","v":0},null,null,null,0,null,null,null,0,0]
[null,42,null,null,{"$f":"SW!G51","v":0},null,null,null,0,null,null,null,0,0]
[null,43,null,null,{"$f":"SW!G52","v":0},null,null,null,0,null,null,null,0,0]
[null,44,null,null,{"$f":"SW!G53","v":0},null,null,null,0,null,null,null,0,0]
[null,45,null,null,{"$f":"SW!G54","v":0},null,null,null,0,null,null,null,0,0]
[null,46,null,null,{"$f":"SW!G55","v":0},null,null,null,0,null,null,null,0,0]
[null,47,null,null,{"$f":"SW!G56","v":0},null,null,null,0,null,null,null,0,0]
[null,48,null,null,{"$f":"SW!G57","v":0},null,null,null,0,null,null,null,0,0]
[null,49,null,null,{"$f":"SW!G58","v":0},null,null,null,0,null,null,null,0,0]
[null,50,null,null,{"$f":"SW!G59","v":0},null,null,null,0,null,null,null,0,0]
[null,51,null,null,{"$f":"SW!G60","v":0},null,null,null,0,null,null,null,0,0]
[null,52,null,null,{"$f":"SW!G61","v":0},null,null,null,0,null,null,null,0,0]
[null,53,null,null,{"$f":"SW!G62","v":0},null,null,null,0,null,null,null,0,0]
[null,54,null,null,{"$f":"SW!G63","v":0},null,null,null,0,null,null,null,0,0]
[null,55,null,null,{"$f":"SW!G64","v":0},null,null,null,0,null,null,null,0,0]
[null,56,null,null,{"$f":"SW!G65","v":0},null,null,null,0,null,null,null,0,0]
[null,57,null,null,{"$f":"SW!G66","v":0},null,null,null,0,null,null,null,0,0]
[null,58,null,null,{"$f":"SW!G67","v":0},null,null,null,0,null,null,null,0,0]
[null,59,null,null,{"$f":"SW!G68","v":0},null,null,null,0,null,null,null,0,0]
[null,60,null,null,{"$f":"SW!G69","v":0},null,null,null,0,null,null,null,0,0]
[null,61,null,null,{"$f":"SW!G70","v":0},null,null,null,0,null,null,null,0,0]
[null,62,null,null,{"$f":"SW!G71","v":0},null,null,null,0,null,null,null,0,0]
[null,63,null,null,{"$f":"SW!G72","v":0},null,null,null,0,null,null,null,0,0]
[null,64,null,null,{"$f":"SW!G73","v":0},null,null,null,0,null,null,null,0,0]
[null,65,null,null,{"$f":"SW!G74","v":0},null,null,null,0,null,null,null,0,0]
[null,66,null,null,{"$f":"SW!G75","v":0},null,null,null,{"$f":"$I$10*F76","v":0},null,null,null,{"$f":"J76*$M$10","v":0},{"$f":"IFERROR(ROUND(AVERAGE(M76+I76),0),\"\")","v":0}]
[null,67,null,null,{"$f":"SW!G76","v":0},null,null,null,0,null,null,null,0,0]
[null,68,null,null,{"$f":"SW!G77","v":0},null,null,null,0,null,null,null,0,0]
[null,69,null,null,{"$f":"SW!G78","v":0},null,null,null,0,null,null,null,0,0]
[null,70,null,null,{"$f":"SW!G79","v":0},null,null,null,0,null,null,null,0,0]
[null,71,null,null,{"$f":"SW!G80","v":0},null,null,null,0,null,null,null,0,0]
[null,72,null,null,{"$f":"SW!G81","v":0},null,null,null,0,null,null,null,0,0]
[null,73,null,null,{"$f":"SW!G82","v":0},null,null,null,0,null,null,null,0,0]
[null,74,null,null,{"$f":"SW!G83","v":0},null,null,null,0,null,null,null,0,0]
[null,75,null,null,{"$f":"SW!G84","v":0},null,null,null,0,null,null,null,0,0]
[null,76,null,null,{"$f":"SW!G85","v":0},null,null,null,0,null,null,null,0,0]
[null,77,null,null,{"$f":"SW!G86","v":0},null,null,null,0,null,null,null,0,0]
[null,78,null,null,{"$f":"SW!G87","v":0},null,null,null,0,null,null,null,0,0]
[null,79,null,null,{"$f":"SW!G88","v":0},null,null,null,0,null,null,null,0,0]
[null,80,null,null,{"$f":"SW!G89","v":0},null,null,null,0,null,null,null,0,0]
[null,81,null,null,{"$f":"SW!G90","v":0},null,null,null,0,null,null,null,0,0]
[null,82,null,null,{"$f":"SW!G91","v":0},null,null,null,0,null,null,null,0,0]
[null,83,null,null,{"$f":"SW!G92","v":0},null,null,null,0,null,null,null,0,0]
[null,84,null,null,{"$f":"SW!G93","v":0},null,null,null,0,null,null,null,0,0]
[null,85,null,null,{"$f":"SW!G94","v":0},null,null,null,0,null,null,null,0,0]
[null,86,null,null,{"$f":"SW!G95","v":0},null,null,null,0,null,null,null,0,0]
[null,87,null,null,{"$f":"SW!G96","v":0},null,null,null,0,null,null,null,0,0]
[null,88,null,null,{"$f":"SW!G97","v":0},null,null,null,0,null,null,null,0,0]
[null,89,null,null,{"$f":"SW!G98","v":0},null,null,null,0,null,null,null,0,0]

{"sheet":"ASWJ","index":11,"n_rows":99,"n_cols":15,"rows_kept":99,"cut":false,"hidden":false,"merged":[[98,5,98,7],[98,9,98,11],[98,13,98,16],[96,5,96,7],[96,9,96,11],[96,13,96,16],[97,5,97,7],[97,9,97,11],[97,13,97,16],[94,5,94,7],[94,9,94,11],[94,13,94,16],[95,5,95,7],[95,9,95,11],[95,13,95,16],[92,5,92,7],[92,9,92,11],[92,13,92,16],[93,5,93,7],[93,9,93,11],[93,13,93,16],[90,5,90,7],[90,9,90,11],[90,13,90,16],[91,5,91,7],[91,9,91,11],[91,13,91,16],[88,5,88,7],[88,9,88,11],[88,13,88,16],[89,5,89,7],[89,9,89,11],[89,13,89,16],[86,5,86,7],[86,9,86,11],[86,13,86,16],[87,5,87,7],[87,9,87,11],[87,13,87,16],[84,5,84,7],[84,9,84,11],[84,13,84,16],[85,5,85,7],[85,9,85,11],[85,13,85,16],[82,5,82,7],[82,9,82,11],[82,13,82,16],[83,5,83,7],[83,9,83,11],[83,13,83,16],[80,5,80,7],[80,9,80,11],[80,13,80,16],[81,5,81,7],[81,9,81,11],[81,13,81,16],[78,5,78,7],[78,9,78,11],[78,13,78,16],[79,5,79,7],[79,9,79,11],[79,13,79,16],[76,5,76,7],[76,9,76,11],[76,13,76,16],[77,5,77,7],[77,9,77,11],[77,13,77,16],[74,5,74,7],[74,9,74,11],[74,13,74,16],[75,5,75,7],[75,9,75,11],[75,13,75,16],[72,5,72,7],[72,9,72,11],[72,13,72,16],[73,5,73,7],[73,9,73,11],[73,13,73,16],[70,5,70,7],[70,9,70,11],[70,13,70,16],[71,5,71,7],[71,9,71,11],[71,13,71,16],[68,5,68,7],[68,9,68,11],[68,13,68,16],[69,5,69,7],[69,9,69,11],[69,13,69,16],[66,5,66,7],[66,9,66,11],[66,13,66,16],[67,5,67,7],[67,9,67,11],[67,13,67,16],[64,5,64,7],[64,9,64,11],[64,13,64,16],[65,5,65,7],[65,9,65,11],[65,13,65,16],[62,5,62,7],[62,9,62,11],[62,13,62,16],[63,5,63,7],[63,9,63,11],[63,13,63,16],[60,5,60,7],[60,9,60,11],[60,13,60,16],[61,5,61,7],[61,9,61,11],[61,13,61,16],[58,5,58,7],[58,9,58,11],[58,13,58,16],[59,5,59,7],[59,9,59,11],[59,13,59,16],[56,5,56,7],[56,9,56,11],[56,13,56,16],[57,5,57,7],[57,9,57,11],[57,13,57,16],[54,5,54,7],[54,9,54,11],[54,13,54,16],[55,5,55,7],[55,9,55,11],[55,13,55,16],[52,5,52,7],[52,9,52,11],[52,13,52,16],[53,5,53,7],[53,9,53,11],[53,13,53,16],[50,5,50,7],[50,9,50,11],[50,13,50,16],[51,5,51,7],[51,9,51,11],[51,13,51,16],[48,5,48,7],[48,9,48,11],[48,13,48,16],[49,5,49,7],[49,9,49,11],[49,13,49,16],[46,5,46,7],[46,9,46,11],[46,13,46,16],[47,5,47,7],[47,9,47,11],[47,13,47,16],[44,5,44,7],[44,9,44,11],[44,13,44,16],[45,5,45,7],[45,9,45,11],[45,13,45,16],[42,5,42,7],[42,9,42,11],[42,13,42,16],[43,5,43,7],[43,9,43,11],[43,13,43,16],[40,5,40,7],[40,9,40,11],[40,13,40,16],[41,5,41,7],[41,9,41,11],[41,13,41,16],[38,5,38,7],[38,9,38,11],[38,13,38,16],[39,5,39,7],[39,9,39,11],[39,13,39,16],[36,5,36,7],[36,9,36,11],[36,13,36,16],[37,5,37,7],[37,9,37,11],[37,13,37,16],[34,5,34,7],[34,9,34,11],[34,13,34,16],[35,5,35,7],[35,9,35,11],[35,13,35,16],[32,5,32,7],[32,9,32,11],[32,13,32,16],[33,5,33,7],[33,9,33,11],[33,13,33,16],[30,5,30,7],[30,9,30,11],[30,13,30,16],[31,5,31,7],[31,9,31,11],[31,13,31,16],[28,5,28,7],[28,9,28,11],[28,13,28,16],[29,5,29,7],[29,9,29,11],[29,13,29,16],[26,5,26,7],[26,9,26,11],[26,13,26,16],[27,5,27,7],[27,9,27,11],[27,13,27,16],[24,5,24,7],[24,9,24,11],[24,13,24,16],[25,5,25,7],[25,9,25,11],[25,13,25,16],[22,5,22,7],[22,9,22,11],[22,13,22,16],[23,5,23,7],[23,9,23,11],[23,13,23,16],[20,5,20,7],[20,9,20,11],[20,13,20,16],[21,5,21,7],[21,9,21,11],[21,13,21,16],[18,5,18,7],[18,9,18,11],[18,13,18,16],[19,5,19,7],[19,9,19,11],[19,13,19,16],[16,5,16,7],[16,9,16,11],[16,13,16,16],[17,5,17,7],[17,9,17,11],[17,13,17,16],[14,5,14,7],[14,9,14,11],[14,13,14,16],[15,5,15,7],[15,9,15,11],[15,13,15,16],[12,5,12,7],[12,9,12,11],[12,13,12,16],[13,5,13,7],[13,9,13,11],[13,13,13,16],[9,9,9,11],[10,5,10,7],[10,9,10,11],[10,13,10,16],[11,5,11,7],[11,9,11,11],[11,13,11,16],[1,1,1,16],[3,6,3,12],[3,14,5,15],[4,6,4,12],[5,6,5,12],[8,1,9,1],[8,4,9,4],[8,5,8,12],[8,13,9,16],[9,5,9,7]]}
[]
[null,"D A F T A R   N I L A I"]
[]
[null,"MATA PELAJARAN",null,null,null,":","Aswaja",null,null,null,null,null,null,null,"↗"]
[null,"KELAS",null,null,null,":",{"$f":"UPPER(MN!D22)","v":"V B"}]
[null,"TAHUN PELAJARAN",null,null,null,":",{"$f":"MN!D18","v":"2019 - 2020"}]
[]
[]
[null,"No","No. Induk","NISN","Nama Siswa","NILAI",null,null,null,null,null,null,null,"JUMLAH"]
[null,null,null,null,null,"PG",null,null,0.5,"ESSAY",null,null,{"$f":"100%-I10","v":0.5}]
[null,1,null,null,{"$f":"SW!G10","v":"ABD. ROCHMAN NAJA FATLAN PRATAMA"},52,52,52,{"$f":"$I$10*F11","v":26},68,68,68,{"$f":"J11*$M$10","v":34},{"$f":"IFERROR(ROUND(AVERAGE(M11+I11),0),\"\")","v":60}]
[null,2,null,null,{"$f":"SW!G11","v":"ABDURRAHMAN FAQIH"},40,40,40,{"$f":"$I$10*F12","v":20},67,66.25,66.25,{"$f":"J12*$M$10","v":33.5},{"$f":"IFERROR(ROUND(AVERAGE(M12+I12),0),\"\")","v":54}]
[null,3,null,null,{"$f":"SW!G12","v":"ACHMAD FARROIHUN MUSHOBIRONILLAH"},48,48,48,24,67,66.75,66.75,33.5,58]
[null,4,null,null,{"$f":"SW!G13","v":"ACHMAD HASBI ASSIDDIQI"},60,60,60,30,63,63,63,31.5,62]
[null,5,null,null,{"$f":"SW!G14","v":"ACHMAD REZA AKRAM ALAUDDIN"},60,60,60,30,68,67.75,67.75,34,64]
[null,6,null,null,{"$f":"SW!G15","v":"ACHMAD YANI"},48,48,48,24,66,66,66,33,57]
[null,7,null,null,{"$f":"SW!G16","v":"AKHMAD RIDWAN"},68,68,68,34,60,60,60,30,64]
[null,8,null,null,{"$f":"SW!G17","v":"ANDREAN DWI YULIANO"},32,32,32,16,60,60,60,30,46]
[null,9,null,null,{"$f":"SW!G18","v":"ASFAN FAKHRI BARANI"},52,52,52,26,60,60,60,30,56]
[null,10,null,null,{"$f":"SW!G19","v":"DEVAN ADITYA SAPUTRA"},52,52,52,26,60,60,60,30,56]
[null,11,null,null,{"$f":"SW!G20","v":"FAHRUL AHMAD FAHREZA"},60,60,60,30,60,60,60,30,60]
[null,12,null,null,{"$f":"SW!G21","v":"FAUZIA AMELIA PUTRI"},52,52,52,26,72,71.5,71.5,36,62]
[null,13,null,null,{"$f":"SW!G22","v":"FAZA AZIFAH SALSABILA"},36,36,36,18,71,71,71,35.5,54]
[null,14,null,null,{"$f":"SW!G23","v":"HABIBIE NURUSSALAM"},48,48,48,24,65,64.75,64.75,32.5,57]
[null,15,null,null,{"$f":"SW!G24","v":"HIMATURROSYIDAH"},60,60,60,30,68,68,68,34,64]
[null,16,null,null,{"$f":"SW!G25","v":"IFKARINA NAILA SAUQYA"},84,84,84,42,70,70,70,35,77]
[null,17,null,null,{"$f":"SW!G26","v":"KEISA AYU SASKIYAH"},48,48,48,24,70,70,70,35,59]
[null,18,null,null,{"$f":"SW!G27","v":"MOCHAMMAD RENO FIRMANSYAH"},32,32,32,16,60,60,60,30,46]
[null,19,null,null,{"$f":"SW!G28","v":"MOHAMAD NUR KHAFID KHABIBULLOH"},64,64,64,32,65,64.75,64.75,32.5,65]
[null,20,null,null,{"$f":"SW!G29","v":"MOHAMMAD NAUFAL NAWWARUDDIN"},24,24,24,12,60,60,60,30,42]
[null,21,null,null,{"$f":"SW!G30","v":"MUCHAMAD PRIMA PAMBUDI"},28,28,28,14,60,60,60,30,44]
[null,22,null,null,{"$f":"SW!G31","v":"MUHAMMAD ALFAN FATHONI"},32,32,32,16,72,72,72,36,52]
[null,23,null,null,{"$f":"SW!G32","v":"MUHAMMAD AMINULLAH MAULUDANI"},28,28,28,14,60,60,60,30,44]
[null,24,null,null,{"$f":"SW!G33","v":"MUHAMMAD DAVIN  LEVANTINO"},44,44,44,22,71,71,71,35.5,58]
[null,25,null,null,{"$f":"SW!G34","v":"MUHAMMAD MAULANA PAHLEVY"},28,28,28,14,68,67.75,67.75,34,48]
[null,26,null,null,{"$f":"SW!G35","v":"RADITYA NIRWANSYAH"},44,44,44,22,60,60,60,30,52]
[null,27,null,null,{"$f":"SW!G36","v":"REVINA SRI UTARI"},40,40,40,20,68,68,68,34,54]
[null,28,null,null,{"$f":"SW!G37","v":"REYHAN DWI ANDIKA"},28,28,28,14,68,67.5,67.5,34,48]
[null,29,null,null,{"$f":"SW!G38","v":"RISKA LAURA TRIA OCTAVIA"},56,56,56,28,75,75,75,37.5,66]
[null,30,null,null,{"$f":"SW!G39","v":"ROHMADONA DWI SAFITRI"},56,56,56,28,68,67.5,67.5,34,62]
[null,31,null,null,{"$f":"SW!G40","v":"SALMAN ALFARIZI"},60,60,60,30,60,60,60,30,60]
[null,32,null,null,{"$f":"SW!G41","v":"TAUFIQ KURROHMAN"},44,44,44,22,60,60,60,30,52]
[null,33,null,null,{"$f":"SW!G42","v":0},null,null,null,0,null,null,null,0,0]
[null,34,null,null,{"$f":"SW!G43","v":0},null,null,null,0,null,null,null,0,0]
[null,35,null,null,{"$f":"SW!G44","v":0},null,null,null,0,null,null,null,0,0]
[null,36,null,null,{"$f":"SW!G45","v":0},null,null,null,0,null,null,null,0,0]
[null,37,null,null,{"$f":"SW!G46","v":0},null,null,null,0,null,null,null,0,0]
[null,38,null,null,{"$f":"SW!G47","v":0},null,null,null,0,null,null,null,0,0]
[null,39,null,null,{"$f":"SW!G48","v":0},null,null,null,0,null,null,null,0,0]
[null,40,null,null,{"$f":"SW!G49","v":0},null,null,null,0,null,null,null,0,0]
[null,41,null,null,{"$f":"SW!G50","v":0},null,null,null,0,null,null,null,0,0]
[null,42,null,null,{"$f":"SW!G51","v":0},null,null,null,0,null,null,null,0,0]
[null,43,null,null,{"$f":"SW!G52","v":0},null,null,null,0,null,null,null,0,0]
[null,44,null,null,{"$f":"SW!G53","v":0},null,null,null,0,null,null,null,0,0]
[null,45,null,null,{"$f":"SW!G54","v":0},null,null,null,0,null,null,null,0,0]
[null,46,null,null,{"$f":"SW!G55","v":0},null,null,null,0,null,null,null,0,0]
[null,47,null,null,{"$f":"SW!G56","v":0},null,null,null,0,null,null,null,0,0]
[null,48,null,null,{"$f":"SW!G57","v":0},null,null,null,0,null,null,null,0,0]
[null,49,null,null,{"$f":"SW!G58","v":0},null,null,null,0,null,null,null,0,0]
[null,50,null,null,{"$f":"SW!G59","v":0},null,null,null,0,null,null,null,0,0]
[null,51,null,null,{"$f":"SW!G60","v":0},null,null,null,0,null,null,null,0,0]
[null,52,null,null,{"$f":"SW!G61","v":0},null,null,null,0,null,null,null,0,0]
[null,53,null,null,{"$f":"SW!G62","v":0},null,null,null,0,null,null,null,0,0]
[null,54,null,null,{"$f":"SW!G63","v":0},null,null,null,0,null,null,null,0,0]
[null,55,null,null,{"$f":"SW!G64","v":0},null,null,null,0,null,null,null,0,0]
[null,56,null,null,{"$f":"SW!G65","v":0},null,null,null,0,null,null,null,0,0]
[null,57,null,null,{"$f":"SW!G66","v":0},null,null,null,0,null,null,null,0,0]
[null,58,null,null,{"$f":"SW!G67","v":0},null,null,null,0,null,null,null,0,0]
[null,59,null,null,{"$f":"SW!G68","v":0},null,null,null,0,null,null,null,0,0]
[null,60,null,null,{"$f":"SW!G69","v":0},null,null,null,0,null,null,null,0,0]
[null,61,null,null,{"$f":"SW!G70","v":0},null,null,null,0,null,null,null,0,0]
[null,62,null,null,{"$f":"SW!G71","v":0},null,null,null,0,null,null,null,0,0]
[null,63,null,null,{"$f":"SW!G72","v":0},null,null,null,0,null,null,null,0,0]
[null,64,null,null,{"$f":"SW!G73","v":0},null,null,null,0,null,null,null,0,0]
[null,65,null,null,{"$f":"SW!G74","v":0},null,null,null,0,null,null,null,0,0]
[null,66,null,null,{"$f":"SW!G75","v":0},null,null,null,{"$f":"$I$10*F76","v":0},null,null,null,{"$f":"J76*$M$10","v":0},{"$f":"IFERROR(ROUND(AVERAGE(M76+I76),0),\"\")","v":0}]
[null,67,null,null,{"$f":"SW!G76","v":0},null,null,null,0,null,null,null,0,0]
[null,68,null,null,{"$f":"SW!G77","v":0},null,null,null,0,null,null,null,0,0]
[null,69,null,null,{"$f":"SW!G78","v":0},null,null,null,0,null,null,null,0,0]
[null,70,null,null,{"$f":"SW!G79","v":0},null,null,null,0,null,null,null,0,0]
[null,71,null,null,{"$f":"SW!G80","v":0},null,null,null,0,null,null,null,0,0]
[null,72,null,null,{"$f":"SW!G81","v":0},null,null,null,0,null,null,null,0,0]
[null,73,null,null,{"$f":"SW!G82","v":0},null,null,null,0,null,null,null,0,0]
[null,74,null,null,{"$f":"SW!G83","v":0},null,null,null,0,null,null,null,0,0]
[null,75,null,null,{"$f":"SW!G84","v":0},null,null,null,0,null,null,null,0,0]
[null,76,null,null,{"$f":"SW!G85","v":0},null,null,null,0,null,null,null,0,0]
[null,77,null,null,{"$f":"SW!G86","v":0},null,null,null,0,null,null,null,0,0]
[null,78,null,null,{"$f":"SW!G87","v":0},null,null,null,0,null,null,null,0,0]
[null,79,null,null,{"$f":"SW!G88","v":0},null,null,null,0,null,null,null,0,0]
[null,80,null,null,{"$f":"SW!G89","v":0},null,null,null,0,null,null,null,0,0]
[null,81,null,null,{"$f":"SW!G90","v":0},null,null,null,0,null,null,null,0,0]
[null,82,null,null,{"$f":"SW!G91","v":0},null,null,null,0,null,null,null,0,0]
[null,83,null,null,{"$f":"SW!G92","v":0},null,null,null,0,null,null,null,0,0]
[null,84,null,null,{"$f":"SW!G93","v":0},null,null,null,0,null,null,null,0,0]
[null,85,null,null,{"$f":"SW!G94","v":0},null,null,null,0,null,null,null,0,0]
[null,86,null,null,{"$f":"SW!G95","v":0},null,null,null,0,null,null,null,0,0]
[null,87,null,null,{"$f":"SW!G96","v":0},null,null,null,0,null,null,null,0,0]
[null,88,null,null,{"$f":"SW!G97","v":0},null,null,null,0,null,null,null,0,0]
[null,89,null,null,{"$f":"SW!G98","v":0},null,null,null,0,null,null,null,0,0]

{"sheet":"AA","index":12,"n_rows":99,"n_cols":15,"rows_kept":99,"cut":false,"hidden":false,"merged":[[98,5,98,7],[98,9,98,11],[98,13,98,16],[96,5,96,7],[96,9,96,11],[96,13,96,16],[97,5,97,7],[97,9,97,11],[97,13,97,16],[94,5,94,7],[94,9,94,11],[94,13,94,16],[95,5,95,7],[95,9,95,11],[95,13,95,16],[92,5,92,7],[92,9,92,11],[92,13,92,16],[93,5,93,7],[93,9,93,11],[93,13,93,16],[90,5,90,7],[90,9,90,11],[90,13,90,16],[91,5,91,7],[91,9,91,11],[91,13,91,16],[88,5,88,7],[88,9,88,11],[88,13,88,16],[89,5,89,7],[89,9,89,11],[89,13,89,16],[86,5,86,7],[86,9,86,11],[86,13,86,16],[87,5,87,7],[87,9,87,11],[87,13,87,16],[84,5,84,7],[84,9,84,11],[84,13,84,16],[85,5,85,7],[85,9,85,11],[85,13,85,16],[82,5,82,7],[82,9,82,11],[82,13,82,16],[83,5,83,7],[83,9,83,11],[83,13,83,16],[80,5,80,7],[80,9,80,11],[80,13,80,16],[81,5,81,7],[81,9,81,11],[81,13,81,16],[78,5,78,7],[78,9,78,11],[78,13,78,16],[79,5,79,7],[79,9,79,11],[79,13,79,16],[76,5,76,7],[76,9,76,11],[76,13,76,16],[77,5,77,7],[77,9,77,11],[77,13,77,16],[74,5,74,7],[74,9,74,11],[74,13,74,16],[75,5,75,7],[75,9,75,11],[75,13,75,16],[72,5,72,7],[72,9,72,11],[72,13,72,16],[73,5,73,7],[73,9,73,11],[73,13,73,16],[70,5,70,7],[70,9,70,11],[70,13,70,16],[71,5,71,7],[71,9,71,11],[71,13,71,16],[68,5,68,7],[68,9,68,11],[68,13,68,16],[69,5,69,7],[69,9,69,11],[69,13,69,16],[66,5,66,7],[66,9,66,11],[66,13,66,16],[67,5,67,7],[67,9,67,11],[67,13,67,16],[64,5,64,7],[64,9,64,11],[64,13,64,16],[65,5,65,7],[65,9,65,11],[65,13,65,16],[62,5,62,7],[62,9,62,11],[62,13,62,16],[63,5,63,7],[63,9,63,11],[63,13,63,16],[60,5,60,7],[60,9,60,11],[60,13,60,16],[61,5,61,7],[61,9,61,11],[61,13,61,16],[58,5,58,7],[58,9,58,11],[58,13,58,16],[59,5,59,7],[59,9,59,11],[59,13,59,16],[56,5,56,7],[56,9,56,11],[56,13,56,16],[57,5,57,7],[57,9,57,11],[57,13,57,16],[54,5,54,7],[54,9,54,11],[54,13,54,16],[55,5,55,7],[55,9,55,11],[55,13,55,16],[52,5,52,7],[52,9,52,11],[52,13,52,16],[53,5,53,7],[53,9,53,11],[53,13,53,16],[50,5,50,7],[50,9,50,11],[50,13,50,16],[51,5,51,7],[51,9,51,11],[51,13,51,16],[48,5,48,7],[48,9,48,11],[48,13,48,16],[49,5,49,7],[49,9,49,11],[49,13,49,16],[46,5,46,7],[46,9,46,11],[46,13,46,16],[47,5,47,7],[47,9,47,11],[47,13,47,16],[44,5,44,7],[44,9,44,11],[44,13,44,16],[45,5,45,7],[45,9,45,11],[45,13,45,16],[42,5,42,7],[42,9,42,11],[42,13,42,16],[43,5,43,7],[43,9,43,11],[43,13,43,16],[40,5,40,7],[40,9,40,11],[40,13,40,16],[41,5,41,7],[41,9,41,11],[41,13,41,16],[38,5,38,7],[38,9,38,11],[38,13,38,16],[39,5,39,7],[39,9,39,11],[39,13,39,16],[36,5,36,7],[36,9,36,11],[36,13,36,16],[37,5,37,7],[37,9,37,11],[37,13,37,16],[34,5,34,7],[34,9,34,11],[34,13,34,16],[35,5,35,7],[35,9,35,11],[35,13,35,16],[32,5,32,7],[32,9,32,11],[32,13,32,16],[33,5,33,7],[33,9,33,11],[33,13,33,16],[30,5,30,7],[30,9,30,11],[30,13,30,16],[31,5,31,7],[31,9,31,11],[31,13,31,16],[28,5,28,7],[28,9,28,11],[28,13,28,16],[29,5,29,7],[29,9,29,11],[29,13,29,16],[26,5,26,7],[26,9,26,11],[26,13,26,16],[27,5,27,7],[27,9,27,11],[27,13,27,16],[24,5,24,7],[24,9,24,11],[24,13,24,16],[25,5,25,7],[25,9,25,11],[25,13,25,16],[22,5,22,7],[22,9,22,11],[22,13,22,16],[23,5,23,7],[23,9,23,11],[23,13,23,16],[20,5,20,7],[20,9,20,11],[20,13,20,16],[21,5,21,7],[21,9,21,11],[21,13,21,16],[18,5,18,7],[18,9,18,11],[18,13,18,16],[19,5,19,7],[19,9,19,11],[19,13,19,16],[16,5,16,7],[16,9,16,11],[16,13,16,16],[17,5,17,7],[17,9,17,11],[17,13,17,16],[14,5,14,7],[14,9,14,11],[14,13,14,16],[15,5,15,7],[15,9,15,11],[15,13,15,16],[12,5,12,7],[12,9,12,11],[12,13,12,16],[13,5,13,7],[13,9,13,11],[13,13,13,16],[9,9,9,11],[10,5,10,7],[10,9,10,11],[10,13,10,16],[11,5,11,7],[11,9,11,11],[11,13,11,16],[1,1,1,16],[3,6,3,12],[3,14,5,15],[4,6,4,12],[5,6,5,12],[8,1,9,1],[8,4,9,4],[8,5,8,12],[8,13,9,16],[9,5,9,7]]}
[]
[null,"D A F T A R   N I L A I"]
[]
[null,"MATA PELAJARAN",null,null,null,":","Aqidah Akhlaq",null,null,null,null,null,null,null,"↗"]
[null,"KELAS",null,null,null,":",{"$f":"UPPER(MN!D22)","v":"V B"}]
[null,"TAHUN PELAJARAN",null,null,null,":",{"$f":"MN!D18","v":"2019 - 2020"}]
[]
[]
[null,"No","No. Induk","NISN","Nama Siswa","NILAI",null,null,null,null,null,null,null,"JUMLAH"]
[null,null,null,null,null,"PG",null,null,0.5,"ESSAY",null,null,{"$f":"100%-I10","v":0.5}]
[null,1,null,null,{"$f":"SW!G10","v":"ABD. ROCHMAN NAJA FATLAN PRATAMA"},47,47,47,{"$f":"$I$10*F11","v":23.5},70,null,null,{"$f":"J11*$M$10","v":35},{"$f":"IFERROR(ROUND(AVERAGE(M11+I11),0),\"\")","v":59}]
[null,2,null,null,{"$f":"SW!G11","v":"ABDURRAHMAN FAQIH"},20,20,20,{"$f":"$I$10*F12","v":10},60,null,null,{"$f":"J12*$M$10","v":30},{"$f":"IFERROR(ROUND(AVERAGE(M12+I12),0),\"\")","v":40}]
[null,3,null,null,{"$f":"SW!G12","v":"ACHMAD FARROIHUN MUSHOBIRONILLAH"},50,50,50,25,70,null,null,35,60]
[null,4,null,null,{"$f":"SW!G13","v":"ACHMAD HASBI ASSIDDIQI"},50,50,50,25,60,null,null,30,55]
[null,5,null,null,{"$f":"SW!G14","v":"ACHMAD REZA AKRAM ALAUDDIN"},77,77,77,38.5,90,null,null,45,84]
[null,6,null,null,{"$f":"SW!G15","v":"ACHMAD YANI"},50,50,50,25,70,null,null,35,60]
[null,7,null,null,{"$f":"SW!G16","v":"AKHMAD RIDWAN"},47,47,47,23.5,80,null,null,40,64]
[null,8,null,null,{"$f":"SW!G17","v":"ANDREAN DWI YULIANO"},53,53,53,26.5,90,null,null,45,72]
[null,9,null,null,{"$f":"SW!G18","v":"ASFAN FAKHRI BARANI"},80,80,80,40,70,null,null,35,75]
[null,10,null,null,{"$f":"SW!G19","v":"DEVAN ADITYA SAPUTRA"},23,23,23,11.5,90,null,null,45,57]
[null,11,null,null,{"$f":"SW!G20","v":"FAHRUL AHMAD FAHREZA"},73,73,73,36.5,80,null,null,40,77]
[null,12,null,null,{"$f":"SW!G21","v":"FAUZIA AMELIA PUTRI"},60,60,60,30,60,null,null,30,60]
[null,13,null,null,{"$f":"SW!G22","v":"FAZA AZIFAH SALSABILA"},60,60,60,30,50,null,null,25,55]
[null,14,null,null,{"$f":"SW!G23","v":"HABIBIE NURUSSALAM"},67,67,67,33.5,70,null,null,35,69]
[null,15,null,null,{"$f":"SW!G24","v":"HIMATURROSYIDAH"},70,70,70,35,70,null,null,35,70]
[null,16,null,null,{"$f":"SW!G25","v":"IFKARINA NAILA SAUQYA"},73,73,73,36.5,100,null,null,50,87]
[null,17,null,null,{"$f":"SW!G26","v":"KEISA AYU SASKIYAH"},50,50,50,25,50,null,null,25,50]
[null,18,null,null,{"$f":"SW!G27","v":"MOCHAMMAD RENO FIRMANSYAH"},20,20,20,10,50,null,null,25,35]
[null,19,null,null,{"$f":"SW!G28","v":"MOHAMAD NUR KHAFID KHABIBULLOH"},53,53,53,26.5,50,null,null,25,52]
[null,20,null,null,{"$f":"SW!G29","v":"MOHAMMAD NAUFAL NAWWARUDDIN"},40,40,40,20,50,null,null,25,45]
[null,21,null,null,{"$f":"SW!G30","v":"MUCHAMAD PRIMA PAMBUDI"},37,37,37,18.5,70,null,null,35,54]
[null,22,null,null,{"$f":"SW!G31","v":"MUHAMMAD ALFAN FATHONI"},23,23,23,11.5,60,null,null,30,42]
[null,23,null,null,{"$f":"SW!G32","v":"MUHAMMAD AMINULLAH MAULUDANI"},27,27,27,13.5,50,null,null,25,39]
[null,24,null,null,{"$f":"SW!G33","v":"MUHAMMAD DAVIN  LEVANTINO"},37,37,37,18.5,90,null,null,45,64]
[null,25,null,null,{"$f":"SW!G34","v":"MUHAMMAD MAULANA PAHLEVY"},30,30,30,15,80,null,null,40,55]
[null,26,null,null,{"$f":"SW!G35","v":"RADITYA NIRWANSYAH"},23,23,23,11.5,50,null,null,25,37]
[null,27,null,null,{"$f":"SW!G36","v":"REVINA SRI UTARI"},30,30,30,15,59,null,null,29.5,45]
[null,28,null,null,{"$f":"SW!G37","v":"REYHAN DWI ANDIKA"},40,40,40,20,50,null,null,25,45]
[null,29,null,null,{"$f":"SW!G38","v":"RISKA LAURA TRIA OCTAVIA"},93,93,93,46.5,70,null,null,35,82]
[null,30,null,null,{"$f":"SW!G39","v":"ROHMADONA DWI SAFITRI"},87,87,87,43.5,100,null,null,50,94]
[null,31,null,null,{"$f":"SW!G40","v":"SALMAN ALFARIZI"},20,20,20,10,50,null,null,25,35]
[null,32,null,null,{"$f":"SW!G41","v":"TAUFIQ KURROHMAN"},20,20,20,10,50,null,null,25,35]
[null,33,null,null,{"$f":"SW!G42","v":0},null,null,null,0,null,null,null,0,0]
[null,34,null,null,{"$f":"SW!G43","v":0},null,null,null,0,null,null,null,0,0]
[null,35,null,null,{"$f":"SW!G44","v":0},null,null,null,0,null,null,null,0,0]
[null,36,null,null,{"$f":"SW!G45","v":0},null,null,null,0,null,null,null,0,0]
[null,37,null,null,{"$f":"SW!G46","v":0},null,null,null,0,null,null,null,0,0]
[null,38,null,null,{"$f":"SW!G47","v":0},null,null,null,0,null,null,null,0,0]
[null,39,null,null,{"$f":"SW!G48","v":0},null,null,null,0,null,null,null,0,0]
[null,40,null,null,{"$f":"SW!G49","v":0},null,null,null,0,null,null,null,0,0]
[null,41,null,null,{"$f":"SW!G50","v":0},null,null,null,0,null,null,null,0,0]
[null,42,null,null,{"$f":"SW!G51","v":0},null,null,null,0,null,null,null,0,0]
[null,43,null,null,{"$f":"SW!G52","v":0},null,null,null,0,null,null,null,0,0]
[null,44,null,null,{"$f":"SW!G53","v":0},null,null,null,0,null,null,null,0,0]
[null,45,null,null,{"$f":"SW!G54","v":0},null,null,null,0,null,null,null,0,0]
[null,46,null,null,{"$f":"SW!G55","v":0},null,null,null,0,null,null,null,0,0]
[null,47,null,null,{"$f":"SW!G56","v":0},null,null,null,0,null,null,null,0,0]
[null,48,null,null,{"$f":"SW!G57","v":0},null,null,null,0,null,null,null,0,0]
[null,49,null,null,{"$f":"SW!G58","v":0},null,null,null,0,null,null,null,0,0]
[null,50,null,null,{"$f":"SW!G59","v":0},null,null,null,0,null,null,null,0,0]
[null,51,null,null,{"$f":"SW!G60","v":0},null,null,null,0,null,null,null,0,0]
[null,52,null,null,{"$f":"SW!G61","v":0},null,null,null,0,null,null,null,0,0]
[null,53,null,null,{"$f":"SW!G62","v":0},null,null,null,0,null,null,null,0,0]
[null,54,null,null,{"$f":"SW!G63","v":0},null,null,null,0,null,null,null,0,0]
[null,55,null,null,{"$f":"SW!G64","v":0},null,null,null,0,null,null,null,0,0]
[null,56,null,null,{"$f":"SW!G65","v":0},null,null,null,0,null,null,null,0,0]
[null,57,null,null,{"$f":"SW!G66","v":0},null,null,null,0,null,null,null,0,0]
[null,58,null,null,{"$f":"SW!G67","v":0},null,null,null,0,null,null,null,0,0]
[null,59,null,null,{"$f":"SW!G68","v":0},null,null,null,0,null,null,null,0,0]
[null,60,null,null,{"$f":"SW!G69","v":0},null,null,null,0,null,null,null,0,0]
[null,61,null,null,{"$f":"SW!G70","v":0},null,null,null,0,null,null,null,0,0]
[null,62,null,null,{"$f":"SW!G71","v":0},null,null,null,0,null,null,null,0,0]
[null,63,null,null,{"$f":"SW!G72","v":0},null,null,null,0,null,null,null,0,0]
[null,64,null,null,{"$f":"SW!G73","v":0},null,null,null,0,null,null,null,0,0]
[null,65,null,null,{"$f":"SW!G74","v":0},null,null,null,0,null,null,null,0,0]
[null,66,null,null,{"$f":"SW!G75","v":0},null,null,null,{"$f":"$I$10*F76","v":0},null,null,null,{"$f":"J76*$M$10","v":0},{"$f":"IFERROR(ROUND(AVERAGE(M76+I76),0),\"\")","v":0}]
[null,67,null,null,{"$f":"SW!G76","v":0},null,null,null,0,null,null,null,0,0]
[null,68,null,null,{"$f":"SW!G77","v":0},null,null,null,0,null,null,null,0,0]
[null,69,null,null,{"$f":"SW!G78","v":0},null,null,null,0,null,null,null,0,0]
[null,70,null,null,{"$f":"SW!G79","v":0},null,null,null,0,null,null,null,0,0]
[null,71,null,null,{"$f":"SW!G80","v":0},null,null,null,0,null,null,null,0,0]
[null,72,null,null,{"$f":"SW!G81","v":0},null,null,null,0,null,null,null,0,0]
[null,73,null,null,{"$f":"SW!G82","v":0},null,null,null,0,null,null,null,0,0]
[null,74,null,null,{"$f":"SW!G83","v":0},null,null,null,0,null,null,null,0,0]
[null,75,null,null,{"$f":"SW!G84","v":0},null,null,null,0,null,null,null,0,0]
[null,76,null,null,{"$f":"SW!G85","v":0},null,null,null,0,null,null,null,0,0]
[null,77,null,null,{"$f":"SW!G86","v":0},null,null,null,0,null,null,null,0,0]
[null,78,null,null,{"$f":"SW!G87","v":0},null,null,null,0,null,null,null,0,0]
[null,79,null,null,{"$f":"SW!G88","v":0},null,null,null,0,null,null,null,0,0]
[null,80,null,null,{"$f":"SW!G89","v":0},null,null,null,0,null,null,null,0,0]
[null,81,null,null,{"$f":"SW!G90","v":0},null,null,null,0,null,null,null,0,0]
[null,82,null,null,{"$f":"SW!G91","v":0},null,null,null,0,null,null,null,0,0]
[null,83,null,null,{"$f":"SW!G92","v":0},null,null,null,0,null,null,null,0,0]
[null,84,null,null,{"$f":"SW!G93","v":0},null,null,null,0,null,null,null,0,0]
[null,85,null,null,{"$f":"SW!G94","v":0},null,null,null,0,null,null,null,0,0]
[null,86,null,null,{"$f":"SW!G95","v":0},null,null,null,0,null,null,null,0,0]
[null,87,null,null,{"$f":"SW!G96","v":0},null,null,null,0,null,null,null,0,0]
[null,88,null,null,{"$f":"SW!G97","v":0},null,null,null,0,null,null,null,0,0]
[null,89,null,null,{"$f":"SW!G98","v":0},null,null,null,0,null,null,null,0,0]

{"sheet":"AH","index":13,"n_rows":99,"n_cols":15,"rows_kept":99,"cut":false,"hidden":false,"merged":[[98,5,98,7],[98,9,98,11],[98,13,98,16],[96,5,96,7],[96,9,96,11],[96,13,96,16],[97,5,97,7],[97,9,97,11],[97,13,97,16],[94,5,94,7],[94,9,94,11],[94,13,94,16],[95,5,95,7],[95,9,95,11],[95,13,95,16],[92,5,92,7],[92,9,92,11],[92,13,92,16],[93,5,93,7],[93,9,93,11],[93,13,93,16],[90,5,90,7],[90,9,90,11],[90,13,90,16],[91,5,91,7],[91,9,91,11],[91,13,91,16],[88,5,88,7],[88,9,88,11],[88,13,88,16],[89,5,89,7],[89,9,89,11],[89,13,89,16],[86,5,86,7],[86,9,86,11],[86,13,86,16],[87,5,87,7],[87,9,87,11],[87,13,87,16],[84,5,84,7],[84,9,84,11],[84,13,84,16],[85,5,85,7],[85,9,85,11],[85,13,85,16],[82,5,82,7],[82,9,82,11],[82,13,82,16],[83,5,83,7],[83,9,83,11],[83,13,83,16],[80,5,80,7],[80,9,80,11],[80,13,80,16],[81,5,81,7],[81,9,81,11],[81,13,81,16],[78,5,78,7],[78,9,78,11],[78,13,78,16],[79,5,79,7],[79,9,79,11],[79,13,79,16],[76,5,76,7],[76,9,76,11],[76,13,76,16],[77,5,77,7],[77,9,77,11],[77,13,77,16],[74,5,74,7],[74,9,74,11],[74,13,74,16],[75,5,75,7],[75,9,75,11],[75,13,75,16],[72,5,72,7],[72,9,72,11],[72,13,72,16],[73,5,73,7],[73,9,73,11],[73,13,73,16],[70,5,70,7],[70,9,70,11],[70,13,70,16],[71,5,71,7],[71,9,71,11],[71,13,71,16],[68,5,68,7],[68,9,68,11],[68,13,68,16],[69,5,69,7],[69,9,69,11],[69,13,69,16],[66,5,66,7],[66,9,66,11],[66,13,66,16],[67,5,67,7],[67,9,67,11],[67,13,67,16],[64,5,64,7],[64,9,64,11],[64,13,64,16],[65,5,65,7],[65,9,65,11],[65,13,65,16],[62,5,62,7],[62,9,62,11],[62,13,62,16],[63,5,63,7],[63,9,63,11],[63,13,63,16],[60,5,60,7],[60,9,60,11],[60,13,60,16],[61,5,61,7],[61,9,61,11],[61,13,61,16],[58,5,58,7],[58,9,58,11],[58,13,58,16],[59,5,59,7],[59,9,59,11],[59,13,59,16],[56,5,56,7],[56,9,56,11],[56,13,56,16],[57,5,57,7],[57,9,57,11],[57,13,57,16],[54,5,54,7],[54,9,54,11],[54,13,54,16],[55,5,55,7],[55,9,55,11],[55,13,55,16],[52,5,52,7],[52,9,52,11],[52,13,52,16],[53,5,53,7],[53,9,53,11],[53,13,53,16],[50,5,50,7],[50,9,50,11],[50,13,50,16],[51,5,51,7],[51,9,51,11],[51,13,51,16],[48,5,48,7],[48,9,48,11],[48,13,48,16],[49,5,49,7],[49,9,49,11],[49,13,49,16],[46,5,46,7],[46,9,46,11],[46,13,46,16],[47,5,47,7],[47,9,47,11],[47,13,47,16],[44,5,44,7],[44,9,44,11],[44,13,44,16],[45,5,45,7],[45,9,45,11],[45,13,45,16],[42,5,42,7],[42,9,42,11],[42,13,42,16],[43,5,43,7],[43,9,43,11],[43,13,43,16],[40,5,40,7],[40,9,40,11],[40,13,40,16],[41,5,41,7],[41,9,41,11],[41,13,41,16],[38,5,38,7],[38,9,38,11],[38,13,38,16],[39,5,39,7],[39,9,39,11],[39,13,39,16],[36,5,36,7],[36,9,36,11],[36,13,36,16],[37,5,37,7],[37,9,37,11],[37,13,37,16],[34,5,34,7],[34,9,34,11],[34,13,34,16],[35,5,35,7],[35,9,35,11],[35,13,35,16],[32,5,32,7],[32,9,32,11],[32,13,32,16],[33,5,33,7],[33,9,33,11],[33,13,33,16],[30,5,30,7],[30,9,30,11],[30,13,30,16],[31,5,31,7],[31,9,31,11],[31,13,31,16],[28,5,28,7],[28,9,28,11],[28,13,28,16],[29,5,29,7],[29,9,29,11],[29,13,29,16],[26,5,26,7],[26,9,26,11],[26,13,26,16],[27,5,27,7],[27,9,27,11],[27,13,27,16],[24,5,24,7],[24,9,24,11],[24,13,24,16],[25,5,25,7],[25,9,25,11],[25,13,25,16],[22,5,22,7],[22,9,22,11],[22,13,22,16],[23,5,23,7],[23,9,23,11],[23,13,23,16],[20,5,20,7],[20,9,20,11],[20,13,20,16],[21,5,21,7],[21,9,21,11],[21,13,21,16],[18,5,18,7],[18,9,18,11],[18,13,18,16],[19,5,19,7],[19,9,19,11],[19,13,19,16],[16,5,16,7],[16,9,16,11],[16,13,16,16],[17,5,17,7],[17,9,17,11],[17,13,17,16],[14,5,14,7],[14,9,14,11],[14,13,14,16],[15,5,15,7],[15,9,15,11],[15,13,15,16],[12,5,12,7],[12,9,12,11],[12,13,12,16],[13,5,13,7],[13,9,13,11],[13,13,13,16],[9,9,9,11],[10,5,10,7],[10,9,10,11],[10,13,10,16],[11,5,11,7],[11,9,11,11],[11,13,11,16],[1,1,1,16],[3,6,3,12],[3,14,5,15],[4,6,4,12],[5,6,5,12],[8,1,9,1],[8,4,9,4],[8,5,8,12],[8,13,9,16],[9,5,9,7]]}
[]
[null,"D A F T A R   N I L A I"]
[]
[null,"MATA PELAJARAN",null,null,null,":","Alqur'an Hadits",null,null,null,null,null,null,null,"↗"]
[null,"KELAS",null,null,null,":",{"$f":"UPPER(MN!D22)","v":"V B"}]
[null,"TAHUN PELAJARAN",null,null,null,":",{"$f":"MN!D18","v":"2019 - 2020"}]
[]
[]
[null,"No","No. Induk","NISN","Nama Siswa","NILAI",null,null,null,null,null,null,null,"JUMLAH"]
[null,null,null,null,null,"PG",null,null,0.5,"ESSAY",null,null,{"$f":"100%-I10","v":0.5}]
[null,1,null,null,{"$f":"SW!G10","v":"ABD. ROCHMAN NAJA FATLAN PRATAMA"},50,50,50,{"$f":"$I$10*F11","v":25},70,null,null,{"$f":"J11*$M$10","v":35},{"$f":"IFERROR(ROUND(AVERAGE(M11+I11),0),\"\")","v":60}]
[null,2,null,null,{"$f":"SW!G11","v":"ABDURRAHMAN FAQIH"},37,37,37,{"$f":"$I$10*F12","v":18.5},55,null,null,{"$f":"J12*$M$10","v":27.5},{"$f":"IFERROR(ROUND(AVERAGE(M12+I12),0),\"\")","v":46}]
[null,3,null,null,{"$f":"SW!G12","v":"ACHMAD FARROIHUN MUSHOBIRONILLAH"},63,63,63,31.5,70,null,null,35,67]
[null,4,null,null,{"$f":"SW!G13","v":"ACHMAD HASBI ASSIDDIQI"},47,47,47,23.5,25,null,null,12.5,36]
[null,5,null,null,{"$f":"SW!G14","v":"ACHMAD REZA AKRAM ALAUDDIN"},87,87,87,43.5,55,null,null,27.5,71]
[null,6,null,null,{"$f":"SW!G15","v":"ACHMAD YANI"},73,73,73,36.5,40,null,null,20,57]
[null,7,null,null,{"$f":"SW!G16","v":"AKHMAD RIDWAN"},50,50,50,25,70,null,null,35,60]
[null,8,null,null,{"$f":"SW!G17","v":"ANDREAN DWI YULIANO"},37,37,37,18.5,55,null,null,27.5,46]
[null,9,null,null,{"$f":"SW!G18","v":"ASFAN FAKHRI BARANI"},63,63,63,31.5,55,null,null,27.5,59]
[null,10,null,null,{"$f":"SW!G19","v":"DEVAN ADITYA SAPUTRA"},60,60,60,30,55,null,null,27.5,58]
[null,11,null,null,{"$f":"SW!G20","v":"FAHRUL AHMAD FAHREZA"},83,83,83,41.5,75,null,null,37.5,79]
[null,12,null,null,{"$f":"SW!G21","v":"FAUZIA AMELIA PUTRI"},73,73,73,36.5,70,null,null,35,72]
[null,13,null,null,{"$f":"SW!G22","v":"FAZA AZIFAH SALSABILA"},63,63,63,31.5,75,null,null,37.5,69]
[null,14,null,null,{"$f":"SW!G23","v":"HABIBIE NURUSSALAM"},70,70,70,35,85,null,null,42.5,78]
[null,15,null,null,{"$f":"SW!G24","v":"HIMATURROSYIDAH"},73,73,73,36.5,70,null,null,35,72]
[null,16,null,null,{"$f":"SW!G25","v":"IFKARINA NAILA SAUQYA"},83,83,83,41.5,85,null,null,42.5,84]
[null,17,null,null,{"$f":"SW!G26","v":"KEISA AYU SASKIYAH"},83,83,83,41.5,55,null,null,27.5,69]
[null,18,null,null,{"$f":"SW!G27","v":"MOCHAMMAD RENO FIRMANSYAH"},23,23,23,11.5,40,null,null,20,32]
[null,19,null,null,{"$f":"SW!G28","v":"MOHAMAD NUR KHAFID KHABIBULLOH"},83,83,83,41.5,55,null,null,27.5,69]
[null,20,null,null,{"$f":"SW!G29","v":"MOHAMMAD NAUFAL NAWWARUDDIN"},37,37,37,18.5,40,null,null,20,39]
[null,21,null,null,{"$f":"SW!G30","v":"MUCHAMAD PRIMA PAMBUDI"},67,67,67,33.5,85,null,null,42.5,76]
[null,22,null,null,{"$f":"SW!G31","v":"MUHAMMAD ALFAN FATHONI"},60,60,60,30,55,null,null,27.5,58]
[null,23,null,null,{"$f":"SW!G32","v":"MUHAMMAD AMINULLAH MAULUDANI"},30,30,30,15,40,null,null,20,35]
[null,24,null,null,{"$f":"SW!G33","v":"MUHAMMAD DAVIN  LEVANTINO"},80,80,80,40,55,null,null,27.5,68]
[null,25,null,null,{"$f":"SW!G34","v":"MUHAMMAD MAULANA PAHLEVY"},73,73,73,36.5,55,null,null,27.5,64]
[null,26,null,null,{"$f":"SW!G35","v":"RADITYA NIRWANSYAH"},43,43,43,21.5,70,null,null,35,57]
[null,27,null,null,{"$f":"SW!G36","v":"REVINA SRI UTARI"},70,70,70,35,55,null,null,27.5,63]
[null,28,null,null,{"$f":"SW!G37","v":"REYHAN DWI ANDIKA"},63,63,63,31.5,55,null,null,27.5,59]
[null,29,null,null,{"$f":"SW!G38","v":"RISKA LAURA TRIA OCTAVIA"},80,80,80,40,70,null,null,35,75]
[null,30,null,null,{"$f":"SW!G39","v":"ROHMADONA DWI SAFITRI"},93,93,93,46.5,70,null,null,35,82]
[null,31,null,null,{"$f":"SW!G40","v":"SALMAN ALFARIZI"},30,30,30,15,55,null,null,27.5,43]
[null,32,null,null,{"$f":"SW!G41","v":"TAUFIQ KURROHMAN"},23,23,23,11.5,70,null,null,35,47]
[null,33,null,null,{"$f":"SW!G42","v":0},null,null,null,0,null,null,null,0,0]
[null,34,null,null,{"$f":"SW!G43","v":0},null,null,null,0,null,null,null,0,0]
[null,35,null,null,{"$f":"SW!G44","v":0},null,null,null,0,null,null,null,0,0]
[null,36,null,null,{"$f":"SW!G45","v":0},null,null,null,0,null,null,null,0,0]
[null,37,null,null,{"$f":"SW!G46","v":0},null,null,null,0,null,null,null,0,0]
[null,38,null,null,{"$f":"SW!G47","v":0},null,null,null,0,null,null,null,0,0]
[null,39,null,null,{"$f":"SW!G48","v":0},null,null,null,0,null,null,null,0,0]
[null,40,null,null,{"$f":"SW!G49","v":0},null,null,null,0,null,null,null,0,0]
[null,41,null,null,{"$f":"SW!G50","v":0},null,null,null,0,null,null,null,0,0]
[null,42,null,null,{"$f":"SW!G51","v":0},null,null,null,0,null,null,null,0,0]
[null,43,null,null,{"$f":"SW!G52","v":0},null,null,null,0,null,null,null,0,0]
[null,44,null,null,{"$f":"SW!G53","v":0},null,null,null,0,null,null,null,0,0]
[null,45,null,null,{"$f":"SW!G54","v":0},null,null,null,0,null,null,null,0,0]
[null,46,null,null,{"$f":"SW!G55","v":0},null,null,null,0,null,null,null,0,0]
[null,47,null,null,{"$f":"SW!G56","v":0},null,null,null,0,null,null,null,0,0]
[null,48,null,null,{"$f":"SW!G57","v":0},null,null,null,0,null,null,null,0,0]
[null,49,null,null,{"$f":"SW!G58","v":0},null,null,null,0,null,null,null,0,0]
[null,50,null,null,{"$f":"SW!G59","v":0},null,null,null,0,null,null,null,0,0]
[null,51,null,null,{"$f":"SW!G60","v":0},null,null,null,0,null,null,null,0,0]
[null,52,null,null,{"$f":"SW!G61","v":0},null,null,null,0,null,null,null,0,0]
[null,53,null,null,{"$f":"SW!G62","v":0},null,null,null,0,null,null,null,0,0]
[null,54,null,null,{"$f":"SW!G63","v":0},null,null,null,0,null,null,null,0,0]
[null,55,null,null,{"$f":"SW!G64","v":0},null,null,null,0,null,null,null,0,0]
[null,56,null,null,{"$f":"SW!G65","v":0},null,null,null,0,null,null,null,0,0]
[null,57,null,null,{"$f":"SW!G66","v":0},null,null,null,0,null,null,null,0,0]
[null,58,null,null,{"$f":"SW!G67","v":0},null,null,null,0,null,null,null,0,0]
[null,59,null,null,{"$f":"SW!G68","v":0},null,null,null,0,null,null,null,0,0]
[null,60,null,null,{"$f":"SW!G69","v":0},null,null,null,0,null,null,null,0,0]
[null,61,null,null,{"$f":"SW!G70","v":0},null,null,null,0,null,null,null,0,0]
[null,62,null,null,{"$f":"SW!G71","v":0},null,null,null,0,null,null,null,0,0]
[null,63,null,null,{"$f":"SW!G72","v":0},null,null,null,0,null,null,null,0,0]
[null,64,null,null,{"$f":"SW!G73","v":0},null,null,null,0,null,null,null,0,0]
[null,65,null,null,{"$f":"SW!G74","v":0},null,null,null,0,null,null,null,0,0]
[null,66,null,null,{"$f":"SW!G75","v":0},null,null,null,{"$f":"$I$10*F76","v":0},null,null,null,{"$f":"J76*$M$10","v":0},{"$f":"IFERROR(ROUND(AVERAGE(M76+I76),0),\"\")","v":0}]
[null,67,null,null,{"$f":"SW!G76","v":0},null,null,null,0,null,null,null,0,0]
[null,68,null,null,{"$f":"SW!G77","v":0},null,null,null,0,null,null,null,0,0]
[null,69,null,null,{"$f":"SW!G78","v":0},null,null,null,0,null,null,null,0,0]
[null,70,null,null,{"$f":"SW!G79","v":0},null,null,null,0,null,null,null,0,0]
[null,71,null,null,{"$f":"SW!G80","v":0},null,null,null,0,null,null,null,0,0]
[null,72,null,null,{"$f":"SW!G81","v":0},null,null,null,0,null,null,null,0,0]
[null,73,null,null,{"$f":"SW!G82","v":0},null,null,null,0,null,null,null,0,0]
[null,74,null,null,{"$f":"SW!G83","v":0},null,null,null,0,null,null,null,0,0]
[null,75,null,null,{"$f":"SW!G84","v":0},null,null,null,0,null,null,null,0,0]
[null,76,null,null,{"$f":"SW!G85","v":0},null,null,null,0,null,null,null,0,0]
[null,77,null,null,{"$f":"SW!G86","v":0},null,null,null,0,null,null,null,0,0]
[null,78,null,null,{"$f":"SW!G87","v":0},null,null,null,0,null,null,null,0,0]
[null,79,null,null,{"$f":"SW!G88","v":0},null,null,null,0,null,null,null,0,0]
[null,80,null,null,{"$f":"SW!G89","v":0},null,null,null,0,null,null,null,0,0]
[null,81,null,null,{"$f":"SW!G90","v":0},null,null,null,0,null,null,null,0,0]
[null,82,null,null,{"$f":"SW!G91","v":0},null,null,null,0,null,null,null,0,0]
[null,83,null,null,{"$f":"SW!G92","v":0},null,null,null,0,null,null,null,0,0]
[null,84,null,null,{"$f":"SW!G93","v":0},null,null,null,0,null,null,null,0,0]
[null,85,null,null,{"$f":"SW!G94","v":0},null,null,null,0,null,null,null,0,0]
[null,86,null,null,{"$f":"SW!G95","v":0},null,null,null,0,null,null,null,0,0]
[null,87,null,null,{"$f":"SW!G96","v":0},null,null,null,0,null,null,null,0,0]
[null,88,null,null,{"$f":"SW!G97","v":0},null,null,null,0,null,null,null,0,0]
[null,89,null,null,{"$f":"SW!G98","v":0},null,null,null,0,null,null,null,0,0]

{"sheet":"FQ","index":14,"n_rows":99,"n_cols":15,"rows_kept":99,"cut":false,"hidden":false,"merged":[[98,5,98,7],[98,9,98,11],[98,13,98,16],[96,5,96,7],[96,9,96,11],[96,13,96,16],[97,5,97,7],[97,9,97,11],[97,13,97,16],[94,5,94,7],[94,9,94,11],[94,13,94,16],[95,5,95,7],[95,9,95,11],[95,13,95,16],[92,5,92,7],[92,9,92,11],[92,13,92,16],[93,5,93,7],[93,9,93,11],[93,13,93,16],[90,5,90,7],[90,9,90,11],[90,13,90,16],[91,5,91,7],[91,9,91,11],[91,13,91,16],[88,5,88,7],[88,9,88,11],[88,13,88,16],[89,5,89,7],[89,9,89,11],[89,13,89,16],[86,5,86,7],[86,9,86,11],[86,13,86,16],[87,5,87,7],[87,9,87,11],[87,13,87,16],[84,5,84,7],[84,9,84,11],[84,13,84,16],[85,5,85,7],[85,9,85,11],[85,13,85,16],[82,5,82,7],[82,9,82,11],[82,13,82,16],[83,5,83,7],[83,9,83,11],[83,13,83,16],[80,5,80,7],[80,9,80,11],[80,13,80,16],[81,5,81,7],[81,9,81,11],[81,13,81,16],[78,5,78,7],[78,9,78,11],[78,13,78,16],[79,5,79,7],[79,9,79,11],[79,13,79,16],[76,5,76,7],[76,9,76,11],[76,13,76,16],[77,5,77,7],[77,9,77,11],[77,13,77,16],[74,5,74,7],[74,9,74,11],[74,13,74,16],[75,5,75,7],[75,9,75,11],[75,13,75,16],[72,5,72,7],[72,9,72,11],[72,13,72,16],[73,5,73,7],[73,9,73,11],[73,13,73,16],[70,5,70,7],[70,9,70,11],[70,13,70,16],[71,5,71,7],[71,9,71,11],[71,13,71,16],[68,5,68,7],[68,9,68,11],[68,13,68,16],[69,5,69,7],[69,9,69,11],[69,13,69,16],[66,5,66,7],[66,9,66,11],[66,13,66,16],[67,5,67,7],[67,9,67,11],[67,13,67,16],[64,5,64,7],[64,9,64,11],[64,13,64,16],[65,5,65,7],[65,9,65,11],[65,13,65,16],[62,5,62,7],[62,9,62,11],[62,13,62,16],[63,5,63,7],[63,9,63,11],[63,13,63,16],[60,5,60,7],[60,9,60,11],[60,13,60,16],[61,5,61,7],[61,9,61,11],[61,13,61,16],[58,5,58,7],[58,9,58,11],[58,13,58,16],[59,5,59,7],[59,9,59,11],[59,13,59,16],[56,5,56,7],[56,9,56,11],[56,13,56,16],[57,5,57,7],[57,9,57,11],[57,13,57,16],[54,5,54,7],[54,9,54,11],[54,13,54,16],[55,5,55,7],[55,9,55,11],[55,13,55,16],[52,5,52,7],[52,9,52,11],[52,13,52,16],[53,5,53,7],[53,9,53,11],[53,13,53,16],[50,5,50,7],[50,9,50,11],[50,13,50,16],[51,5,51,7],[51,9,51,11],[51,13,51,16],[48,5,48,7],[48,9,48,11],[48,13,48,16],[49,5,49,7],[49,9,49,11],[49,13,49,16],[46,5,46,7],[46,9,46,11],[46,13,46,16],[47,5,47,7],[47,9,47,11],[47,13,47,16],[44,5,44,7],[44,9,44,11],[44,13,44,16],[45,5,45,7],[45,9,45,11],[45,13,45,16],[42,5,42,7],[42,9,42,11],[42,13,42,16],[43,5,43,7],[43,9,43,11],[43,13,43,16],[40,5,40,7],[40,9,40,11],[40,13,40,16],[41,5,41,7],[41,9,41,11],[41,13,41,16],[38,5,38,7],[38,9,38,11],[38,13,38,16],[39,5,39,7],[39,9,39,11],[39,13,39,16],[36,5,36,7],[36,9,36,11],[36,13,36,16],[37,5,37,7],[37,9,37,11],[37,13,37,16],[34,5,34,7],[34,9,34,11],[34,13,34,16],[35,5,35,7],[35,9,35,11],[35,13,35,16],[32,5,32,7],[32,9,32,11],[32,13,32,16],[33,5,33,7],[33,9,33,11],[33,13,33,16],[30,5,30,7],[30,9,30,11],[30,13,30,16],[31,5,31,7],[31,9,31,11],[31,13,31,16],[28,5,28,7],[28,9,28,11],[28,13,28,16],[29,5,29,7],[29,9,29,11],[29,13,29,16],[26,5,26,7],[26,9,26,11],[26,13,26,16],[27,5,27,7],[27,9,27,11],[27,13,27,16],[24,5,24,7],[24,9,24,11],[24,13,24,16],[25,5,25,7],[25,9,25,11],[25,13,25,16],[22,5,22,7],[22,9,22,11],[22,13,22,16],[23,5,23,7],[23,9,23,11],[23,13,23,16],[20,5,20,7],[20,9,20,11],[20,13,20,16],[21,5,21,7],[21,9,21,11],[21,13,21,16],[18,5,18,7],[18,9,18,11],[18,13,18,16],[19,5,19,7],[19,9,19,11],[19,13,19,16],[16,5,16,7],[16,9,16,11],[16,13,16,16],[17,5,17,7],[17,9,17,11],[17,13,17,16],[14,5,14,7],[14,9,14,11],[14,13,14,16],[15,5,15,7],[15,9,15,11],[15,13,15,16],[12,5,12,7],[12,9,12,11],[12,13,12,16],[13,5,13,7],[13,9,13,11],[13,13,13,16],[9,9,9,11],[10,5,10,7],[10,9,10,11],[10,13,10,16],[11,5,11,7],[11,9,11,11],[11,13,11,16],[1,1,1,16],[3,6,3,12],[3,14,5,15],[4,6,4,12],[5,6,5,12],[8,1,9,1],[8,4,9,4],[8,5,8,12],[8,13,9,16],[9,5,9,7]]}
[]
[null,"D A F T A R   N I L A I"]
[]
[null,"MATA PELAJARAN",null,null,null,":","Fiqih",null,null,null,null,null,null,null,"↗"]
[null,"KELAS",null,null,null,":",{"$f":"UPPER(MN!D22)","v":"V B"}]
[null,"TAHUN PELAJARAN",null,null,null,":",{"$f":"MN!D18","v":"2019 - 2020"}]
[]
[]
[null,"No","No. Induk","NISN","Nama Siswa","NILAI",null,null,null,null,null,null,null,"JUMLAH"]
[null,null,null,null,null,"PG",null,null,0.5,"ESSAY",null,null,{"$f":"100%-I10","v":0.5}]
[null,1,null,null,{"$f":"SW!G10","v":"ABD. ROCHMAN NAJA FATLAN PRATAMA"},77,77,77,{"$f":"$I$10*F11","v":38.5},85,null,null,{"$f":"J11*$M$10","v":42.5},{"$f":"IFERROR(ROUND(AVERAGE(M11+I11),0),\"\")","v":81}]
[null,2,null,null,{"$f":"SW!G11","v":"ABDURRAHMAN FAQIH"},37,37,37,{"$f":"$I$10*F12","v":18.5},40,null,null,{"$f":"J12*$M$10","v":20},{"$f":"IFERROR(ROUND(AVERAGE(M12+I12),0),\"\")","v":39}]
[null,3,null,null,{"$f":"SW!G12","v":"ACHMAD FARROIHUN MUSHOBIRONILLAH"},70,70,70,35,85,null,null,42.5,78]
[null,4,null,null,{"$f":"SW!G13","v":"ACHMAD HASBI ASSIDDIQI"},43,43,43,21.5,40,null,null,20,42]
[null,5,null,null,{"$f":"SW!G14","v":"ACHMAD REZA AKRAM ALAUDDIN"},73,73,73,36.5,75,null,null,37.5,74]
[null,6,null,null,{"$f":"SW!G15","v":"ACHMAD YANI"},63,63,63,31.5,70,null,null,35,67]
[null,7,null,null,{"$f":"SW!G16","v":"AKHMAD RIDWAN"},63,63,63,31.5,85,null,null,42.5,74]
[null,8,null,null,{"$f":"SW!G17","v":"ANDREAN DWI YULIANO"},43,43,43,21.5,85,null,null,42.5,64]
[null,9,null,null,{"$f":"SW!G18","v":"ASFAN FAKHRI BARANI"},87,87,87,43.5,70,null,null,35,79]
[null,10,null,null,{"$f":"SW!G19","v":"DEVAN ADITYA SAPUTRA"},53,53,53,26.5,85,null,null,42.5,69]
[null,11,null,null,{"$f":"SW!G20","v":"FAHRUL AHMAD FAHREZA"},63,63,63,31.5,70,null,null,35,67]
[null,12,null,null,{"$f":"SW!G21","v":"FAUZIA AMELIA PUTRI"},67,67,67,33.5,100,null,null,50,84]
[null,13,null,null,{"$f":"SW!G22","v":"FAZA AZIFAH SALSABILA"},60,60,60,30,70,null,null,35,65]
[null,14,null,null,{"$f":"SW!G23","v":"HABIBIE NURUSSALAM"},63,63,63,31.5,70,null,null,35,67]
[null,15,null,null,{"$f":"SW!G24","v":"HIMATURROSYIDAH"},73,73,73,36.5,75,null,null,37.5,74]
[null,16,null,null,{"$f":"SW!G25","v":"IFKARINA NAILA SAUQYA"},67,67,67,33.5,85,null,null,42.5,76]
[null,17,null,null,{"$f":"SW!G26","v":"KEISA AYU SASKIYAH"},67,67,67,33.5,70,null,null,35,69]
[null,18,null,null,{"$f":"SW!G27","v":"MOCHAMMAD RENO FIRMANSYAH"},33,33,33,16.5,25,null,null,12.5,29]
[null,19,null,null,{"$f":"SW!G28","v":"MOHAMAD NUR KHAFID KHABIBULLOH"},60,60,60,30,70,null,null,35,65]
[null,20,null,null,{"$f":"SW!G29","v":"MOHAMMAD NAUFAL NAWWARUDDIN"},37,37,37,18.5,40,null,null,20,39]
[null,21,null,null,{"$f":"SW!G30","v":"MUCHAMAD PRIMA PAMBUDI"},60,60,60,30,60,null,null,30,60]
[null,22,null,null,{"$f":"SW!G31","v":"MUHAMMAD ALFAN FATHONI"},37,37,37,18.5,55,null,null,27.5,46]
[null,23,null,null,{"$f":"SW!G32","v":"MUHAMMAD AMINULLAH MAULUDANI"},63,63,63,31.5,50,null,null,25,57]
[null,24,null,null,{"$f":"SW!G33","v":"MUHAMMAD DAVIN  LEVANTINO"},70,70,70,35,85,null,null,42.5,78]
[null,25,null,null,{"$f":"SW!G34","v":"MUHAMMAD MAULANA PAHLEVY"},43,43,43,21.5,85,null,null,42.5,64]
[null,26,null,null,{"$f":"SW!G35","v":"RADITYA NIRWANSYAH"},37,37,37,18.5,40,null,null,20,39]
[null,27,null,null,{"$f":"SW!G36","v":"REVINA SRI UTARI"},47,47,47,23.5,55,null,null,27.5,51]
[null,28,null,null,{"$f":"SW!G37","v":"REYHAN DWI ANDIKA"},43,43,43,21.5,55,null,null,27.5,49]
[null,29,null,null,{"$f":"SW!G38","v":"RISKA LAURA TRIA OCTAVIA"},77,77,77,38.5,60,null,null,30,69]
[null,30,null,null,{"$f":"SW!G39","v":"ROHMADONA DWI SAFITRI"},80,80,80,40,75,null,null,37.5,78]
[null,31,null,null,{"$f":"SW!G40","v":"SALMAN ALFARIZI"},60,60,60,30,55,null,null,27.5,58]
[null,32,null,null,{"$f":"SW!G41","v":"TAUFIQ KURROHMAN"},57,57,57,28.5,70,null,null,35,64]
[null,33,null,null,{"$f":"SW!G42","v":0},null,null,null,0,null,null,null,0,0]
[null,34,null,null,{"$f":"SW!G43","v":0},null,null,null,0,null,null,null,0,0]
[null,35,null,null,{"$f":"SW!G44","v":0},null,null,null,0,null,null,null,0,0]
[null,36,null,null,{"$f":"SW!G45","v":0},null,null,null,0,null,null,null,0,0]
[null,37,null,null,{"$f":"SW!G46","v":0},null,null,null,0,null,null,null,0,0]
[null,38,null,null,{"$f":"SW!G47","v":0},null,null,null,0,null,null,null,0,0]
[null,39,null,null,{"$f":"SW!G48","v":0},null,null,null,0,null,null,null,0,0]
[null,40,null,null,{"$f":"SW!G49","v":0},null,null,null,0,null,null,null,0,0]
[null,41,null,null,{"$f":"SW!G50","v":0},null,null,null,0,null,null,null,0,0]
[null,42,null,null,{"$f":"SW!G51","v":0},null,null,null,0,null,null,null,0,0]
[null,43,null,null,{"$f":"SW!G52","v":0},null,null,null,0,null,null,null,0,0]
[null,44,null,null,{"$f":"SW!G53","v":0},null,null,null,0,null,null,null,0,0]
[null,45,null,null,{"$f":"SW!G54","v":0},null,null,null,0,null,null,null,0,0]
[null,46,null,null,{"$f":"SW!G55","v":0},null,null,null,0,null,null,null,0,0]
[null,47,null,null,{"$f":"SW!G56","v":0},null,null,null,0,null,null,null,0,0]
[null,48,null,null,{"$f":"SW!G57","v":0},null,null,null,0,null,null,null,0,0]
[null,49,null,null,{"$f":"SW!G58","v":0},null,null,null,0,null,null,null,0,0]
[null,50,null,null,{"$f":"SW!G59","v":0},null,null,null,0,null,null,null,0,0]
[null,51,null,null,{"$f":"SW!G60","v":0},null,null,null,0,null,null,null,0,0]
[null,52,null,null,{"$f":"SW!G61","v":0},null,null,null,0,null,null,null,0,0]
[null,53,null,null,{"$f":"SW!G62","v":0},null,null,null,0,null,null,null,0,0]
[null,54,null,null,{"$f":"SW!G63","v":0},null,null,null,0,null,null,null,0,0]
[null,55,null,null,{"$f":"SW!G64","v":0},null,null,null,0,null,null,null,0,0]
[null,56,null,null,{"$f":"SW!G65","v":0},null,null,null,0,null,null,null,0,0]
[null,57,null,null,{"$f":"SW!G66","v":0},null,null,null,0,null,null,null,0,0]
[null,58,null,null,{"$f":"SW!G67","v":0},null,null,null,0,null,null,null,0,0]
[null,59,null,null,{"$f":"SW!G68","v":0},null,null,null,0,null,null,null,0,0]
[null,60,null,null,{"$f":"SW!G69","v":0},null,null,null,0,null,null,null,0,0]
[null,61,null,null,{"$f":"SW!G70","v":0},null,null,null,0,null,null,null,0,0]
[null,62,null,null,{"$f":"SW!G71","v":0},null,null,null,0,null,null,null,0,0]
[null,63,null,null,{"$f":"SW!G72","v":0},null,null,null,0,null,null,null,0,0]
[null,64,null,null,{"$f":"SW!G73","v":0},null,null,null,0,null,null,null,0,0]
[null,65,null,null,{"$f":"SW!G74","v":0},null,null,null,0,null,null,null,0,0]
[null,66,null,null,{"$f":"SW!G75","v":0},null,null,null,{"$f":"$I$10*F76","v":0},null,null,null,{"$f":"J76*$M$10","v":0},{"$f":"IFERROR(ROUND(AVERAGE(M76+I76),0),\"\")","v":0}]
[null,67,null,null,{"$f":"SW!G76","v":0},null,null,null,0,null,null,null,0,0]
[null,68,null,null,{"$f":"SW!G77","v":0},null,null,null,0,null,null,null,0,0]
[null,69,null,null,{"$f":"SW!G78","v":0},null,null,null,0,null,null,null,0,0]
[null,70,null,null,{"$f":"SW!G79","v":0},null,null,null,0,null,null,null,0,0]
[null,71,null,null,{"$f":"SW!G80","v":0},null,null,null,0,null,null,null,0,0]
[null,72,null,null,{"$f":"SW!G81","v":0},null,null,null,0,null,null,null,0,0]
[null,73,null,null,{"$f":"SW!G82","v":0},null,null,null,0,null,null,null,0,0]
[null,74,null,null,{"$f":"SW!G83","v":0},null,null,null,0,null,null,null,0,0]
[null,75,null,null,{"$f":"SW!G84","v":0},null,null,null,0,null,null,null,0,0]
[null,76,null,null,{"$f":"SW!G85","v":0},null,null,null,0,null,null,null,0,0]
[null,77,null,null,{"$f":"SW!G86","v":0},null,null,null,0,null,null,null,0,0]
[null,78,null,null,{"$f":"SW!G87","v":0},null,null,null,0,null,null,null,0,0]
[null,79,null,null,{"$f":"SW!G88","v":0},null,null,null,0,null,null,null,0,0]
[null,80,null,null,{"$f":"SW!G89","v":0},null,null,null,0,null,null,null,0,0]
[null,81,null,null,{"$f":"SW!G90","v":0},null,null,null,0,null,null,null,0,0]
[null,82,null,null,{"$f":"SW!G91","v":0},null,null,null,0,null,null,null,0,0]
[null,83,null,null,{"$f":"SW!G92","v":0},null,null,null,0,null,null,null,0,0]
[null,84,null,null,{"$f":"SW!G93","v":0},null,null,null,0,null,null,null,0,0]
[null,85,null,null,{"$f":"SW!G94","v":0},null,null,null,0,null,null,null,0,0]
[null,86,null,null,{"$f":"SW!G95","v":0},null,null,null,0,null,null,null,0,0]
[null,87,null,null,{"$f":"SW!G96","v":0},null,null,null,0,null,null,null,0,0]
[null,88,null,null,{"$f":"SW!G97","v":0},null,null,null,0,null,null,null,0,0]
[null,89,null,null,{"$f":"SW!G98","v":0},null,null,null,0,null,null,null,0,0]

{"sheet":"SKI","index":15,"n_rows":99,"n_cols":15,"rows_kept":99,"cut":false,"hidden":false,"merged":[[98,5,98,7],[98,9,98,11],[98,13,98,16],[96,5,96,7],[96,9,96,11],[96,13,96,16],[97,5,97,7],[97,9,97,11],[97,13,97,16],[94,5,94,7],[94,9,94,11],[94,13,94,16],[95,5,95,7],[95,9,95,11],[95,13,95,16],[92,5,92,7],[92,9,92,11],[92,13,92,16],[93,5,93,7],[93,9,93,11],[93,13,93,16],[90,5,90,7],[90,9,90,11],[90,13,90,16],[91,5,91,7],[91,9,91,11],[91,13,91,16],[88,5,88,7],[88,9,88,11],[88,13,88,16],[89,5,89,7],[89,9,89,11],[89,13,89,16],[86,5,86,7],[86,9,86,11],[86,13,86,16],[87,5,87,7],[87,9,87,11],[87,13,87,16],[84,5,84,7],[84,9,84,11],[84,13,84,16],[85,5,85,7],[85,9,85,11],[85,13,85,16],[82,5,82,7],[82,9,82,11],[82,13,82,16],[83,5,83,7],[83,9,83,11],[83,13,83,16],[80,5,80,7],[80,9,80,11],[80,13,80,16],[81,5,81,7],[81,9,81,11],[81,13,81,16],[78,5,78,7],[78,9,78,11],[78,13,78,16],[79,5,79,7],[79,9,79,11],[79,13,79,16],[76,5,76,7],[76,9,76,11],[76,13,76,16],[77,5,77,7],[77,9,77,11],[77,13,77,16],[74,5,74,7],[74,9,74,11],[74,13,74,16],[75,5,75,7],[75,9,75,11],[75,13,75,16],[72,5,72,7],[72,9,72,11],[72,13,72,16],[73,5,73,7],[73,9,73,11],[73,13,73,16],[70,5,70,7],[70,9,70,11],[70,13,70,16],[71,5,71,7],[71,9,71,11],[71,13,71,16],[68,5,68,7],[68,9,68,11],[68,13,68,16],[69,5,69,7],[69,9,69,11],[69,13,69,16],[66,5,66,7],[66,9,66,11],[66,13,66,16],[67,5,67,7],[67,9,67,11],[67,13,67,16],[64,5,64,7],[64,9,64,11],[64,13,64,16],[65,5,65,7],[65,9,65,11],[65,13,65,16],[62,5,62,7],[62,9,62,11],[62,13,62,16],[63,5,63,7],[63,9,63,11],[63,13,63,16],[60,5,60,7],[60,9,60,11],[60,13,60,16],[61,5,61,7],[61,9,61,11],[61,13,61,16],[58,5,58,7],[58,9,58,11],[58,13,58,16],[59,5,59,7],[59,9,59,11],[59,13,59,16],[56,5,56,7],[56,9,56,11],[56,13,56,16],[57,5,57,7],[57,9,57,11],[57,13,57,16],[54,5,54,7],[54,9,54,11],[54,13,54,16],[55,5,55,7],[55,9,55,11],[55,13,55,16],[52,5,52,7],[52,9,52,11],[52,13,52,16],[53,5,53,7],[53,9,53,11],[53,13,53,16],[50,5,50,7],[50,9,50,11],[50,13,50,16],[51,5,51,7],[51,9,51,11],[51,13,51,16],[48,5,48,7],[48,9,48,11],[48,13,48,16],[49,5,49,7],[49,9,49,11],[49,13,49,16],[46,5,46,7],[46,9,46,11],[46,13,46,16],[47,5,47,7],[47,9,47,11],[47,13,47,16],[44,5,44,7],[44,9,44,11],[44,13,44,16],[45,5,45,7],[45,9,45,11],[45,13,45,16],[42,5,42,7],[42,9,42,11],[42,13,42,16],[43,5,43,7],[43,9,43,11],[43,13,43,16],[40,5,40,7],[40,9,40,11],[40,13,40,16],[41,5,41,7],[41,9,41,11],[41,13,41,16],[38,5,38,7],[38,9,38,11],[38,13,38,16],[39,5,39,7],[39,9,39,11],[39,13,39,16],[36,5,36,7],[36,9,36,11],[36,13,36,16],[37,5,37,7],[37,9,37,11],[37,13,37,16],[34,5,34,7],[34,9,34,11],[34,13,34,16],[35,5,35,7],[35,9,35,11],[35,13,35,16],[32,5,32,7],[32,9,32,11],[32,13,32,16],[33,5,33,7],[33,9,33,11],[33,13,33,16],[30,5,30,7],[30,9,30,11],[30,13,30,16],[31,5,31,7],[31,9,31,11],[31,13,31,16],[28,5,28,7],[28,9,28,11],[28,13,28,16],[29,5,29,7],[29,9,29,11],[29,13,29,16],[26,5,26,7],[26,9,26,11],[26,13,26,16],[27,5,27,7],[27,9,27,11],[27,13,27,16],[24,5,24,7],[24,9,24,11],[24,13,24,16],[25,5,25,7],[25,9,25,11],[25,13,25,16],[22,5,22,7],[22,9,22,11],[22,13,22,16],[23,5,23,7],[23,9,23,11],[23,13,23,16],[20,5,20,7],[20,9,20,11],[20,13,20,16],[21,5,21,7],[21,9,21,11],[21,13,21,16],[18,5,18,7],[18,9,18,11],[18,13,18,16],[19,5,19,7],[19,9,19,11],[19,13,19,16],[16,5,16,7],[16,9,16,11],[16,13,16,16],[17,5,17,7],[17,9,17,11],[17,13,17,16],[14,5,14,7],[14,9,14,11],[14,13,14,16],[15,5,15,7],[15,9,15,11],[15,13,15,16],[12,5,12,7],[12,9,12,11],[12,13,12,16],[13,5,13,7],[13,9,13,11],[13,13,13,16],[9,9,9,11],[10,5,10,7],[10,9,10,11],[10,13,10,16],[11,5,11,7],[11,9,11,11],[11,13,11,16],[1,1,1,16],[3,6,3,12],[3,14,5,15],[4,6,4,12],[5,6,5,12],[8,1,9,1],[8,4,9,4],[8,5,8,12],[8,13,9,16],[9,5,9,7]]}
[]
[null,"D A F T A R   N I L A I"]
[]
[null,"MATA PELAJARAN",null,null,null,":","Sejarah Kebudayaan Islam",null,null,null,null,null,null,null,"↗"]
[null,"KELAS",null,null,null,":",{"$f":"UPPER(MN!D22)","v":"V B"}]
[null,"TAHUN PELAJARAN",null,null,null,":",{"$f":"MN!D18","v":"2019 - 2020"}]
[]
[]
[null,"No","No. Induk","NISN","Nama Siswa","NILAI",null,null,null,null,null,null,null,"JUMLAH"]
[null,null,null,null,null,"PG",null,null,0.5,"ESSAY",null,null,{"$f":"100%-I10","v":0.5}]
[null,1,null,null,{"$f":"SW!G10","v":"ABD. ROCHMAN NAJA FATLAN PRATAMA"},30,30,30,{"$f":"$I$10*F11","v":15},60,null,null,{"$f":"J11*$M$10","v":30},{"$f":"IFERROR(ROUND(AVERAGE(M11+I11),0),\"\")","v":45}]
[null,2,null,null,{"$f":"SW!G11","v":"ABDURRAHMAN FAQIH"},23,23,23,{"$f":"$I$10*F12","v":11.5},60,null,null,{"$f":"J12*$M$10","v":30},{"$f":"IFERROR(ROUND(AVERAGE(M12+I12),0),\"\")","v":42}]
[null,3,null,null,{"$f":"SW!G12","v":"ACHMAD FARROIHUN MUSHOBIRONILLAH"},37,37,37,18.5,70,null,null,35,54]
[null,4,null,null,{"$f":"SW!G13","v":"ACHMAD HASBI ASSIDDIQI"},30,30,30,15,60,null,null,30,45]
[null,5,null,null,{"$f":"SW!G14","v":"ACHMAD REZA AKRAM ALAUDDIN"},50,50,50,25,60,null,null,30,55]
[null,6,null,null,{"$f":"SW!G15","v":"ACHMAD YANI"},37,37,37,18.5,70,null,null,35,54]
[null,7,null,null,{"$f":"SW!G16","v":"AKHMAD RIDWAN"},37,37,37,18.5,60,null,null,30,49]
[null,8,null,null,{"$f":"SW!G17","v":"ANDREAN DWI YULIANO"},27,27,27,13.5,60,null,null,30,44]
[null,9,null,null,{"$f":"SW!G18","v":"ASFAN FAKHRI BARANI"},43,43,43,21.5,70,null,null,35,57]
[null,10,null,null,{"$f":"SW!G19","v":"DEVAN ADITYA SAPUTRA"},20,20,20,10,70,null,null,35,45]
[null,11,null,null,{"$f":"SW!G20","v":"FAHRUL AHMAD FAHREZA"},43,43,43,21.5,60,null,null,30,52]
[null,12,null,null,{"$f":"SW!G21","v":"FAUZIA AMELIA PUTRI"},47,47,47,23.5,80,null,null,40,64]
[null,13,null,null,{"$f":"SW!G22","v":"FAZA AZIFAH SALSABILA"},30,30,30,15,70,null,null,35,50]
[null,14,null,null,{"$f":"SW!G23","v":"HABIBIE NURUSSALAM"},40,40,40,20,70,null,null,35,55]
[null,15,null,null,{"$f":"SW!G24","v":"HIMATURROSYIDAH"},50,50,50,25,80,null,null,40,65]
[null,16,null,null,{"$f":"SW!G25","v":"IFKARINA NAILA SAUQYA"},50,50,50,25,80,null,null,40,65]
[null,17,null,null,{"$f":"SW!G26","v":"KEISA AYU SASKIYAH"},47,47,47,23.5,80,null,null,40,64]
[null,18,null,null,{"$f":"SW!G27","v":"MOCHAMMAD RENO FIRMANSYAH"},30,30,30,15,50,null,null,25,40]
[null,19,null,null,{"$f":"SW!G28","v":"MOHAMAD NUR KHAFID KHABIBULLOH"},53,53,53,26.5,60,null,null,30,57]
[null,20,null,null,{"$f":"SW!G29","v":"MOHAMMAD NAUFAL NAWWARUDDIN"},33,33,33,16.5,50,null,null,25,42]
[null,21,null,null,{"$f":"SW!G30","v":"MUCHAMAD PRIMA PAMBUDI"},43,43,43,21.5,60,null,null,30,52]
[null,22,null,null,{"$f":"SW!G31","v":"MUHAMMAD ALFAN FATHONI"},23,23,23,11.5,70,null,null,35,47]
[null,23,null,null,{"$f":"SW!G32","v":"MUHAMMAD AMINULLAH MAULUDANI"},33,33,33,16.5,50,null,null,25,42]
[null,24,null,null,{"$f":"SW!G33","v":"MUHAMMAD DAVIN  LEVANTINO"},33,33,33,16.5,70,null,null,35,52]
[null,25,null,null,{"$f":"SW!G34","v":"MUHAMMAD MAULANA PAHLEVY"},17,17,17,8.5,60,null,null,30,39]
[null,26,null,null,{"$f":"SW!G35","v":"RADITYA NIRWANSYAH"},23,23,23,11.5,50,null,null,25,37]
[null,27,null,null,{"$f":"SW!G36","v":"REVINA SRI UTARI"},33,33,33,16.5,70,null,null,35,52]
[null,28,null,null,{"$f":"SW!G37","v":"REYHAN DWI ANDIKA"},37,37,37,18.5,60,null,null,30,49]
[null,29,null,null,{"$f":"SW!G38","v":"RISKA LAURA TRIA OCTAVIA"},33,33,33,16.5,70,null,null,35,52]
[null,30,null,null,{"$f":"SW!G39","v":"ROHMADONA DWI SAFITRI"},33,33,33,16.5,80,null,null,40,57]
[null,31,null,null,{"$f":"SW!G40","v":"SALMAN ALFARIZI"},17,17,17,8.5,60,null,null,30,39]
[null,32,null,null,{"$f":"SW!G41","v":"TAUFIQ KURROHMAN"},33,33,33,16.5,50,null,null,25,42]
[null,33,null,null,{"$f":"SW!G42","v":0},null,null,null,0,null,null,null,0,0]
[null,34,null,null,{"$f":"SW!G43","v":0},null,null,null,0,null,null,null,0,0]
[null,35,null,null,{"$f":"SW!G44","v":0},null,null,null,0,null,null,null,0,0]
[null,36,null,null,{"$f":"SW!G45","v":0},null,null,null,0,null,null,null,0,0]
[null,37,null,null,{"$f":"SW!G46","v":0},null,null,null,0,null,null,null,0,0]
[null,38,null,null,{"$f":"SW!G47","v":0},null,null,null,0,null,null,null,0,0]
[null,39,null,null,{"$f":"SW!G48","v":0},null,null,null,0,null,null,null,0,0]
[null,40,null,null,{"$f":"SW!G49","v":0},null,null,null,0,null,null,null,0,0]
[null,41,null,null,{"$f":"SW!G50","v":0},null,null,null,0,null,null,null,0,0]
[null,42,null,null,{"$f":"SW!G51","v":0},null,null,null,0,null,null,null,0,0]
[null,43,null,null,{"$f":"SW!G52","v":0},null,null,null,0,null,null,null,0,0]
[null,44,null,null,{"$f":"SW!G53","v":0},null,null,null,0,null,null,null,0,0]
[null,45,null,null,{"$f":"SW!G54","v":0},null,null,null,0,null,null,null,0,0]
[null,46,null,null,{"$f":"SW!G55","v":0},null,null,null,0,null,null,null,0,0]
[null,47,null,null,{"$f":"SW!G56","v":0},null,null,null,0,null,null,null,0,0]
[null,48,null,null,{"$f":"SW!G57","v":0},null,null,null,0,null,null,null,0,0]
[null,49,null,null,{"$f":"SW!G58","v":0},null,null,null,0,null,null,null,0,0]
[null,50,null,null,{"$f":"SW!G59","v":0},null,null,null,0,null,null,null,0,0]
[null,51,null,null,{"$f":"SW!G60","v":0},null,null,null,0,null,null,null,0,0]
[null,52,null,null,{"$f":"SW!G61","v":0},null,null,null,0,null,null,null,0,0]
[null,53,null,null,{"$f":"SW!G62","v":0},null,null,null,0,null,null,null,0,0]
[null,54,null,null,{"$f":"SW!G63","v":0},null,null,null,0,null,null,null,0,0]
[null,55,null,null,{"$f":"SW!G64","v":0},null,null,null,0,null,null,null,0,0]
[null,56,null,null,{"$f":"SW!G65","v":0},null,null,null,0,null,null,null,0,0]
[null,57,null,null,{"$f":"SW!G66","v":0},null,null,null,0,null,null,null,0,0]
[null,58,null,null,{"$f":"SW!G67","v":0},null,null,null,0,null,null,null,0,0]
[null,59,null,null,{"$f":"SW!G68","v":0},null,null,null,0,null,null,null,0,0]
[null,60,null,null,{"$f":"SW!G69","v":0},null,null,null,0,null,null,null,0,0]
[null,61,null,null,{"$f":"SW!G70","v":0},null,null,null,0,null,null,null,0,0]
[null,62,null,null,{"$f":"SW!G71","v":0},null,null,null,0,null,null,null,0,0]
[null,63,null,null,{"$f":"SW!G72","v":0},null,null,null,0,null,null,null,0,0]
[null,64,null,null,{"$f":"SW!G73","v":0},null,null,null,0,null,null,null,0,0]
[null,65,null,null,{"$f":"SW!G74","v":0},null,null,null,0,null,null,null,0,0]
[null,66,null,null,{"$f":"SW!G75","v":0},null,null,null,{"$f":"$I$10*F76","v":0},null,null,null,{"$f":"J76*$M$10","v":0},{"$f":"IFERROR(ROUND(AVERAGE(M76+I76),0),\"\")","v":0}]
[null,67,null,null,{"$f":"SW!G76","v":0},null,null,null,0,null,null,null,0,0]
[null,68,null,null,{"$f":"SW!G77","v":0},null,null,null,0,null,null,null,0,0]
[null,69,null,null,{"$f":"SW!G78","v":0},null,null,null,0,null,null,null,0,0]
[null,70,null,null,{"$f":"SW!G79","v":0},null,null,null,0,null,null,null,0,0]
[null,71,null,null,{"$f":"SW!G80","v":0},null,null,null,0,null,null,null,0,0]
[null,72,null,null,{"$f":"SW!G81","v":0},null,null,null,0,null,null,null,0,0]
[null,73,null,null,{"$f":"SW!G82","v":0},null,null,null,0,null,null,null,0,0]
[null,74,null,null,{"$f":"SW!G83","v":0},null,null,null,0,null,null,null,0,0]
[null,75,null,null,{"$f":"SW!G84","v":0},null,null,null,0,null,null,null,0,0]
[null,76,null,null,{"$f":"SW!G85","v":0},null,null,null,0,null,null,null,0,0]
[null,77,null,null,{"$f":"SW!G86","v":0},null,null,null,0,null,null,null,0,0]
[null,78,null,null,{"$f":"SW!G87","v":0},null,null,null,0,null,null,null,0,0]
[null,79,null,null,{"$f":"SW!G88","v":0},null,null,null,0,null,null,null,0,0]
[null,80,null,null,{"$f":"SW!G89","v":0},null,null,null,0,null,null,null,0,0]
[null,81,null,null,{"$f":"SW!G90","v":0},null,null,null,0,null,null,null,0,0]
[null,82,null,null,{"$f":"SW!G91","v":0},null,null,null,0,null,null,null,0,0]
[null,83,null,null,{"$f":"SW!G92","v":0},null,null,null,0,null,null,null,0,0]
[null,84,null,null,{"$f":"SW!G93","v":0},null,null,null,0,null,null,null,0,0]
[null,85,null,null,{"$f":"SW!G94","v":0},null,null,null,0,null,null,null,0,0]
[null,86,null,null,{"$f":"SW!G95","v":0},null,null,null,0,null,null,null,0,0]
[null,87,null,null,{"$f":"SW!G96","v":0},null,null,null,0,null,null,null,0,0]
[null,88,null,null,{"$f":"SW!G97","v":0},null,null,null,0,null,null,null,0,0]
[null,89,null,null,{"$f":"SW!G98","v":0},null,null,null,0,null,null,null,0,0]

{"sheet":"BA","index":16,"n_rows":99,"n_cols":15,"rows_kept":99,"cut":false,"hidden":false,"merged":[[98,5,98,7],[98,9,98,11],[98,13,98,16],[96,5,96,7],[96,9,96,11],[96,13,96,16],[97,5,97,7],[97,9,97,11],[97,13,97,16],[94,5,94,7],[94,9,94,11],[94,13,94,16],[95,5,95,7],[95,9,95,11],[95,13,95,16],[92,5,92,7],[92,9,92,11],[92,13,92,16],[93,5,93,7],[93,9,93,11],[93,13,93,16],[90,5,90,7],[90,9,90,11],[90,13,90,16],[91,5,91,7],[91,9,91,11],[91,13,91,16],[88,5,88,7],[88,9,88,11],[88,13,88,16],[89,5,89,7],[89,9,89,11],[89,13,89,16],[86,5,86,7],[86,9,86,11],[86,13,86,16],[87,5,87,7],[87,9,87,11],[87,13,87,16],[84,5,84,7],[84,9,84,11],[84,13,84,16],[85,5,85,7],[85,9,85,11],[85,13,85,16],[82,5,82,7],[82,9,82,11],[82,13,82,16],[83,5,83,7],[83,9,83,11],[83,13,83,16],[80,5,80,7],[80,9,80,11],[80,13,80,16],[81,5,81,7],[81,9,81,11],[81,13,81,16],[78,5,78,7],[78,9,78,11],[78,13,78,16],[79,5,79,7],[79,9,79,11],[79,13,79,16],[76,5,76,7],[76,9,76,11],[76,13,76,16],[77,5,77,7],[77,9,77,11],[77,13,77,16],[74,5,74,7],[74,9,74,11],[74,13,74,16],[75,5,75,7],[75,9,75,11],[75,13,75,16],[72,5,72,7],[72,9,72,11],[72,13,72,16],[73,5,73,7],[73,9,73,11],[73,13,73,16],[70,5,70,7],[70,9,70,11],[70,13,70,16],[71,5,71,7],[71,9,71,11],[71,13,71,16],[68,5,68,7],[68,9,68,11],[68,13,68,16],[69,5,69,7],[69,9,69,11],[69,13,69,16],[66,5,66,7],[66,9,66,11],[66,13,66,16],[67,5,67,7],[67,9,67,11],[67,13,67,16],[64,5,64,7],[64,9,64,11],[64,13,64,16],[65,5,65,7],[65,9,65,11],[65,13,65,16],[62,5,62,7],[62,9,62,11],[62,13,62,16],[63,5,63,7],[63,9,63,11],[63,13,63,16],[60,5,60,7],[60,9,60,11],[60,13,60,16],[61,5,61,7],[61,9,61,11],[61,13,61,16],[58,5,58,7],[58,9,58,11],[58,13,58,16],[59,5,59,7],[59,9,59,11],[59,13,59,16],[56,5,56,7],[56,9,56,11],[56,13,56,16],[57,5,57,7],[57,9,57,11],[57,13,57,16],[54,5,54,7],[54,9,54,11],[54,13,54,16],[55,5,55,7],[55,9,55,11],[55,13,55,16],[52,5,52,7],[52,9,52,11],[52,13,52,16],[53,5,53,7],[53,9,53,11],[53,13,53,16],[50,5,50,7],[50,9,50,11],[50,13,50,16],[51,5,51,7],[51,9,51,11],[51,13,51,16],[48,5,48,7],[48,9,48,11],[48,13,48,16],[49,5,49,7],[49,9,49,11],[49,13,49,16],[46,5,46,7],[46,9,46,11],[46,13,46,16],[47,5,47,7],[47,9,47,11],[47,13,47,16],[44,5,44,7],[44,9,44,11],[44,13,44,16],[45,5,45,7],[45,9,45,11],[45,13,45,16],[42,5,42,7],[42,9,42,11],[42,13,42,16],[43,5,43,7],[43,9,43,11],[43,13,43,16],[40,5,40,7],[40,9,40,11],[40,13,40,16],[41,5,41,7],[41,9,41,11],[41,13,41,16],[38,5,38,7],[38,9,38,11],[38,13,38,16],[39,5,39,7],[39,9,39,11],[39,13,39,16],[36,5,36,7],[36,9,36,11],[36,13,36,16],[37,5,37,7],[37,9,37,11],[37,13,37,16],[34,5,34,7],[34,9,34,11],[34,13,34,16],[35,5,35,7],[35,9,35,11],[35,13,35,16],[32,5,32,7],[32,9,32,11],[32,13,32,16],[33,5,33,7],[33,9,33,11],[33,13,33,16],[30,5,30,7],[30,9,30,11],[30,13,30,16],[31,5,31,7],[31,9,31,11],[31,13,31,16],[28,5,28,7],[28,9,28,11],[28,13,28,16],[29,5,29,7],[29,9,29,11],[29,13,29,16],[26,5,26,7],[26,9,26,11],[26,13,26,16],[27,5,27,7],[27,9,27,11],[27,13,27,16],[24,5,24,7],[24,9,24,11],[24,13,24,16],[25,5,25,7],[25,9,25,11],[25,13,25,16],[22,5,22,7],[22,9,22,11],[22,13,22,16],[23,5,23,7],[23,9,23,11],[23,13,23,16],[20,5,20,7],[20,9,20,11],[20,13,20,16],[21,5,21,7],[21,9,21,11],[21,13,21,16],[18,5,18,7],[18,9,18,11],[18,13,18,16],[19,5,19,7],[19,9,19,11],[19,13,19,16],[16,5,16,7],[16,9,16,11],[16,13,16,16],[17,5,17,7],[17,9,17,11],[17,13,17,16],[14,5,14,7],[14,9,14,11],[14,13,14,16],[15,5,15,7],[15,9,15,11],[15,13,15,16],[12,5,12,7],[12,9,12,11],[12,13,12,16],[13,5,13,7],[13,9,13,11],[13,13,13,16],[9,9,9,11],[10,5,10,7],[10,9,10,11],[10,13,10,16],[11,5,11,7],[11,9,11,11],[11,13,11,16],[1,1,1,16],[3,6,3,12],[3,14,5,15],[4,6,4,12],[5,6,5,12],[8,1,9,1],[8,4,9,4],[8,5,8,12],[8,13,9,16],[9,5,9,7]]}
[]
[null,"D A F T A R   N I L A I"]
[]
[null,"MATA PELAJARAN",null,null,null,":","Bahasa Arab",null,null,null,null,null,null,null,"↗"]
[null,"KELAS",null,null,null,":",{"$f":"UPPER(MN!D22)","v":"V B"}]
[null,"TAHUN PELAJARAN",null,null,null,":",{"$f":"MN!D18","v":"2019 - 2020"}]
[]
[]
[null,"No","No. Induk","NISN","Nama Siswa","NILAI",null,null,null,null,null,null,null,"JUMLAH"]
[null,null,null,null,null,"PG",null,null,0.5,"ESSAY",null,null,{"$f":"100%-I10","v":0.5}]
[null,1,null,null,{"$f":"SW!G10","v":"ABD. ROCHMAN NAJA FATLAN PRATAMA"},30,30,30,{"$f":"$I$10*F11","v":15},20,null,null,{"$f":"J11*$M$10","v":10},{"$f":"IFERROR(ROUND(AVERAGE(M11+I11),0),\"\")","v":25}]
[null,2,null,null,{"$f":"SW!G11","v":"ABDURRAHMAN FAQIH"},20,20,20,{"$f":"$I$10*F12","v":10},40,null,null,{"$f":"J12*$M$10","v":20},{"$f":"IFERROR(ROUND(AVERAGE(M12+I12),0),\"\")","v":30}]
[null,3,null,null,{"$f":"SW!G12","v":"ACHMAD FARROIHUN MUSHOBIRONILLAH"},33,33,33,16.5,40,null,null,20,37]
[null,4,null,null,{"$f":"SW!G13","v":"ACHMAD HASBI ASSIDDIQI"},23,23,23,11.5,40,null,null,20,32]
[null,5,null,null,{"$f":"SW!G14","v":"ACHMAD REZA AKRAM ALAUDDIN"},27,27,27,13.5,60,null,null,30,44]
[null,6,null,null,{"$f":"SW!G15","v":"ACHMAD YANI"},23,23,23,11.5,40,null,null,20,32]
[null,7,null,null,{"$f":"SW!G16","v":"AKHMAD RIDWAN"},23,23,23,11.5,40,null,null,20,32]
[null,8,null,null,{"$f":"SW!G17","v":"ANDREAN DWI YULIANO"},27,27,27,13.5,20,null,null,10,24]
[null,9,null,null,{"$f":"SW!G18","v":"ASFAN FAKHRI BARANI"},47,47,47,23.5,60,null,null,30,54]
[null,10,null,null,{"$f":"SW!G19","v":"DEVAN ADITYA SAPUTRA"},23,23,23,11.5,20,null,null,10,22]
[null,11,null,null,{"$f":"SW!G20","v":"FAHRUL AHMAD FAHREZA"},27,27,27,13.5,40,null,null,20,34]
[null,12,null,null,{"$f":"SW!G21","v":"FAUZIA AMELIA PUTRI"},60,60,60,30,60,null,null,30,60]
[null,13,null,null,{"$f":"SW!G22","v":"FAZA AZIFAH SALSABILA"},40,40,40,20,60,null,null,30,50]
[null,14,null,null,{"$f":"SW!G23","v":"HABIBIE NURUSSALAM"},40,40,40,20,20,null,null,10,30]
[null,15,null,null,{"$f":"SW!G24","v":"HIMATURROSYIDAH"},47,47,47,23.5,60,null,null,30,54]
[null,16,null,null,{"$f":"SW!G25","v":"IFKARINA NAILA SAUQYA"},30,30,30,15,60,null,null,30,45]
[null,17,null,null,{"$f":"SW!G26","v":"KEISA AYU SASKIYAH"},33,33,33,16.5,60,null,null,30,47]
[null,18,null,null,{"$f":"SW!G27","v":"MOCHAMMAD RENO FIRMANSYAH"},43,43,43,21.5,20,null,null,10,32]
[null,19,null,null,{"$f":"SW!G28","v":"MOHAMAD NUR KHAFID KHABIBULLOH"},20,20,20,10,60,null,null,30,40]
[null,20,null,null,{"$f":"SW!G29","v":"MOHAMMAD NAUFAL NAWWARUDDIN"},17,17,17,8.5,40,null,null,20,29]
[null,21,null,null,{"$f":"SW!G30","v":"MUCHAMAD PRIMA PAMBUDI"},23,23,23,11.5,40,null,null,20,32]
[null,22,null,null,{"$f":"SW!G31","v":"MUHAMMAD ALFAN FATHONI"},43,43,43,21.5,40,null,null,20,42]
[null,23,null,null,{"$f":"SW!G32","v":"MUHAMMAD AMINULLAH MAULUDANI"},30,30,30,15,40,null,null,20,35]
[null,24,null,null,{"$f":"SW!G33","v":"MUHAMMAD DAVIN  LEVANTINO"},30,30,30,15,40,null,null,20,35]
[null,25,null,null,{"$f":"SW!G34","v":"MUHAMMAD MAULANA PAHLEVY"},17,17,17,8.5,40,null,null,20,29]
[null,26,null,null,{"$f":"SW!G35","v":"RADITYA NIRWANSYAH"},23,23,23,11.5,40,null,null,20,32]
[null,27,null,null,{"$f":"SW!G36","v":"REVINA SRI UTARI"},17,17,17,8.5,40,null,null,20,29]
[null,28,null,null,{"$f":"SW!G37","v":"REYHAN DWI ANDIKA"},13,13,13,6.5,20,null,null,10,17]
[null,29,null,null,{"$f":"SW!G38","v":"RISKA LAURA TRIA OCTAVIA"},30,null,null,15,40,null,null,20,35]
[null,30,null,null,{"$f":"SW!G39","v":"ROHMADONA DWI SAFITRI"},37,37,37,18.5,40,null,null,20,39]
[null,31,null,null,{"$f":"SW!G40","v":"SALMAN ALFARIZI"},40,40,40,20,40,null,null,20,40]
[null,32,null,null,{"$f":"SW!G41","v":"TAUFIQ KURROHMAN"},33,33,33,16.5,60,null,null,30,47]
[null,33,null,null,{"$f":"SW!G42","v":0},null,null,null,0,null,null,null,0,0]
[null,34,null,null,{"$f":"SW!G43","v":0},null,null,null,0,null,null,null,0,0]
[null,35,null,null,{"$f":"SW!G44","v":0},null,null,null,0,null,null,null,0,0]
[null,36,null,null,{"$f":"SW!G45","v":0},null,null,null,0,null,null,null,0,0]
[null,37,null,null,{"$f":"SW!G46","v":0},null,null,null,0,null,null,null,0,0]
[null,38,null,null,{"$f":"SW!G47","v":0},null,null,null,0,null,null,null,0,0]
[null,39,null,null,{"$f":"SW!G48","v":0},null,null,null,0,null,null,null,0,0]
[null,40,null,null,{"$f":"SW!G49","v":0},null,null,null,0,null,null,null,0,0]
[null,41,null,null,{"$f":"SW!G50","v":0},null,null,null,0,null,null,null,0,0]
[null,42,null,null,{"$f":"SW!G51","v":0},null,null,null,0,null,null,null,0,0]
[null,43,null,null,{"$f":"SW!G52","v":0},null,null,null,0,null,null,null,0,0]
[null,44,null,null,{"$f":"SW!G53","v":0},null,null,null,0,null,null,null,0,0]
[null,45,null,null,{"$f":"SW!G54","v":0},null,null,null,0,null,null,null,0,0]
[null,46,null,null,{"$f":"SW!G55","v":0},null,null,null,0,null,null,null,0,0]
[null,47,null,null,{"$f":"SW!G56","v":0},null,null,null,0,null,null,null,0,0]
[null,48,null,null,{"$f":"SW!G57","v":0},null,null,null,0,null,null,null,0,0]
[null,49,null,null,{"$f":"SW!G58","v":0},null,null,null,0,null,null,null,0,0]
[null,50,null,null,{"$f":"SW!G59","v":0},null,null,null,0,null,null,null,0,0]
[null,51,null,null,{"$f":"SW!G60","v":0},null,null,null,0,null,null,null,0,0]
[null,52,null,null,{"$f":"SW!G61","v":0},null,null,null,0,null,null,null,0,0]
[null,53,null,null,{"$f":"SW!G62","v":0},null,null,null,0,null,null,null,0,0]
[null,54,null,null,{"$f":"SW!G63","v":0},null,null,null,0,null,null,null,0,0]
[null,55,null,null,{"$f":"SW!G64","v":0},null,null,null,0,null,null,null,0,0]
[null,56,null,null,{"$f":"SW!G65","v":0},null,null,null,0,null,null,null,0,0]
[null,57,null,null,{"$f":"SW!G66","v":0},null,null,null,0,null,null,null,0,0]
[null,58,null,null,{"$f":"SW!G67","v":0},null,null,null,0,null,null,null,0,0]
[null,59,null,null,{"$f":"SW!G68","v":0},null,null,null,0,null,null,null,0,0]
[null,60,null,null,{"$f":"SW!G69","v":0},null,null,null,0,null,null,null,0,0]
[null,61,null,null,{"$f":"SW!G70","v":0},null,null,null,0,null,null,null,0,0]
[null,62,null,null,{"$f":"SW!G71","v":0},null,null,null,0,null,null,null,0,0]
[null,63,null,null,{"$f":"SW!G72","v":0},null,null,null,0,null,null,null,0,0]
[null,64,null,null,{"$f":"SW!G73","v":0},null,null,null,0,null,null,null,0,0]
[null,65,null,null,{"$f":"SW!G74","v":0},null,null,null,0,null,null,null,0,0]
[null,66,null,null,{"$f":"SW!G75","v":0},null,null,null,{"$f":"$I$10*F76","v":0},null,null,null,{"$f":"J76*$M$10","v":0},{"$f":"IFERROR(ROUND(AVERAGE(M76+I76),0),\"\")","v":0}]
[null,67,null,null,{"$f":"SW!G76","v":0},null,null,null,0,null,null,null,0,0]
[null,68,null,null,{"$f":"SW!G77","v":0},null,null,null,0,null,null,null,0,0]
[null,69,null,null,{"$f":"SW!G78","v":0},null,null,null,0,null,null,null,0,0]
[null,70,null,null,{"$f":"SW!G79","v":0},null,null,null,0,null,null,null,0,0]
[null,71,null,null,{"$f":"SW!G80","v":0},null,null,null,0,null,null,null,0,0]
[null,72,null,null,{"$f":"SW!G81","v":0},null,null,null,0,null,null,null,0,0]
[null,73,null,null,{"$f":"SW!G82","v":0},null,null,null,0,null,null,null,0,0]
[null,74,null,null,{"$f":"SW!G83","v":0},null,null,null,0,null,null,null,0,0]
[null,75,null,null,{"$f":"SW!G84","v":0},null,null,null,0,null,null,null,0,0]
[null,76,null,null,{"$f":"SW!G85","v":0},null,null,null,0,null,null,null,0,0]
[null,77,null,null,{"$f":"SW!G86","v":0},null,null,null,0,null,null,null,0,0]
[null,78,null,null,{"$f":"SW!G87","v":0},null,null,null,0,null,null,null,0,0]
[null,79,null,null,{"$f":"SW!G88","v":0},null,null,null,0,null,null,null,0,0]
[null,80,null,null,{"$f":"SW!G89","v":0},null,null,null,0,null,null,null,0,0]
[null,81,null,null,{"$f":"SW!G90","v":0},null,null,null,0,null,null,null,0,0]
[null,82,null,null,{"$f":"SW!G91","v":0},null,null,null,0,null,null,null,0,0]
[null,83,null,null,{"$f":"SW!G92","v":0},null,null,null,0,null,null,null,0,0]
[null,84,null,null,{"$f":"SW!G93","v":0},null,null,null,0,null,null,null,0,0]
[null,85,null,null,{"$f":"SW!G94","v":0},null,null,null,0,null,null,null,0,0]
[null,86,null,null,{"$f":"SW!G95","v":0},null,null,null,0,null,null,null,0,0]
[null,87,null,null,{"$f":"SW!G96","v":0},null,null,null,0,null,null,null,0,0]
[null,88,null,null,{"$f":"SW!G97","v":0},null,null,null,0,null,null,null,0,0]
[null,89,null,null,{"$f":"SW!G98","v":0},null,null,null,0,null,null,null,0,0]

{"sheet":"MLK1","index":17,"n_rows":99,"n_cols":15,"rows_kept":99,"cut":false,"hidden":false,"merged":[[9,9,9,11],[10,5,10,7],[10,9,10,11],[10,13,10,16],[11,5,11,7],[11,9,11,11],[11,13,11,16],[1,1,1,16],[3,6,3,12],[3,14,5,15],[4,6,4,12],[5,6,5,12],[8,1,9,1],[8,4,9,4],[8,5,8,12],[8,13,9,16],[9,5,9,7],[14,5,14,7],[14,9,14,11],[14,13,14,16],[15,5,15,7],[15,9,15,11],[15,13,15,16],[12,5,12,7],[12,9,12,11],[12,13,12,16],[13,5,13,7],[13,9,13,11],[13,13,13,16],[18,5,18,7],[18,9,18,11],[18,13,18,16],[19,5,19,7],[19,9,19,11],[19,13,19,16],[16,5,16,7],[16,9,16,11],[16,13,16,16],[17,5,17,7],[17,9,17,11],[17,13,17,16],[22,5,22,7],[22,9,22,11],[22,13,22,16],[23,5,23,7],[23,9,23,11],[23,13,23,16],[20,5,20,7],[20,9,20,11],[20,13,20,16],[21,5,21,7],[21,9,21,11],[21,13,21,16],[26,5,26,7],[26,9,26,11],[26,13,26,16],[27,5,27,7],[27,9,27,11],[27,13,27,16],[24,5,24,7],[24,9,24,11],[24,13,24,16],[25,5,25,7],[25,9,25,11],[25,13,25,16],[30,5,30,7],[30,9,30,11],[30,13,30,16],[31,5,31,7],[31,9,31,11],[31,13,31,16],[28,5,28,7],[28,9,28,11],[28,13,28,16],[29,5,29,7],[29,9,29,11],[29,13,29,16],[34,5,34,7],[34,9,34,11],[34,13,34,16],[35,5,35,7],[35,9,35,11],[35,13,35,16],[32,5,32,7],[32,9,32,11],[32,13,32,16],[33,5,33,7],[33,9,33,11],[33,13,33,16],[38,5,38,7],[38,9,38,11],[38,13,38,16],[39,5,39,7],[39,9,39,11],[39,13,39,16],[36,5,36,7],[36,9,36,11],[36,13,36,16],[37,5,37,7],[37,9,37,11],[37,13,37,16],[42,5,42,7],[42,9,42,11],[42,13,42,16],[43,5,43,7],[43,9,43,11],[43,13,43,16],[40,5,40,7],[40,9,40,11],[40,13,40,16],[41,5,41,7],[41,9,41,11],[41,13,41,16],[46,5,46,7],[46,9,46,11],[46,13,46,16],[47,5,47,7],[47,9,47,11],[47,13,47,16],[44,5,44,7],[44,9,44,11],[44,13,44,16],[45,5,45,7],[45,9,45,11],[45,13,45,16],[50,5,50,7],[50,9,50,11],[50,13,50,16],[51,5,51,7],[51,9,51,11],[51,13,51,16],[48,5,48,7],[48,9,48,11],[48,13,48,16],[49,5,49,7],[49,9,49,11],[49,13,49,16],[54,5,54,7],[54,9,54,11],[54,13,54,16],[55,5,55,7],[55,9,55,11],[55,13,55,16],[52,5,52,7],[52,9,52,11],[52,13,52,16],[53,5,53,7],[53,9,53,11],[53,13,53,16],[58,5,58,7],[58,9,58,11],[58,13,58,16],[59,5,59,7],[59,9,59,11],[59,13,59,16],[56,5,56,7],[56,9,56,11],[56,13,56,16],[57,5,57,7],[57,9,57,11],[57,13,57,16],[62,5,62,7],[62,9,62,11],[62,13,62,16],[63,5,63,7],[63,9,63,11],[63,13,63,16],[60,5,60,7],[60,9,60,11],[60,13,60,16],[61,5,61,7],[61,9,61,11],[61,13,61,16],[66,5,66,7],[66,9,66,11],[66,13,66,16],[67,5,67,7],[67,9,67,11],[67,13,67,16],[64,5,64,7],[64,9,64,11],[64,13,64,16],[65,5,65,7],[65,9,65,11],[65,13,65,16],[70,5,70,7],[70,9,70,11],[70,13,70,16],[71,5,71,7],[71,9,71,11],[71,13,71,16],[68,5,68,7],[68,9,68,11],[68,13,68,16],[69,5,69,7],[69,9,69,11],[69,13,69,16],[74,5,74,7],[74,9,74,11],[74,13,74,16],[75,5,75,7],[75,9,75,11],[75,13,75,16],[72,5,72,7],[72,9,72,11],[72,13,72,16],[73,5,73,7],[73,9,73,11],[73,13,73,16],[78,5,78,7],[78,9,78,11],[78,13,78,16],[79,5,79,7],[79,9,79,11],[79,13,79,16],[76,5,76,7],[76,9,76,11],[76,13,76,16],[77,5,77,7],[77,9,77,11],[77,13,77,16],[82,5,82,7],[82,9,82,11],[82,13,82,16],[83,5,83,7],[83,9,83,11],[83,13,83,16],[80,5,80,7],[80,9,80,11],[80,13,80,16],[81,5,81,7],[81,9,81,11],[81,13,81,16],[86,5,86,7],[86,9,86,11],[86,13,86,16],[87,5,87,7],[87,9,87,11],[87,13,87,16],[84,5,84,7],[84,9,84,11],[84,13,84,16],[85,5,85,7],[85,9,85,11],[85,13,85,16],[90,5,90,7],[90,9,90,11],[90,13,90,16],[91,5,91,7],[91,9,91,11],[91,13,91,16],[88,5,88,7],[88,9,88,11],[88,13,88,16],[89,5,89,7],[89,9,89,11],[89,13,89,16],[94,5,94,7],[94,9,94,11],[94,13,94,16],[95,5,95,7],[95,9,95,11],[95,13,95,16],[92,5,92,7],[92,9,92,11],[92,13,92,16],[93,5,93,7],[93,9,93,11],[93,13,93,16],[98,5,98,7],[98,9,98,11],[98,13,98,16],[96,5,96,7],[96,9,96,11],[96,13,96,16],[97,5,97,7],[97,9,97,11],[97,13,97,16]]}
[]
[null,"D A F T A R   N I L A I"]
[]
[null,"MATA PELAJARAN",null,null,null,":","Nahwu / Shorof",null,null,null,null,null,null,null,"↗"]
[null,"KELAS",null,null,null,":",{"$f":"UPPER(MN!D22)","v":"V B"}]
[null,"TAHUN PELAJARAN",null,null,null,":",{"$f":"MN!D18","v":"2019 - 2020"}]
[]
[]
[null,"No","No. Induk","NISN","Nama Siswa","NILAI",null,null,null,null,null,null,null,"JUMLAH"]
[null,null,null,null,null,"PG",null,null,0.5,"ESSAY",null,null,{"$f":"100%-I10","v":0.5}]
[null,1,null,null,{"$f":"SW!G10","v":"ABD. ROCHMAN NAJA FATLAN PRATAMA"},10,null,null,{"$f":"$I$10*F11","v":5},10,null,null,{"$f":"J11*$M$10","v":5},{"$f":"IFERROR(ROUND(AVERAGE(M11+I11),0),\"\")","v":10}]
[null,2,null,null,{"$f":"SW!G11","v":"ABDURRAHMAN FAQIH"},30,null,null,{"$f":"$I$10*F12","v":15},30,null,null,{"$f":"J12*$M$10","v":15},{"$f":"IFERROR(ROUND(AVERAGE(M12+I12),0),\"\")","v":30}]
[null,3,null,null,{"$f":"SW!G12","v":"ACHMAD FARROIHUN MUSHOBIRONILLAH"},30,null,null,15,30,null,null,15,30]
[null,4,null,null,{"$f":"SW!G13","v":"ACHMAD HASBI ASSIDDIQI"},25,null,null,12.5,25,null,null,12.5,25]
[null,5,null,null,{"$f":"SW!G14","v":"ACHMAD REZA AKRAM ALAUDDIN"},40,null,null,20,40,null,null,20,40]
[null,6,null,null,{"$f":"SW!G15","v":"ACHMAD YANI"},25,null,null,12.5,25,null,null,12.5,25]
[null,7,null,null,{"$f":"SW!G16","v":"AKHMAD RIDWAN"},20,null,null,10,20,null,null,10,20]
[null,8,null,null,{"$f":"SW!G17","v":"ANDREAN DWI YULIANO"},10,null,null,5,10,null,null,5,10]
[null,9,null,null,{"$f":"SW!G18","v":"ASFAN FAKHRI BARANI"},60,null,null,30,60,null,null,30,60]
[null,10,null,null,{"$f":"SW!G19","v":"DEVAN ADITYA SAPUTRA"},20,null,null,10,20,null,null,10,20]
[null,11,null,null,{"$f":"SW!G20","v":"FAHRUL AHMAD FAHREZA"},20,null,null,10,20,null,null,10,20]
[null,12,null,null,{"$f":"SW!G21","v":"FAUZIA AMELIA PUTRI"},40,null,null,20,40,null,null,20,40]
[null,13,null,null,{"$f":"SW!G22","v":"FAZA AZIFAH SALSABILA"},40,null,null,20,40,null,null,20,40]
[null,14,null,null,{"$f":"SW!G23","v":"HABIBIE NURUSSALAM"},15,null,null,7.5,15,null,null,7.5,15]
[null,15,null,null,{"$f":"SW!G24","v":"HIMATURROSYIDAH"},65,null,null,32.5,65,null,null,32.5,65]
[null,16,null,null,{"$f":"SW!G25","v":"IFKARINA NAILA SAUQYA"},65,null,null,32.5,65,null,null,32.5,65]
[null,17,null,null,{"$f":"SW!G26","v":"KEISA AYU SASKIYAH"},65,null,null,32.5,65,null,null,32.5,65]
[null,18,null,null,{"$f":"SW!G27","v":"MOCHAMMAD RENO FIRMANSYAH"},20,null,null,10,20,null,null,10,20]
[null,19,null,null,{"$f":"SW!G28","v":"MOHAMAD NUR KHAFID KHABIBULLOH"},50,null,null,25,50,null,null,25,50]
[null,20,null,null,{"$f":"SW!G29","v":"MOHAMMAD NAUFAL NAWWARUDDIN"},20,null,null,10,20,null,null,10,20]
[null,21,null,null,{"$f":"SW!G30","v":"MUCHAMAD PRIMA PAMBUDI"},25,null,null,12.5,25,null,null,12.5,25]
[null,22,null,null,{"$f":"SW!G31","v":"MUHAMMAD ALFAN FATHONI"},30,null,null,15,30,null,null,15,30]
[null,23,null,null,{"$f":"SW!G32","v":"MUHAMMAD AMINULLAH MAULUDANI"},20,null,null,10,20,null,null,10,20]
[null,24,null,null,{"$f":"SW!G33","v":"MUHAMMAD DAVIN  LEVANTINO"},30,null,null,15,30,null,null,15,30]
[null,25,null,null,{"$f":"SW!G34","v":"MUHAMMAD MAULANA PAHLEVY"},20,null,null,10,20,null,null,10,20]
[null,26,null,null,{"$f":"SW!G35","v":"RADITYA NIRWANSYAH"},20,null,null,10,20,null,null,10,20]
[null,27,null,null,{"$f":"SW!G36","v":"REVINA SRI UTARI"},25,null,null,12.5,25,null,null,12.5,25]
[null,28,null,null,{"$f":"SW!G37","v":"REYHAN DWI ANDIKA"},10,null,null,5,10,null,null,5,10]
[null,29,null,null,{"$f":"SW!G38","v":"RISKA LAURA TRIA OCTAVIA"},65,null,null,32.5,65,null,null,32.5,65]
[null,30,null,null,{"$f":"SW!G39","v":"ROHMADONA DWI SAFITRI"},30,null,null,15,30,null,null,15,30]
[null,31,null,null,{"$f":"SW!G40","v":"SALMAN ALFARIZI"},25,null,null,12.5,25,null,null,12.5,25]
[null,32,null,null,{"$f":"SW!G41","v":"TAUFIQ KURROHMAN"},25,null,null,12.5,25,null,null,12.5,25]
[null,33,null,null,{"$f":"SW!G42","v":0},null,null,null,0,null,null,null,0,0]
[null,34,null,null,{"$f":"SW!G43","v":0},null,null,null,0,null,null,null,0,0]
[null,35,null,null,{"$f":"SW!G44","v":0},null,null,null,0,null,null,null,0,0]
[null,36,null,null,{"$f":"SW!G45","v":0},null,null,null,0,null,null,null,0,0]
[null,37,null,null,{"$f":"SW!G46","v":0},null,null,null,0,null,null,null,0,0]
[null,38,null,null,{"$f":"SW!G47","v":0},null,null,null,0,null,null,null,0,0]
[null,39,null,null,{"$f":"SW!G48","v":0},null,null,null,0,null,null,null,0,0]
[null,40,null,null,{"$f":"SW!G49","v":0},null,null,null,0,null,null,null,0,0]
[null,41,null,null,{"$f":"SW!G50","v":0},null,null,null,0,null,null,null,0,0]
[null,42,null,null,{"$f":"SW!G51","v":0},null,null,null,0,null,null,null,0,0]
[null,43,null,null,{"$f":"SW!G52","v":0},null,null,null,0,null,null,null,0,0]
[null,44,null,null,{"$f":"SW!G53","v":0},null,null,null,0,null,null,null,0,0]
[null,45,null,null,{"$f":"SW!G54","v":0},null,null,null,0,null,null,null,0,0]
[null,46,null,null,{"$f":"SW!G55","v":0},null,null,null,0,null,null,null,0,0]
[null,47,null,null,{"$f":"SW!G56","v":0},null,null,null,0,null,null,null,0,0]
[null,48,null,null,{"$f":"SW!G57","v":0},null,null,null,0,null,null,null,0,0]
[null,49,null,null,{"$f":"SW!G58","v":0},null,null,null,0,null,null,null,0,0]
[null,50,null,null,{"$f":"SW!G59","v":0},null,null,null,0,null,null,null,0,0]
[null,51,null,null,{"$f":"SW!G60","v":0},null,null,null,0,null,null,null,0,0]
[null,52,null,null,{"$f":"SW!G61","v":0},null,null,null,0,null,null,null,0,0]
[null,53,null,null,{"$f":"SW!G62","v":0},null,null,null,0,null,null,null,0,0]
[null,54,null,null,{"$f":"SW!G63","v":0},null,null,null,0,null,null,null,0,0]
[null,55,null,null,{"$f":"SW!G64","v":0},null,null,null,0,null,null,null,0,0]
[null,56,null,null,{"$f":"SW!G65","v":0},null,null,null,0,null,null,null,0,0]
[null,57,null,null,{"$f":"SW!G66","v":0},null,null,null,0,null,null,null,0,0]
[null,58,null,null,{"$f":"SW!G67","v":0},null,null,null,0,null,null,null,0,0]
[null,59,null,null,{"$f":"SW!G68","v":0},null,null,null,0,null,null,null,0,0]
[null,60,null,null,{"$f":"SW!G69","v":0},null,null,null,0,null,null,null,0,0]
[null,61,null,null,{"$f":"SW!G70","v":0},null,null,null,0,null,null,null,0,0]
[null,62,null,null,{"$f":"SW!G71","v":0},null,null,null,0,null,null,null,0,0]
[null,63,null,null,{"$f":"SW!G72","v":0},null,null,null,0,null,null,null,0,0]
[null,64,null,null,{"$f":"SW!G73","v":0},null,null,null,0,null,null,null,0,0]
[null,65,null,null,{"$f":"SW!G74","v":0},null,null,null,0,null,null,null,0,0]
[null,66,null,null,{"$f":"SW!G75","v":0},null,null,null,{"$f":"$I$10*F76","v":0},null,null,null,{"$f":"J76*$M$10","v":0},{"$f":"IFERROR(ROUND(AVERAGE(M76+I76),0),\"\")","v":0}]
[null,67,null,null,{"$f":"SW!G76","v":0},null,null,null,0,null,null,null,0,0]
[null,68,null,null,{"$f":"SW!G77","v":0},null,null,null,0,null,null,null,0,0]
[null,69,null,null,{"$f":"SW!G78","v":0},null,null,null,0,null,null,null,0,0]
[null,70,null,null,{"$f":"SW!G79","v":0},null,null,null,0,null,null,null,0,0]
[null,71,null,null,{"$f":"SW!G80","v":0},null,null,null,0,null,null,null,0,0]
[null,72,null,null,{"$f":"SW!G81","v":0},null,null,null,0,null,null,null,0,0]
[null,73,null,null,{"$f":"SW!G82","v":0},null,null,null,0,null,null,null,0,0]
[null,74,null,null,{"$f":"SW!G83","v":0},null,null,null,0,null,null,null,0,0]
[null,75,null,null,{"$f":"SW!G84","v":0},null,null,null,0,null,null,null,0,0]
[null,76,null,null,{"$f":"SW!G85","v":0},null,null,null,0,null,null,null,0,0]
[null,77,null,null,{"$f":"SW!G86","v":0},null,null,null,0,null,null,null,0,0]
[null,78,null,null,{"$f":"SW!G87","v":0},null,null,null,0,null,null,null,0,0]
[null,79,null,null,{"$f":"SW!G88","v":0},null,null,null,0,null,null,null,0,0]
[null,80,null,null,{"$f":"SW!G89","v":0},null,null,null,0,null,null,null,0,0]
[null,81,null,null,{"$f":"SW!G90","v":0},null,null,null,0,null,null,null,0,0]
[null,82,null,null,{"$f":"SW!G91","v":0},null,null,null,0,null,null,null,0,0]
[null,83,null,null,{"$f":"SW!G92","v":0},null,null,null,0,null,null,null,0,0]
[null,84,null,null,{"$f":"SW!G93","v":0},null,null,null,0,null,null,null,0,0]
[null,85,null,null,{"$f":"SW!G94","v":0},null,null,null,0,null,null,null,0,0]
[null,86,null,null,{"$f":"SW!G95","v":0},null,null,null,0,null,null,null,0,0]
[null,87,null,null,{"$f":"SW!G96","v":0},null,null,null,0,null,null,null,0,0]
[null,88,null,null,{"$f":"SW!G97","v":0},null,null,null,0,null,null,null,0,0]
[null,89,null,null,{"$f":"SW!G98","v":0},null,null,null,0,null,null,null,0,0]

{"sheet":"MLK2","index":18,"n_rows":99,"n_cols":15,"rows_kept":99,"cut":false,"hidden":false,"merged":[[9,9,9,11],[10,5,10,7],[10,9,10,11],[10,13,10,16],[11,5,11,7],[11,9,11,11],[11,13,11,16],[1,1,1,16],[3,6,3,12],[3,14,5,15],[4,6,4,12],[5,6,5,12],[8,1,9,1],[8,4,9,4],[8,5,8,12],[8,13,9,16],[9,5,9,7],[14,5,14,7],[14,9,14,11],[14,13,14,16],[15,5,15,7],[15,9,15,11],[15,13,15,16],[12,5,12,7],[12,9,12,11],[12,13,12,16],[13,5,13,7],[13,9,13,11],[13,13,13,16],[18,5,18,7],[18,9,18,11],[18,13,18,16],[19,5,19,7],[19,9,19,11],[19,13,19,16],[16,5,16,7],[16,9,16,11],[16,13,16,16],[17,5,17,7],[17,9,17,11],[17,13,17,16],[22,5,22,7],[22,9,22,11],[22,13,22,16],[23,5,23,7],[23,9,23,11],[23,13,23,16],[20,5,20,7],[20,9,20,11],[20,13,20,16],[21,5,21,7],[21,9,21,11],[21,13,21,16],[26,5,26,7],[26,9,26,11],[26,13,26,16],[27,5,27,7],[27,9,27,11],[27,13,27,16],[24,5,24,7],[24,9,24,11],[24,13,24,16],[25,5,25,7],[25,9,25,11],[25,13,25,16],[30,5,30,7],[30,9,30,11],[30,13,30,16],[31,5,31,7],[31,9,31,11],[31,13,31,16],[28,5,28,7],[28,9,28,11],[28,13,28,16],[29,5,29,7],[29,9,29,11],[29,13,29,16],[34,5,34,7],[34,9,34,11],[34,13,34,16],[35,5,35,7],[35,9,35,11],[35,13,35,16],[32,5,32,7],[32,9,32,11],[32,13,32,16],[33,5,33,7],[33,9,33,11],[33,13,33,16],[38,5,38,7],[38,9,38,11],[38,13,38,16],[39,5,39,7],[39,9,39,11],[39,13,39,16],[36,5,36,7],[36,9,36,11],[36,13,36,16],[37,5,37,7],[37,9,37,11],[37,13,37,16],[42,5,42,7],[42,9,42,11],[42,13,42,16],[43,5,43,7],[43,9,43,11],[43,13,43,16],[40,5,40,7],[40,9,40,11],[40,13,40,16],[41,5,41,7],[41,9,41,11],[41,13,41,16],[46,5,46,7],[46,9,46,11],[46,13,46,16],[47,5,47,7],[47,9,47,11],[47,13,47,16],[44,5,44,7],[44,9,44,11],[44,13,44,16],[45,5,45,7],[45,9,45,11],[45,13,45,16],[50,5,50,7],[50,9,50,11],[50,13,50,16],[51,5,51,7],[51,9,51,11],[51,13,51,16],[48,5,48,7],[48,9,48,11],[48,13,48,16],[49,5,49,7],[49,9,49,11],[49,13,49,16],[54,5,54,7],[54,9,54,11],[54,13,54,16],[55,5,55,7],[55,9,55,11],[55,13,55,16],[52,5,52,7],[52,9,52,11],[52,13,52,16],[53,5,53,7],[53,9,53,11],[53,13,53,16],[58,5,58,7],[58,9,58,11],[58,13,58,16],[59,5,59,7],[59,9,59,11],[59,13,59,16],[56,5,56,7],[56,9,56,11],[56,13,56,16],[57,5,57,7],[57,9,57,11],[57,13,57,16],[62,5,62,7],[62,9,62,11],[62,13,62,16],[63,5,63,7],[63,9,63,11],[63,13,63,16],[60,5,60,7],[60,9,60,11],[60,13,60,16],[61,5,61,7],[61,9,61,11],[61,13,61,16],[66,5,66,7],[66,9,66,11],[66,13,66,16],[67,5,67,7],[67,9,67,11],[67,13,67,16],[64,5,64,7],[64,9,64,11],[64,13,64,16],[65,5,65,7],[65,9,65,11],[65,13,65,16],[70,5,70,7],[70,9,70,11],[70,13,70,16],[71,5,71,7],[71,9,71,11],[71,13,71,16],[68,5,68,7],[68,9,68,11],[68,13,68,16],[69,5,69,7],[69,9,69,11],[69,13,69,16],[74,5,74,7],[74,9,74,11],[74,13,74,16],[75,5,75,7],[75,9,75,11],[75,13,75,16],[72,5,72,7],[72,9,72,11],[72,13,72,16],[73,5,73,7],[73,9,73,11],[73,13,73,16],[78,5,78,7],[78,9,78,11],[78,13,78,16],[79,5,79,7],[79,9,79,11],[79,13,79,16],[76,5,76,7],[76,9,76,11],[76,13,76,16],[77,5,77,7],[77,9,77,11],[77,13,77,16],[82,5,82,7],[82,9,82,11],[82,13,82,16],[83,5,83,7],[83,9,83,11],[83,13,83,16],[80,5,80,7],[80,9,80,11],[80,13,80,16],[81,5,81,7],[81,9,81,11],[81,13,81,16],[86,5,86,7],[86,9,86,11],[86,13,86,16],[87,5,87,7],[87,9,87,11],[87,13,87,16],[84,5,84,7],[84,9,84,11],[84,13,84,16],[85,5,85,7],[85,9,85,11],[85,13,85,16],[90,5,90,7],[90,9,90,11],[90,13,90,16],[91,5,91,7],[91,9,91,11],[91,13,91,16],[88,5,88,7],[88,9,88,11],[88,13,88,16],[89,5,89,7],[89,9,89,11],[89,13,89,16],[94,5,94,7],[94,9,94,11],[94,13,94,16],[95,5,95,7],[95,9,95,11],[95,13,95,16],[92,5,92,7],[92,9,92,11],[92,13,92,16],[93,5,93,7],[93,9,93,11],[93,13,93,16],[98,5,98,7],[98,9,98,11],[98,13,98,16],[96,5,96,7],[96,9,96,11],[96,13,96,16],[97,5,97,7],[97,9,97,11],[97,13,97,16]]}
[]
[null,"D A F T A R   N I L A I"]
[]
[null,"MATA PELAJARAN",null,null,null,":","-",null,null,null,null,null,null,null,"↗"]
[null,"KELAS",null,null,null,":",{"$f":"UPPER(MN!D22)","v":"V B"}]
[null,"TAHUN PELAJARAN",null,null,null,":",{"$f":"MN!D18","v":"2019 - 2020"}]
[]
[]
[null,"No","No. Induk","NISN","Nama Siswa","NILAI",null,null,null,null,null,null,null,"JUMLAH"]
[null,null,null,null,null,"PG",null,null,1,"ESSAY",null,null,{"$f":"100%-I10","v":0}]
[null,1,null,null,{"$f":"SW!G10","v":"ABD. ROCHMAN NAJA FATLAN PRATAMA"},null,null,null,{"$f":"$I$10*F11","v":0},null,null,null,{"$f":"J11*$M$10","v":0},{"$f":"IFERROR(ROUND(AVERAGE(M11+I11),0),\"\")","v":0}]
[null,2,null,null,{"$f":"SW!G11","v":"ABDURRAHMAN FAQIH"},null,null,null,{"$f":"$I$10*F12","v":0},null,null,null,{"$f":"J12*$M$10","v":0},{"$f":"IFERROR(ROUND(AVERAGE(M12+I12),0),\"\")","v":0}]
[null,3,null,null,{"$f":"SW!G12","v":"ACHMAD FARROIHUN MUSHOBIRONILLAH"},null,null,null,0,null,null,null,0,0]
[null,4,null,null,{"$f":"SW!G13","v":"ACHMAD HASBI ASSIDDIQI"},null,null,null,0,null,null,null,0,0]
[null,5,null,null,{"$f":"SW!G14","v":"ACHMAD REZA AKRAM ALAUDDIN"},null,null,null,0,null,null,null,0,0]
[null,6,null,null,{"$f":"SW!G15","v":"ACHMAD YANI"},null,null,null,0,null,null,null,0,0]
[null,7,null,null,{"$f":"SW!G16","v":"AKHMAD RIDWAN"},null,null,null,0,null,null,null,0,0]
[null,8,null,null,{"$f":"SW!G17","v":"ANDREAN DWI YULIANO"},null,null,null,0,null,null,null,0,0]
[null,9,null,null,{"$f":"SW!G18","v":"ASFAN FAKHRI BARANI"},null,null,null,0,null,null,null,0,0]
[null,10,null,null,{"$f":"SW!G19","v":"DEVAN ADITYA SAPUTRA"},null,null,null,0,null,null,null,0,0]
[null,11,null,null,{"$f":"SW!G20","v":"FAHRUL AHMAD FAHREZA"},null,null,null,0,null,null,null,0,0]
[null,12,null,null,{"$f":"SW!G21","v":"FAUZIA AMELIA PUTRI"},null,null,null,0,null,null,null,0,0]
[null,13,null,null,{"$f":"SW!G22","v":"FAZA AZIFAH SALSABILA"},null,null,null,0,null,null,null,0,0]
[null,14,null,null,{"$f":"SW!G23","v":"HABIBIE NURUSSALAM"},null,null,null,0,null,null,null,0,0]
[null,15,null,null,{"$f":"SW!G24","v":"HIMATURROSYIDAH"},null,null,null,0,null,null,null,0,0]
[null,16,null,null,{"$f":"SW!G25","v":"IFKARINA NAILA SAUQYA"},null,null,null,0,null,null,null,0,0]
[null,17,null,null,{"$f":"SW!G26","v":"KEISA AYU SASKIYAH"},null,null,null,0,null,null,null,0,0]
[null,18,null,null,{"$f":"SW!G27","v":"MOCHAMMAD RENO FIRMANSYAH"},null,null,null,0,null,null,null,0,0]
[null,19,null,null,{"$f":"SW!G28","v":"MOHAMAD NUR KHAFID KHABIBULLOH"},null,null,null,0,null,null,null,0,0]
[null,20,null,null,{"$f":"SW!G29","v":"MOHAMMAD NAUFAL NAWWARUDDIN"},null,null,null,0,null,null,null,0,0]
[null,21,null,null,{"$f":"SW!G30","v":"MUCHAMAD PRIMA PAMBUDI"},null,null,null,0,null,null,null,0,0]
[null,22,null,null,{"$f":"SW!G31","v":"MUHAMMAD ALFAN FATHONI"},null,null,null,0,null,null,null,0,0]
[null,23,null,null,{"$f":"SW!G32","v":"MUHAMMAD AMINULLAH MAULUDANI"},null,null,null,0,null,null,null,0,0]
[null,24,null,null,{"$f":"SW!G33","v":"MUHAMMAD DAVIN  LEVANTINO"},null,null,null,0,null,null,null,0,0]
[null,25,null,null,{"$f":"SW!G34","v":"MUHAMMAD MAULANA PAHLEVY"},null,null,null,0,null,null,null,0,0]
[null,26,null,null,{"$f":"SW!G35","v":"RADITYA NIRWANSYAH"},null,null,null,0,null,null,null,0,0]
[null,27,null,null,{"$f":"SW!G36","v":"REVINA SRI UTARI"},null,null,null,0,null,null,null,0,0]
[null,28,null,null,{"$f":"SW!G37","v":"REYHAN DWI ANDIKA"},null,null,null,0,null,null,null,0,0]
[null,29,null,null,{"$f":"SW!G38","v":"RISKA LAURA TRIA OCTAVIA"},null,null,null,0,null,null,null,0,0]
[null,30,null,null,{"$f":"SW!G39","v":"ROHMADONA DWI SAFITRI"},null,null,null,0,null,null,null,0,0]
[null,31,null,null,{"$f":"SW!G40","v":"SALMAN ALFARIZI"},null,null,null,0,null,null,null,0,0]
[null,32,null,null,{"$f":"SW!G41","v":"TAUFIQ KURROHMAN"},null,null,null,0,null,null,null,0,0]
[null,33,null,null,{"$f":"SW!G42","v":0},null,null,null,0,null,null,null,0,0]
[null,34,null,null,{"$f":"SW!G43","v":0},null,null,null,0,null,null,null,0,0]
[null,35,null,null,{"$f":"SW!G44","v":0},null,null,null,0,null,null,null,0,0]
[null,36,null,null,{"$f":"SW!G45","v":0},null,null,null,0,null,null,null,0,0]
[null,37,null,null,{"$f":"SW!G46","v":0},null,null,null,0,null,null,null,0,0]
[null,38,null,null,{"$f":"SW!G47","v":0},null,null,null,0,null,null,null,0,0]
[null,39,null,null,{"$f":"SW!G48","v":0},null,null,null,0,null,null,null,0,0]
[null,40,null,null,{"$f":"SW!G49","v":0},null,null,null,0,null,null,null,0,0]
[null,41,null,null,{"$f":"SW!G50","v":0},null,null,null,0,null,null,null,0,0]
[null,42,null,null,{"$f":"SW!G51","v":0},null,null,null,0,null,null,null,0,0]
[null,43,null,null,{"$f":"SW!G52","v":0},null,null,null,0,null,null,null,0,0]
[null,44,null,null,{"$f":"SW!G53","v":0},null,null,null,0,null,null,null,0,0]
[null,45,null,null,{"$f":"SW!G54","v":0},null,null,null,0,null,null,null,0,0]
[null,46,null,null,{"$f":"SW!G55","v":0},null,null,null,0,null,null,null,0,0]
[null,47,null,null,{"$f":"SW!G56","v":0},null,null,null,0,null,null,null,0,0]
[null,48,null,null,{"$f":"SW!G57","v":0},null,null,null,0,null,null,null,0,0]
[null,49,null,null,{"$f":"SW!G58","v":0},null,null,null,0,null,null,null,0,0]
[null,50,null,null,{"$f":"SW!G59","v":0},null,null,null,0,null,null,null,0,0]
[null,51,null,null,{"$f":"SW!G60","v":0},null,null,null,0,null,null,null,0,0]
[null,52,null,null,{"$f":"SW!G61","v":0},null,null,null,0,null,null,null,0,0]
[null,53,null,null,{"$f":"SW!G62","v":0},null,null,null,0,null,null,null,0,0]
[null,54,null,null,{"$f":"SW!G63","v":0},null,null,null,0,null,null,null,0,0]
[null,55,null,null,{"$f":"SW!G64","v":0},null,null,null,0,null,null,null,0,0]
[null,56,null,null,{"$f":"SW!G65","v":0},null,null,null,0,null,null,null,0,0]
[null,57,null,null,{"$f":"SW!G66","v":0},null,null,null,0,null,null,null,0,0]
[null,58,null,null,{"$f":"SW!G67","v":0},null,null,null,0,null,null,null,0,0]
[null,59,null,null,{"$f":"SW!G68","v":0},null,null,null,0,null,null,null,0,0]
[null,60,null,null,{"$f":"SW!G69","v":0},null,null,null,0,null,null,null,0,0]
[null,61,null,null,{"$f":"SW!G70","v":0},null,null,null,0,null,null,null,0,0]
[null,62,null,null,{"$f":"SW!G71","v":0},null,null,null,0,null,null,null,0,0]
[null,63,null,null,{"$f":"SW!G72","v":0},null,null,null,0,null,null,null,0,0]
[null,64,null,null,{"$f":"SW!G73","v":0},null,null,null,0,null,null,null,0,0]
[null,65,null,null,{"$f":"SW!G74","v":0},null,null,null,0,null,null,null,0,0]
[null,66,null,null,{"$f":"SW!G75","v":0},null,null,null,{"$f":"$I$10*F76","v":0},null,null,null,{"$f":"J76*$M$10","v":0},{"$f":"IFERROR(ROUND(AVERAGE(M76+I76),0),\"\")","v":0}]
[null,67,null,null,{"$f":"SW!G76","v":0},null,null,null,0,null,null,null,0,0]
[null,68,null,null,{"$f":"SW!G77","v":0},null,null,null,0,null,null,null,0,0]
[null,69,null,null,{"$f":"SW!G78","v":0},null,null,null,0,null,null,null,0,0]
[null,70,null,null,{"$f":"SW!G79","v":0},null,null,null,0,null,null,null,0,0]
[null,71,null,null,{"$f":"SW!G80","v":0},null,null,null,0,null,null,null,0,0]
[null,72,null,null,{"$f":"SW!G81","v":0},null,null,null,0,null,null,null,0,0]
[null,73,null,null,{"$f":"SW!G82","v":0},null,null,null,0,null,null,null,0,0]
[null,74,null,null,{"$f":"SW!G83","v":0},null,null,null,0,null,null,null,0,0]
[null,75,null,null,{"$f":"SW!G84","v":0},null,null,null,0,null,null,null,0,0]
[null,76,null,null,{"$f":"SW!G85","v":0},null,null,null,0,null,null,null,0,0]
[null,77,null,null,{"$f":"SW!G86","v":0},null,null,null,0,null,null,null,0,0]
[null,78,null,null,{"$f":"SW!G87","v":0},null,null,null,0,null,null,null,0,0]
[null,79,null,null,{"$f":"SW!G88","v":0},null,null,null,0,null,null,null,0,0]
[null,80,null,null,{"$f":"SW!G89","v":0},null,null,null,0,null,null,null,0,0]
[null,81,null,null,{"$f":"SW!G90","v":0},null,null,null,0,null,null,null,0,0]
[null,82,null,null,{"$f":"SW!G91","v":0},null,null,null,0,null,null,null,0,0]
[null,83,null,null,{"$f":"SW!G92","v":0},null,null,null,0,null,null,null,0,0]
[null,84,null,null,{"$f":"SW!G93","v":0},null,null,null,0,null,null,null,0,0]
[null,85,null,null,{"$f":"SW!G94","v":0},null,null,null,0,null,null,null,0,0]
[null,86,null,null,{"$f":"SW!G95","v":0},null,null,null,0,null,null,null,0,0]
[null,87,null,null,{"$f":"SW!G96","v":0},null,null,null,0,null,null,null,0,0]
[null,88,null,null,{"$f":"SW!G97","v":0},null,null,null,0,null,null,null,0,0]
[null,89,null,null,{"$f":"SW!G98","v":0},null,null,null,0,null,null,null,0,0]

{"sheet":"MLK3","index":19,"n_rows":99,"n_cols":15,"rows_kept":99,"cut":false,"hidden":false,"merged":[[9,9,9,11],[10,5,10,7],[10,9,10,11],[10,13,10,16],[11,5,11,7],[11,9,11,11],[11,13,11,16],[1,1,1,16],[3,6,3,12],[3,14,5,15],[4,6,4,12],[5,6,5,12],[8,1,9,1],[8,4,9,4],[8,5,8,12],[8,13,9,16],[9,5,9,7],[14,5,14,7],[14,9,14,11],[14,13,14,16],[15,5,15,7],[15,9,15,11],[15,13,15,16],[12,5,12,7],[12,9,12,11],[12,13,12,16],[13,5,13,7],[13,9,13,11],[13,13,13,16],[18,5,18,7],[18,9,18,11],[18,13,18,16],[19,5,19,7],[19,9,19,11],[19,13,19,16],[16,5,16,7],[16,9,16,11],[16,13,16,16],[17,5,17,7],[17,9,17,11],[17,13,17,16],[22,5,22,7],[22,9,22,11],[22,13,22,16],[23,5,23,7],[23,9,23,11],[23,13,23,16],[20,5,20,7],[20,9,20,11],[20,13,20,16],[21,5,21,7],[21,9,21,11],[21,13,21,16],[26,5,26,7],[26,9,26,11],[26,13,26,16],[27,5,27,7],[27,9,27,11],[27,13,27,16],[24,5,24,7],[24,9,24,11],[24,13,24,16],[25,5,25,7],[25,9,25,11],[25,13,25,16],[30,5,30,7],[30,9,30,11],[30,13,30,16],[31,5,31,7],[31,9,31,11],[31,13,31,16],[28,5,28,7],[28,9,28,11],[28,13,28,16],[29,5,29,7],[29,9,29,11],[29,13,29,16],[34,5,34,7],[34,9,34,11],[34,13,34,16],[35,5,35,7],[35,9,35,11],[35,13,35,16],[32,5,32,7],[32,9,32,11],[32,13,32,16],[33,5,33,7],[33,9,33,11],[33,13,33,16],[38,5,38,7],[38,9,38,11],[38,13,38,16],[39,5,39,7],[39,9,39,11],[39,13,39,16],[36,5,36,7],[36,9,36,11],[36,13,36,16],[37,5,37,7],[37,9,37,11],[37,13,37,16],[42,5,42,7],[42,9,42,11],[42,13,42,16],[43,5,43,7],[43,9,43,11],[43,13,43,16],[40,5,40,7],[40,9,40,11],[40,13,40,16],[41,5,41,7],[41,9,41,11],[41,13,41,16],[46,5,46,7],[46,9,46,11],[46,13,46,16],[47,5,47,7],[47,9,47,11],[47,13,47,16],[44,5,44,7],[44,9,44,11],[44,13,44,16],[45,5,45,7],[45,9,45,11],[45,13,45,16],[50,5,50,7],[50,9,50,11],[50,13,50,16],[51,5,51,7],[51,9,51,11],[51,13,51,16],[48,5,48,7],[48,9,48,11],[48,13,48,16],[49,5,49,7],[49,9,49,11],[49,13,49,16],[54,5,54,7],[54,9,54,11],[54,13,54,16],[55,5,55,7],[55,9,55,11],[55,13,55,16],[52,5,52,7],[52,9,52,11],[52,13,52,16],[53,5,53,7],[53,9,53,11],[53,13,53,16],[58,5,58,7],[58,9,58,11],[58,13,58,16],[59,5,59,7],[59,9,59,11],[59,13,59,16],[56,5,56,7],[56,9,56,11],[56,13,56,16],[57,5,57,7],[57,9,57,11],[57,13,57,16],[62,5,62,7],[62,9,62,11],[62,13,62,16],[63,5,63,7],[63,9,63,11],[63,13,63,16],[60,5,60,7],[60,9,60,11],[60,13,60,16],[61,5,61,7],[61,9,61,11],[61,13,61,16],[66,5,66,7],[66,9,66,11],[66,13,66,16],[67,5,67,7],[67,9,67,11],[67,13,67,16],[64,5,64,7],[64,9,64,11],[64,13,64,16],[65,5,65,7],[65,9,65,11],[65,13,65,16],[70,5,70,7],[70,9,70,11],[70,13,70,16],[71,5,71,7],[71,9,71,11],[71,13,71,16],[68,5,68,7],[68,9,68,11],[68,13,68,16],[69,5,69,7],[69,9,69,11],[69,13,69,16],[74,5,74,7],[74,9,74,11],[74,13,74,16],[75,5,75,7],[75,9,75,11],[75,13,75,16],[72,5,72,7],[72,9,72,11],[72,13,72,16],[73,5,73,7],[73,9,73,11],[73,13,73,16],[78,5,78,7],[78,9,78,11],[78,13,78,16],[79,5,79,7],[79,9,79,11],[79,13,79,16],[76,5,76,7],[76,9,76,11],[76,13,76,16],[77,5,77,7],[77,9,77,11],[77,13,77,16],[82,5,82,7],[82,9,82,11],[82,13,82,16],[83,5,83,7],[83,9,83,11],[83,13,83,16],[80,5,80,7],[80,9,80,11],[80,13,80,16],[81,5,81,7],[81,9,81,11],[81,13,81,16],[86,5,86,7],[86,9,86,11],[86,13,86,16],[87,5,87,7],[87,9,87,11],[87,13,87,16],[84,5,84,7],[84,9,84,11],[84,13,84,16],[85,5,85,7],[85,9,85,11],[85,13,85,16],[90,5,90,7],[90,9,90,11],[90,13,90,16],[91,5,91,7],[91,9,91,11],[91,13,91,16],[88,5,88,7],[88,9,88,11],[88,13,88,16],[89,5,89,7],[89,9,89,11],[89,13,89,16],[94,5,94,7],[94,9,94,11],[94,13,94,16],[95,5,95,7],[95,9,95,11],[95,13,95,16],[92,5,92,7],[92,9,92,11],[92,13,92,16],[93,5,93,7],[93,9,93,11],[93,13,93,16],[98,5,98,7],[98,9,98,11],[98,13,98,16],[96,5,96,7],[96,9,96,11],[96,13,96,16],[97,5,97,7],[97,9,97,11],[97,13,97,16]]}
[]
[null,"D A F T A R   N I L A I"]
[]
[null,"MATA PELAJARAN",null,null,null,":","-",null,null,null,null,null,null,null,"↗"]
[null,"KELAS",null,null,null,":",{"$f":"UPPER(MN!D22)","v":"V B"}]
[null,"TAHUN PELAJARAN",null,null,null,":",{"$f":"MN!D18","v":"2019 - 2020"}]
[]
[]
[null,"No","No. Induk","NISN","Nama Siswa","NILAI",null,null,null,null,null,null,null,"JUMLAH"]
[null,null,null,null,null,"PG",null,null,1,"ESSAY",null,null,{"$f":"100%-I10","v":0}]
[null,1,null,null,{"$f":"SW!G10","v":"ABD. ROCHMAN NAJA FATLAN PRATAMA"},null,null,null,{"$f":"$I$10*F11","v":0},null,null,null,{"$f":"J11*$M$10","v":0},{"$f":"IFERROR(ROUND(AVERAGE(M11+I11),0),\"\")","v":0}]
[null,2,null,null,{"$f":"SW!G11","v":"ABDURRAHMAN FAQIH"},null,null,null,{"$f":"$I$10*F12","v":0},null,null,null,{"$f":"J12*$M$10","v":0},{"$f":"IFERROR(ROUND(AVERAGE(M12+I12),0),\"\")","v":0}]
[null,3,null,null,{"$f":"SW!G12","v":"ACHMAD FARROIHUN MUSHOBIRONILLAH"},null,null,null,0,null,null,null,0,0]
[null,4,null,null,{"$f":"SW!G13","v":"ACHMAD HASBI ASSIDDIQI"},null,null,null,0,null,null,null,0,0]
[null,5,null,null,{"$f":"SW!G14","v":"ACHMAD REZA AKRAM ALAUDDIN"},null,null,null,0,null,null,null,0,0]
[null,6,null,null,{"$f":"SW!G15","v":"ACHMAD YANI"},null,null,null,0,null,null,null,0,0]
[null,7,null,null,{"$f":"SW!G16","v":"AKHMAD RIDWAN"},null,null,null,0,null,null,null,0,0]
[null,8,null,null,{"$f":"SW!G17","v":"ANDREAN DWI YULIANO"},null,null,null,0,null,null,null,0,0]
[null,9,null,null,{"$f":"SW!G18","v":"ASFAN FAKHRI BARANI"},null,null,null,0,null,null,null,0,0]
[null,10,null,null,{"$f":"SW!G19","v":"DEVAN ADITYA SAPUTRA"},null,null,null,0,null,null,null,0,0]
[null,11,null,null,{"$f":"SW!G20","v":"FAHRUL AHMAD FAHREZA"},null,null,null,0,null,null,null,0,0]
[null,12,null,null,{"$f":"SW!G21","v":"FAUZIA AMELIA PUTRI"},null,null,null,0,null,null,null,0,0]
[null,13,null,null,{"$f":"SW!G22","v":"FAZA AZIFAH SALSABILA"},null,null,null,0,null,null,null,0,0]
[null,14,null,null,{"$f":"SW!G23","v":"HABIBIE NURUSSALAM"},null,null,null,0,null,null,null,0,0]
[null,15,null,null,{"$f":"SW!G24","v":"HIMATURROSYIDAH"},null,null,null,0,null,null,null,0,0]
[null,16,null,null,{"$f":"SW!G25","v":"IFKARINA NAILA SAUQYA"},null,null,null,0,null,null,null,0,0]
[null,17,null,null,{"$f":"SW!G26","v":"KEISA AYU SASKIYAH"},null,null,null,0,null,null,null,0,0]
[null,18,null,null,{"$f":"SW!G27","v":"MOCHAMMAD RENO FIRMANSYAH"},null,null,null,0,null,null,null,0,0]
[null,19,null,null,{"$f":"SW!G28","v":"MOHAMAD NUR KHAFID KHABIBULLOH"},null,null,null,0,null,null,null,0,0]
[null,20,null,null,{"$f":"SW!G29","v":"MOHAMMAD NAUFAL NAWWARUDDIN"},null,null,null,0,null,null,null,0,0]
[null,21,null,null,{"$f":"SW!G30","v":"MUCHAMAD PRIMA PAMBUDI"},null,null,null,0,null,null,null,0,0]
[null,22,null,null,{"$f":"SW!G31","v":"MUHAMMAD ALFAN FATHONI"},null,null,null,0,null,null,null,0,0]
[null,23,null,null,{"$f":"SW!G32","v":"MUHAMMAD AMINULLAH MAULUDANI"},null,null,null,0,null,null,null,0,0]
[null,24,null,null,{"$f":"SW!G33","v":"MUHAMMAD DAVIN  LEVANTINO"},null,null,null,0,null,null,null,0,0]
[null,25,null,null,{"$f":"SW!G34","v":"MUHAMMAD MAULANA PAHLEVY"},null,null,null,0,null,null,null,0,0]
[null,26,null,null,{"$f":"SW!G35","v":"RADITYA NIRWANSYAH"},null,null,null,0,null,null,null,0,0]
[null,27,null,null,{"$f":"SW!G36","v":"REVINA SRI UTARI"},null,null,null,0,null,null,null,0,0]
[null,28,null,null,{"$f":"SW!G37","v":"REYHAN DWI ANDIKA"},null,null,null,0,null,null,null,0,0]
[null,29,null,null,{"$f":"SW!G38","v":"RISKA LAURA TRIA OCTAVIA"},null,null,null,0,null,null,null,0,0]
[null,30,null,null,{"$f":"SW!G39","v":"ROHMADONA DWI SAFITRI"},null,null,null,0,null,null,null,0,0]
[null,31,null,null,{"$f":"SW!G40","v":"SALMAN ALFARIZI"},null,null,null,0,null,null,null,0,0]
[null,32,null,null,{"$f":"SW!G41","v":"TAUFIQ KURROHMAN"},null,null,null,0,null,null,null,0,0]
[null,33,null,null,{"$f":"SW!G42","v":0},null,null,null,0,null,null,null,0,0]
[null,34,null,null,{"$f":"SW!G43","v":0},null,null,null,0,null,null,null,0,0]
[null,35,null,null,{"$f":"SW!G44","v":0},null,null,null,0,null,null,null,0,0]
[null,36,null,null,{"$f":"SW!G45","v":0},null,null,null,0,null,null,null,0,0]
[null,37,null,null,{"$f":"SW!G46","v":0},null,null,null,0,null,null,null,0,0]
[null,38,null,null,{"$f":"SW!G47","v":0},null,null,null,0,null,null,null,0,0]
[null,39,null,null,{"$f":"SW!G48","v":0},null,null,null,0,null,null,null,0,0]
[null,40,null,null,{"$f":"SW!G49","v":0},null,null,null,0,null,null,null,0,0]
[null,41,null,null,{"$f":"SW!G50","v":0},null,null,null,0,null,null,null,0,0]
[null,42,null,null,{"$f":"SW!G51","v":0},null,null,null,0,null,null,null,0,0]
[null,43,null,null,{"$f":"SW!G52","v":0},null,null,null,0,null,null,null,0,0]
[null,44,null,null,{"$f":"SW!G53","v":0},null,null,null,0,null,null,null,0,0]
[null,45,null,null,{"$f":"SW!G54","v":0},null,null,null,0,null,null,null,0,0]
[null,46,null,null,{"$f":"SW!G55","v":0},null,null,null,0,null,null,null,0,0]
[null,47,null,null,{"$f":"SW!G56","v":0},null,null,null,0,null,null,null,0,0]
[null,48,null,null,{"$f":"SW!G57","v":0},null,null,null,0,null,null,null,0,0]
[null,49,null,null,{"$f":"SW!G58","v":0},null,null,null,0,null,null,null,0,0]
[null,50,null,null,{"$f":"SW!G59","v":0},null,null,null,0,null,null,null,0,0]
[null,51,null,null,{"$f":"SW!G60","v":0},null,null,null,0,null,null,null,0,0]
[null,52,null,null,{"$f":"SW!G61","v":0},null,null,null,0,null,null,null,0,0]
[null,53,null,null,{"$f":"SW!G62","v":0},null,null,null,0,null,null,null,0,0]
[null,54,null,null,{"$f":"SW!G63","v":0},null,null,null,0,null,null,null,0,0]
[null,55,null,null,{"$f":"SW!G64","v":0},null,null,null,0,null,null,null,0,0]
[null,56,null,null,{"$f":"SW!G65","v":0},null,null,null,0,null,null,null,0,0]
[null,57,null,null,{"$f":"SW!G66","v":0},null,null,null,0,null,null,null,0,0]
[null,58,null,null,{"$f":"SW!G67","v":0},null,null,null,0,null,null,null,0,0]
[null,59,null,null,{"$f":"SW!G68","v":0},null,null,null,0,null,null,null,0,0]
[null,60,null,null,{"$f":"SW!G69","v":0},null,null,null,0,null,null,null,0,0]
[null,61,null,null,{"$f":"SW!G70","v":0},null,null,null,0,null,null,null,0,0]
[null,62,null,null,{"$f":"SW!G71","v":0},null,null,null,0,null,null,null,0,0]
[null,63,null,null,{"$f":"SW!G72","v":0},null,null,null,0,null,null,null,0,0]
[null,64,null,null,{"$f":"SW!G73","v":0},null,null,null,0,null,null,null,0,0]
[null,65,null,null,{"$f":"SW!G74","v":0},null,null,null,0,null,null,null,0,0]
[null,66,null,null,{"$f":"SW!G75","v":0},null,null,null,{"$f":"$I$10*F76","v":0},null,null,null,{"$f":"J76*$M$10","v":0},{"$f":"IFERROR(ROUND(AVERAGE(M76+I76),0),\"\")","v":0}]
[null,67,null,null,{"$f":"SW!G76","v":0},null,null,null,0,null,null,null,0,0]
[null,68,null,null,{"$f":"SW!G77","v":0},null,null,null,0,null,null,null,0,0]
[null,69,null,null,{"$f":"SW!G78","v":0},null,null,null,0,null,null,null,0,0]
[null,70,null,null,{"$f":"SW!G79","v":0},null,null,null,0,null,null,null,0,0]
[null,71,null,null,{"$f":"SW!G80","v":0},null,null,null,0,null,null,null,0,0]
[null,72,null,null,{"$f":"SW!G81","v":0},null,null,null,0,null,null,null,0,0]
[null,73,null,null,{"$f":"SW!G82","v":0},null,null,null,0,null,null,null,0,0]
[null,74,null,null,{"$f":"SW!G83","v":0},null,null,null,0,null,null,null,0,0]
[null,75,null,null,{"$f":"SW!G84","v":0},null,null,null,0,null,null,null,0,0]
[null,76,null,null,{"$f":"SW!G85","v":0},null,null,null,0,null,null,null,0,0]
[null,77,null,null,{"$f":"SW!G86","v":0},null,null,null,0,null,null,null,0,0]
[null,78,null,null,{"$f":"SW!G87","v":0},null,null,null,0,null,null,null,0,0]
[null,79,null,null,{"$f":"SW!G88","v":0},null,null,null,0,null,null,null,0,0]
[null,80,null,null,{"$f":"SW!G89","v":0},null,null,null,0,null,null,null,0,0]
[null,81,null,null,{"$f":"SW!G90","v":0},null,null,null,0,null,null,null,0,0]
[null,82,null,null,{"$f":"SW!G91","v":0},null,null,null,0,null,null,null,0,0]
[null,83,null,null,{"$f":"SW!G92","v":0},null,null,null,0,null,null,null,0,0]
[null,84,null,null,{"$f":"SW!G93","v":0},null,null,null,0,null,null,null,0,0]
[null,85,null,null,{"$f":"SW!G94","v":0},null,null,null,0,null,null,null,0,0]
[null,86,null,null,{"$f":"SW!G95","v":0},null,null,null,0,null,null,null,0,0]
[null,87,null,null,{"$f":"SW!G96","v":0},null,null,null,0,null,null,null,0,0]
[null,88,null,null,{"$f":"SW!G97","v":0},null,null,null,0,null,null,null,0,0]
[null,89,null,null,{"$f":"SW!G98","v":0},null,null,null,0,null,null,null,0,0]

{"sheet":"REKAP","index":20,"n_rows":122,"n_cols":34,"rows_kept":122,"cut":false,"hidden":false,"merged":[[15,33,17,33],[2,6,2,22],[3,6,3,22],[4,6,4,22],[5,6,5,22],[2,2,4,4],[5,2,5,4],[2,24,4,27],[5,24,5,27],[10,30,12,31],[11,14,13,27],[12,6,12,11],[13,6,13,11],[15,2,17,2],[15,3,17,3],[15,4,17,4],[16,7,16,11],[8,2,8,27],[107,25,110,27],[107,2,107,6],[108,2,108,6],[109,2,109,6],[110,2,110,6],[16,12,16,18],[10,2,10,4],[11,2,11,4],[12,2,12,4],[13,2,13,4],[15,5,17,6],[15,7,15,24],[10,6,10,11],[11,6,11,11],[24,5,24,6],[25,5,25,6],[26,5,26,6],[27,5,27,6],[28,5,28,6],[29,5,29,6],[18,5,18,6],[19,5,19,6],[20,5,20,6],[21,5,21,6],[22,5,22,6],[23,5,23,6],[36,5,36,6],[37,5,37,6],[38,5,38,6],[39,5,39,6],[40,5,40,6],[41,5,41,6],[30,5,30,6],[31,5,31,6],[32,5,32,6],[33,5,33,6],[34,5,34,6],[35,5,35,6],[48,5,48,6],[49,5,49,6],[50,5,50,6],[51,5,51,6],[52,5,52,6],[53,5,53,6],[42,5,42,6],[43,5,43,6],[44,5,44,6],[45,5,45,6],[46,5,46,6],[47,5,47,6],[61,5,61,6],[62,5,62,6],[63,5,63,6],[64,5,64,6],[65,5,65,6],[54,5,54,6],[55,5,55,6],[56,5,56,6],[57,5,57,6],[58,5,58,6],[59,5,59,6],[105,5,105,6],[106,5,106,6],[16,19,16,24],[96,5,96,6],[97,5,97,6],[98,5,98,6],[99,5,99,6],[100,5,100,6],[101,5,101,6],[90,5,90,6],[91,5,91,6],[92,5,92,6],[93,5,93,6],[94,5,94,6],[95,5,95,6],[84,5,84,6],[85,5,85,6],[86,5,86,6],[87,5,87,6],[88,5,88,6],[89,5,89,6],[78,5,78,6],[79,5,79,6],[80,5,80,6],[112,22,112,25],[113,22,113,25],[15,25,17,25],[15,26,17,26],[15,27,17,27],[102,5,102,6],[103,5,103,6],[104,5,104,6],[81,5,81,6],[82,5,82,6],[83,5,83,6],[72,5,72,6],[73,5,73,6],[74,5,74,6],[75,5,75,6],[76,5,76,6],[77,5,77,6],[66,5,66,6],[67,5,67,6],[68,5,68,6],[69,5,69,6],[70,5,70,6],[71,5,71,6],[60,5,60,6]]}
[]
[]
[null,null,null,null,null,null,"LEMBAGA PENDIDIKAN MA'ARIF NU CABANG KABUPATEN LUMAJANG"]
[null,null,null,null,null,null,{"$f":"UPPER(\"madrasah ibtidaiyah swasta \"&MN!D6)","v":"MADRASAH IBTIDAIYAH SWASTA NURUL ISLAM LABRUK KIDUL"}]
[null,null,null,null,null,null,{"$f":"UPPER(\"TERAKREDITASI \"&MN!D30)","v":"TERAKREDITASI A"}]
[null,null,null,null,null,null,{"$f":"\"Jl. \"&MN!D16","v":"Jl. Raya Labruk Kidul No.65 Labruk Kidul"},null,null,null,null,null,null,null,null,null,null,null,null,null,null,null,null,null,"KEMENAG RI"]
[]
[]
[null,null,"R E K A P I T U L A S I   P E N I L A I A N   T E N G A H   S E M E S T E R"]
[]
[null,null,"Kelas",null,null,":",{"$f":"MN!D22","v":"V B"},null,null,null,null,null,null,null,null,null,null,null,null,null,null,null,null,null,null,null,null,null,null,null,"↗"]
[null,null,"Semester",null,null,":",{"$f":"MN!D20","v":"Ganjil"},null,null,null,null,null,null,null,{"$f":"MN!H22","v":"EXELLENT QURANIC SCHOOL"}]
[null,null,"Tahun Pelajaran",null,null,":",{"$f":"MN!D18","v":"2019 - 2020"}]
[null,null,"Satuan Pendidikan",null,null,":",{"$f":"UPPER(\"MIS. \"&MN!D6)","v":"MIS. NURUL ISLAM LABRUK KIDUL"}]
[]
[null,null,"No","No. Induk","NISN","Nama Siswa",null,"Mata pelajaran",null,null,null,null,null,null,null,null,null,null,null,null,null,null,null,null,null,"JUMLAH","RATA-RATA","RANGKING",null,null,"view",null,null,{"$f":"\"PESAN WALI KELAS / GURU KELAS \"&MN!D22","v":"PESAN WALI KELAS / GURU KELAS V B"}]
[null,null,null,null,null,null,null,"Agama",null,null,null,null,"Umum",null,null,null,null,null,null,"Muatan Lokal"]
[null,null,null,null,null,null,null,"Al-Qur'an Hadist","Aqidah akhlaq","Fiqih","SKI","Bhs. Arab","Bhs. Indonesia","Matematika","IPA","PPKn","IPS","SBDP","PJOK","Bhs. Daerah","Bhs. Inggris","Aswaja",{"$f":"PROPER(MN!J12)","v":"Nahwu / Shorof"},{"$f":"PROPER(MN!J14)","v":"-"},{"$f":"PROPER(MN!J16)","v":"-"},null,null,null,null,null,"cetak"]
[null,1,{"$f":"SW!C10","v":"1"},{"$f":"SW!D10","v":4604},{"$f":"SW!F10","v":0},{"$f":"SW!G10","v":"ABD. ROCHMAN NAJA FATLAN PRATAMA"},null,{"$f":"AH!N11","v":60},{"$f":"AA!N11","v":59},{"$f":"FQ!N11","v":81},{"$f":"SKI!N11","v":45},{"$f":"BA!N11","v":25},{"$f":"RTM!AP11","v":43},{"$f":"MTK!O11","v":23.5},{"$f":"RTM!AR11","v":43},{"$f":"RTM!AS11","v":43},{"$f":"RTM!AT11","v":43},{"$f":"RTM!AU11","v":43},{"$f":"PJOK!N11","v":47},{"$f":"BD!N11","v":32},{"$f":"BIG!N11","v":35},{"$f":"ASWJ!N11","v":60},{"$f":"'MLK1'!N11","v":10},{"$f":"'MLK2'!N11","v":0},{"$f":"'MLK3'!N11","v":0},{"$f":"SUM(H19:Y19)","v":692.5},{"$f":"AVERAGE(H19:W19)","v":43.28125},{"$f":"RANK(Z19,$Z$19:$Z$107)","v":23},null,null,{"$f":"IF(C19=\"\",0,\"cetak\")","v":"cetak"},null,null,"Pacu terus semangat belajarmu agar lebih meningkat prestasimu"]
[null,2,{"$f":"SW!C11","v":"2"},{"$f":"SW!D11","v":4432},{"$f":"SW!F11","v":"0094629929"},{"$f":"SW!G11","v":"ABDURRAHMAN FAQIH"},null,{"$f":"AH!N12","v":46},{"$f":"AA!N12","v":40},{"$f":"FQ!N12","v":39},{"$f":"SKI!N12","v":42},{"$f":"BA!N12","v":30},{"$f":"RTM!AP12","v":37},{"$f":"MTK!O12","v":30},{"$f":"RTM!AR12","v":37},{"$f":"RTM!AS12","v":37},{"$f":"RTM!AT12","v":37},{"$f":"RTM!AU12","v":37},{"$f":"PJOK!N12","v":39},{"$f":"BD!N12","v":43},{"$f":"BIG!N12","v":38},{"$f":"ASWJ!N12","v":54},{"$f":"'MLK1'!N12","v":30},{"$f":"'MLK2'!N12","v":0},{"$f":"'MLK3'!N12","v":0},{"$f":"SUM(H20:Y20)","v":616},{"$f":"AVERAGE(H20:W20)","v":38.5},{"$f":"RANK(Z20,$Z$19:$Z$107)","v":28},null,null,{"$f":"IF(C20=\"\",0,\"cetak\")","v":"cetak"},null,null,"Pacu terus semangat belajarmu agar lebih meningkat prestasimu"]
[null,3,{"$f":"SW!C12","v":"3"},{"$f":"SW!D12","v":4400},{"$f":"SW!F12","v":"0088902075"},{"$f":"SW!G12","v":"ACHMAD FARROIHUN MUSHOBIRONILLAH"},null,{"$f":"AH!N13","v":67},{"$f":"AA!N13","v":60},{"$f":"FQ!N13","v":78},{"$f":"SKI!N13","v":54},{"$f":"BA!N13","v":37},{"$f":"RTM!AP13","v":52},{"$f":"MTK!O13","v":20},{"$f":"RTM!AR13","v":52},{"$f":"RTM!AS13","v":52},{"$f":"RTM!AT13","v":52},{"$f":"RTM!AU13","v":52},{"$f":"PJOK!N13","v":44},{"$f":"BD!N13","v":51},{"$f":"BIG!N13","v":43},{"$f":"ASWJ!N13","v":58},{"$f":"'MLK1'!N13","v":30},{"$f":"'MLK2'!N13","v":0},{"$f":"'MLK3'!N13","v":0},802,{"$f":"AVERAGE(H21:W21)","v":50.125},16,null,null,"cetak",null,null,"Pacu terus semangat belajarmu agar lebih meningkat prestasimu"]
[null,4,{"$f":"SW!C13","v":"4"},{"$f":"SW!D13","v":4433},{"$f":"SW!F13","v":"0086573527"},{"$f":"SW!G13","v":"ACHMAD HASBI ASSIDDIQI"},null,{"$f":"AH!N14","v":36},{"$f":"AA!N14","v":55},{"$f":"FQ!N14","v":42},{"$f":"SKI!N14","v":45},{"$f":"BA!N14","v":32},{"$f":"RTM!AP14","v":40},{"$f":"MTK!O14","v":27},{"$f":"RTM!AR14","v":40},{"$f":"RTM!AS14","v":40},{"$f":"RTM!AT14","v":40},{"$f":"RTM!AU14","v":40},{"$f":"PJOK!N14","v":35},{"$f":"BD!N14","v":31},{"$f":"BIG!N14","v":25},{"$f":"ASWJ!N14","v":62},{"$f":"'MLK1'!N14","v":25},{"$f":"'MLK2'!N14","v":0},{"$f":"'MLK3'!N14","v":0},615,38.4375,29,null,null,"cetak",null,null,"Pacu terus semangat belajarmu agar lebih meningkat prestasimu"]
[null,5,{"$f":"SW!C14","v":"5"},{"$f":"SW!D14","v":4401},{"$f":"SW!F14","v":"0091876405"},{"$f":"SW!G14","v":"ACHMAD REZA AKRAM ALAUDDIN"},null,{"$f":"AH!N15","v":71},{"$f":"AA!N15","v":84},{"$f":"FQ!N15","v":74},{"$f":"SKI!N15","v":55},{"$f":"BA!N15","v":44},{"$f":"RTM!AP15","v":65},{"$f":"MTK!O15","v":26.5},{"$f":"RTM!AR15","v":65},{"$f":"RTM!AS15","v":65},{"$f":"RTM!AT15","v":65},{"$f":"RTM!AU15","v":65},{"$f":"PJOK!N15","v":54},{"$f":"BD!N15","v":48},{"$f":"BIG!N15","v":72},{"$f":"ASWJ!N15","v":64},{"$f":"'MLK1'!N15","v":40},{"$f":"'MLK2'!N15","v":0},{"$f":"'MLK3'!N15","v":0},957.5,59.84375,4,null,null,"cetak",null,null,"Tingkatkan prestasimu dan teruslah belajar"]
[null,6,{"$f":"SW!C15","v":"6"},{"$f":"SW!D15","v":4434},{"$f":"SW!F15","v":"0086607649"},{"$f":"SW!G15","v":"ACHMAD YANI"},null,{"$f":"AH!N16","v":57},{"$f":"AA!N16","v":60},{"$f":"FQ!N16","v":67},{"$f":"SKI!N16","v":54},{"$f":"BA!N16","v":32},{"$f":"RTM!AP16","v":53},{"$f":"MTK!O16","v":12.5},{"$f":"RTM!AR16","v":53},{"$f":"RTM!AS16","v":53},{"$f":"RTM!AT16","v":53},{"$f":"RTM!AU16","v":53},{"$f":"PJOK!N16","v":40},{"$f":"BD!N16","v":67},{"$f":"BIG!N16","v":45},{"$f":"ASWJ!N16","v":57},{"$f":"'MLK1'!N16","v":25},{"$f":"'MLK2'!N16","v":0},{"$f":"'MLK3'!N16","v":0},781.5,48.84375,17,null,null,"cetak",null,null,"Pacu terus semangat belajarmu agar lebih meningkat prestasimu"]
[null,7,{"$f":"SW!C16","v":"7"},{"$f":"SW!D16","v":4437},{"$f":"SW!F16","v":"0081576555"},{"$f":"SW!G16","v":"AKHMAD RIDWAN"},null,{"$f":"AH!N17","v":60},{"$f":"AA!N17","v":64},{"$f":"FQ!N17","v":74},{"$f":"SKI!N17","v":49},{"$f":"BA!N17","v":32},{"$f":"RTM!AP17","v":61},{"$f":"MTK!O17","v":26.5},{"$f":"RTM!AR17","v":61},{"$f":"RTM!AS17","v":61},{"$f":"RTM!AT17","v":61},{"$f":"RTM!AU17","v":61},{"$f":"PJOK!N17","v":52},{"$f":"BD!N17","v":58},{"$f":"BIG!N17","v":81},{"$f":"ASWJ!N17","v":64},{"$f":"'MLK1'!N17","v":20},{"$f":"'MLK2'!N17","v":0},{"$f":"'MLK3'!N17","v":0},885.5,55.34375,8,null,null,"cetak",null,null,"Tingkatkan prestasimu dan teruslah belajar"]
[null,8,{"$f":"SW!C17","v":"8"},{"$f":"SW!D17","v":4439},{"$f":"SW!F17","v":"0089018808"},{"$f":"SW!G17","v":"ANDREAN DWI YULIANO"},null,{"$f":"AH!N18","v":46},{"$f":"AA!N18","v":72},{"$f":"FQ!N18","v":64},{"$f":"SKI!N18","v":44},{"$f":"BA!N18","v":24},{"$f":"RTM!AP18","v":45},{"$f":"MTK!O18","v":30},{"$f":"RTM!AR18","v":45},{"$f":"RTM!AS18","v":45},{"$f":"RTM!AT18","v":45},{"$f":"RTM!AU18","v":45},{"$f":"PJOK!N18","v":34},{"$f":"BD!N18","v":64},{"$f":"BIG!N18","v":10},{"$f":"ASWJ!N18","v":46},{"$f":"'MLK1'!N18","v":10},{"$f":"'MLK2'!N18","v":0},{"$f":"'MLK3'!N18","v":0},669,41.8125,25,null,null,"cetak",null,null,"Pacu terus semangat belajarmu agar lebih meningkat prestasimu"]
[null,9,{"$f":"SW!C18","v":"9"},{"$f":"SW!D18","v":4405},{"$f":"SW!F18","v":"0087514073"},{"$f":"SW!G18","v":"ASFAN FAKHRI BARANI"},null,{"$f":"AH!N19","v":59},{"$f":"AA!N19","v":75},{"$f":"FQ!N19","v":79},{"$f":"SKI!N19","v":57},{"$f":"BA!N19","v":54},{"$f":"RTM!AP19","v":57},{"$f":"MTK!O19","v":22.5},{"$f":"RTM!AR19","v":57},{"$f":"RTM!AS19","v":57},{"$f":"RTM!AT19","v":57},{"$f":"RTM!AU19","v":57},{"$f":"PJOK!N19","v":64},{"$f":"BD!N19","v":59},{"$f":"BIG!N19","v":55},{"$f":"ASWJ!N19","v":56},{"$f":"'MLK1'!N19","v":60},{"$f":"'MLK2'!N19","v":0},{"$f":"'MLK3'!N19","v":0},925.5,57.84375,7,null,null,"cetak",null,null,"Tingkatkan prestasimu dan teruslah belajar"]
[null,10,{"$f":"SW!C19","v":"10"},{"$f":"SW!D19","v":4406},{"$f":"SW!F19","v":"0081007144"},{"$f":"SW!G19","v":"DEVAN ADITYA SAPUTRA"},null,{"$f":"AH!N20","v":58},{"$f":"AA!N20","v":57},{"$f":"FQ!N20","v":69},{"$f":"SKI!N20","v":45},{"$f":"BA!N20","v":22},{"$f":"RTM!AP20","v":57},{"$f":"MTK!O20","v":26.5},{"$f":"RTM!AR20","v":57},{"$f":"RTM!AS20","v":57},{"$f":"RTM!AT20","v":57},{"$f":"RTM!AU20","v":57},{"$f":"PJOK!N20","v":40},{"$f":"BD!N20","v":52},{"$f":"BIG!N20","v":84},{"$f":"ASWJ!N20","v":56},{"$f":"'MLK1'!N20","v":20},{"$f":"'MLK2'!N20","v":0},{"$f":"'MLK3'!N20","v":0},814.5,50.90625,14,null,null,"cetak",null,null,"Pacu terus semangat belajarmu agar lebih meningkat prestasimu"]
[null,11,{"$f":"SW!C20","v":"11"},{"$f":"SW!D20","v":4409},{"$f":"SW!F20","v":"0083758044"},{"$f":"SW!G20","v":"FAHRUL AHMAD FAHREZA"},null,{"$f":"AH!N21","v":79},{"$f":"AA!N21","v":77},{"$f":"FQ!N21","v":67},{"$f":"SKI!N21","v":52},{"$f":"BA!N21","v":34},{"$f":"RTM!AP21","v":60},{"$f":"MTK!O21","v":22.5},{"$f":"RTM!AR21","v":60},{"$f":"RTM!AS21","v":60},{"$f":"RTM!AT21","v":60},{"$f":"RTM!AU21","v":60},{"$f":"PJOK!N21","v":49},{"$f":"BD!N21","v":64},{"$f":"BIG!N21","v":60},{"$f":"ASWJ!N21","v":60},{"$f":"'MLK1'!N21","v":20},{"$f":"'MLK2'!N21","v":0},{"$f":"'MLK3'!N21","v":0},884.5,55.28125,9,null,null,"cetak",null,null,"Tingkatkan prestasimu dan teruslah belajar"]
[null,12,{"$f":"SW!C21","v":"12"},{"$f":"SW!D21","v":4442},{"$f":"SW!F21","v":"0094471054"},{"$f":"SW!G21","v":"FAUZIA AMELIA PUTRI"},null,{"$f":"AH!N22","v":72},{"$f":"AA!N22","v":60},{"$f":"FQ!N22","v":84},{"$f":"SKI!N22","v":64},{"$f":"BA!N22","v":60},{"$f":"RTM!AP22","v":59},{"$f":"MTK!O22","v":30},{"$f":"RTM!AR22","v":59},{"$f":"RTM!AS22","v":59},{"$f":"RTM!AT22","v":59},{"$f":"RTM!AU22","v":59},{"$f":"PJOK!N22","v":55},{"$f":"BD!N22","v":68},{"$f":"BIG!N22","v":61},{"$f":"ASWJ!N22","v":62},{"$f":"'MLK1'!N22","v":40},{"$f":"'MLK2'!N22","v":0},{"$f":"'MLK3'!N22","v":0},951,59.4375,5,null,null,"cetak",null,null,"Tingkatkan prestasimu dan teruslah belajar"]
[null,13,{"$f":"SW!C22","v":"13"},{"$f":"SW!D22","v":4411},{"$f":"SW!F22","v":"0097068634"},{"$f":"SW!G22","v":"FAZA AZIFAH SALSABILA"},null,{"$f":"AH!N23","v":69},{"$f":"AA!N23","v":55},{"$f":"FQ!N23","v":65},{"$f":"SKI!N23","v":50},{"$f":"BA!N23","v":50},{"$f":"RTM!AP23","v":51},{"$f":"MTK!O23","v":20},{"$f":"RTM!AR23","v":51},{"$f":"RTM!AS23","v":51},{"$f":"RTM!AT23","v":51},{"$f":"RTM!AU23","v":51},{"$f":"PJOK!N23","v":47},{"$f":"BD!N23","v":51},{"$f":"BIG!N23","v":53},{"$f":"ASWJ!N23","v":54},{"$f":"'MLK1'!N23","v":40},{"$f":"'MLK2'!N23","v":0},{"$f":"'MLK3'!N23","v":0},809,50.5625,15,null,null,"cetak",null,null,"Pacu terus semangat belajarmu agar lebih meningkat prestasimu"]
[null,14,{"$f":"SW!C23","v":"14"},{"$f":"SW!D23","v":4443},{"$f":"SW!F23","v":"0082570064"},{"$f":"SW!G23","v":"HABIBIE NURUSSALAM"},null,{"$f":"AH!N24","v":78},{"$f":"AA!N24","v":69},{"$f":"FQ!N24","v":67},{"$f":"SKI!N24","v":55},{"$f":"BA!N24","v":30},{"$f":"RTM!AP24","v":56},{"$f":"MTK!O24","v":32.5},{"$f":"RTM!AR24","v":56},{"$f":"RTM!AS24","v":56},{"$f":"RTM!AT24","v":56},{"$f":"RTM!AU24","v":56},{"$f":"PJOK!N24","v":60},{"$f":"BD!N24","v":43},{"$f":"BIG!N24","v":77},{"$f":"ASWJ!N24","v":57},{"$f":"'MLK1'!N24","v":15},{"$f":"'MLK2'!N24","v":0},{"$f":"'MLK3'!N24","v":0},863.5,53.96875,11,null,null,"cetak",null,null,"Pacu terus semangat belajarmu agar lebih meningkat prestasimu"]
[null,15,{"$f":"SW!C24","v":"15"},{"$f":"SW!D24","v":4444},{"$f":"SW!F24","v":"0084229361"},{"$f":"SW!G24","v":"HIMATURROSYIDAH"},null,{"$f":"AH!N25","v":72},{"$f":"AA!N25","v":70},{"$f":"FQ!N25","v":74},{"$f":"SKI!N25","v":65},{"$f":"BA!N25","v":54},{"$f":"RTM!AP25","v":59},{"$f":"MTK!O25","v":20},{"$f":"RTM!AR25","v":59},{"$f":"RTM!AS25","v":59},{"$f":"RTM!AT25","v":59},{"$f":"RTM!AU25","v":59},{"$f":"PJOK!N25","v":52},{"$f":"BD!N25","v":68},{"$f":"BIG!N25","v":50},{"$f":"ASWJ!N25","v":64},{"$f":"'MLK1'!N25","v":65},{"$f":"'MLK2'!N25","v":0},{"$f":"'MLK3'!N25","v":0},949,59.3125,6,null,null,"cetak",null,null,"Tingkatkan prestasimu dan teruslah belajar"]
[null,16,{"$f":"SW!C25","v":"16"},{"$f":"SW!D25","v":4413},{"$f":"SW!F25","v":"0095974067"},{"$f":"SW!G25","v":"IFKARINA NAILA SAUQYA"},null,{"$f":"AH!N26","v":84},{"$f":"AA!N26","v":87},{"$f":"FQ!N26","v":76},{"$f":"SKI!N26","v":65},{"$f":"BA!N26","v":45},{"$f":"RTM!AP26","v":67},{"$f":"MTK!O26","v":36.5},{"$f":"RTM!AR26","v":67},{"$f":"RTM!AS26","v":67},{"$f":"RTM!AT26","v":67},{"$f":"RTM!AU26","v":67},{"$f":"PJOK!N26","v":47},{"$f":"BD!N26","v":72},{"$f":"BIG!N26","v":62},{"$f":"ASWJ!N26","v":77},{"$f":"'MLK1'!N26","v":65},{"$f":"'MLK2'!N26","v":0},{"$f":"'MLK3'!N26","v":0},1051.5,65.71875,1,null,null,"cetak",null,null,"pertahankan prestasimu dan teruslah belajar"]
[null,17,{"$f":"SW!C26","v":"17"},{"$f":"SW!D26","v":4446},{"$f":"SW!F26","v":"0091718649"},{"$f":"SW!G26","v":"KEISA AYU SASKIYAH"},null,{"$f":"AH!N27","v":69},{"$f":"AA!N27","v":50},{"$f":"FQ!N27","v":69},{"$f":"SKI!N27","v":64},{"$f":"BA!N27","v":47},{"$f":"RTM!AP27","v":47},{"$f":"MTK!O27","v":20},{"$f":"RTM!AR27","v":47},{"$f":"RTM!AS27","v":47},{"$f":"RTM!AT27","v":47},{"$f":"RTM!AU27","v":47},{"$f":"PJOK!N27","v":45},{"$f":"BD!N27","v":68},{"$f":"BIG!N27","v":53},{"$f":"ASWJ!N27","v":59},{"$f":"'MLK1'!N27","v":65},{"$f":"'MLK2'!N27","v":0},{"$f":"'MLK3'!N27","v":0},844,52.75,12,null,null,"cetak",null,null,"Pacu terus semangat belajarmu agar lebih meningkat prestasimu"]
[null,18,{"$f":"SW!C27","v":"18"},{"$f":"SW!D27","v":4448},{"$f":"SW!F27","v":"0088340300"},{"$f":"SW!G27","v":"MOCHAMMAD RENO FIRMANSYAH"},null,{"$f":"AH!N28","v":32},{"$f":"AA!N28","v":35},{"$f":"FQ!N28","v":29},{"$f":"SKI!N28","v":40},{"$f":"BA!N28","v":32},{"$f":"RTM!AP28","v":34},{"$f":"MTK!O28","v":22.5},{"$f":"RTM!AR28","v":34},{"$f":"RTM!AS28","v":34},{"$f":"RTM!AT28","v":34},{"$f":"RTM!AU28","v":34},{"$f":"PJOK!N28","v":39},{"$f":"BD!N28","v":47},{"$f":"BIG!N28","v":20},{"$f":"ASWJ!N28","v":46},{"$f":"'MLK1'!N28","v":20},{"$f":"'MLK2'!N28","v":0},{"$f":"'MLK3'!N28","v":0},532.5,33.28125,32,null,null,"cetak",null,null,"Pacu terus semangat belajarmu agar lebih meningkat prestasimu"]
[null,19,{"$f":"SW!C28","v":"19"},{"$f":"SW!D28","v":4416},{"$f":"SW!F28","v":"0081395793"},{"$f":"SW!G28","v":"MOHAMAD NUR KHAFID KHABIBULLOH"},null,{"$f":"AH!N29","v":69},{"$f":"AA!N29","v":52},{"$f":"FQ!N29","v":65},{"$f":"SKI!N29","v":57},{"$f":"BA!N29","v":40},{"$f":"RTM!AP29","v":57},{"$f":"MTK!O29","v":40},{"$f":"RTM!AR29","v":57},{"$f":"RTM!AS29","v":57},{"$f":"RTM!AT29","v":57},{"$f":"RTM!AU29","v":57},{"$f":"PJOK!N29","v":59},{"$f":"BD!N29","v":62},{"$f":"BIG!N29","v":38},{"$f":"ASWJ!N29","v":65},{"$f":"'MLK1'!N29","v":50},{"$f":"'MLK2'!N29","v":0},{"$f":"'MLK3'!N29","v":0},882,55.125,10,null,null,"cetak",null,null,"Tingkatkan prestasimu dan teruslah belajar"]
[null,20,{"$f":"SW!C29","v":"20"},{"$f":"SW!D29","v":4449},{"$f":"SW!F29","v":"0096141985"},{"$f":"SW!G29","v":"MOHAMMAD NAUFAL NAWWARUDDIN"},null,{"$f":"AH!N30","v":39},{"$f":"AA!N30","v":45},{"$f":"FQ!N30","v":39},{"$f":"SKI!N30","v":42},{"$f":"BA!N30","v":29},{"$f":"RTM!AP30","v":39},{"$f":"MTK!O30","v":30},{"$f":"RTM!AR30","v":39},{"$f":"RTM!AS30","v":39},{"$f":"RTM!AT30","v":39},{"$f":"RTM!AU30","v":39},{"$f":"PJOK!N30","v":35},{"$f":"BD!N30","v":37},{"$f":"BIG!N30","v":25},{"$f":"ASWJ!N30","v":42},{"$f":"'MLK1'!N30","v":20},{"$f":"'MLK2'!N30","v":0},{"$f":"'MLK3'!N30","v":0},578,36.125,31,null,null,"cetak",null,null,"Pacu terus semangat belajarmu agar lebih meningkat prestasimu"]
[null,21,{"$f":"SW!C30","v":"21"},null,null,{"$f":"SW!G30","v":"MUCHAMAD PRIMA PAMBUDI"},null,{"$f":"AH!N31","v":76},{"$f":"AA!N31","v":54},{"$f":"FQ!N31","v":60},{"$f":"SKI!N31","v":52},{"$f":"BA!N31","v":32},{"$f":"RTM!AP31","v":49},{"$f":"MTK!O31","v":22.5},{"$f":"RTM!AR31","v":49},{"$f":"RTM!AS31","v":49},{"$f":"RTM!AT31","v":49},{"$f":"RTM!AU31","v":49},{"$f":"PJOK!N31","v":47},{"$f":"BD!N31","v":52},{"$f":"BIG!N31","v":36},{"$f":"ASWJ!N31","v":44},{"$f":"'MLK1'!N31","v":25},{"$f":"'MLK2'!N31","v":0},{"$f":"'MLK3'!N31","v":0},745.5,46.59375,20,null,null,"cetak",null,null,"Pacu terus semangat belajarmu agar lebih meningkat prestasimu"]
[null,22,{"$f":"SW!C31","v":"22"},null,null,{"$f":"SW!G31","v":"MUHAMMAD ALFAN FATHONI"},null,{"$f":"AH!N32","v":58},{"$f":"AA!N32","v":42},{"$f":"FQ!N32","v":46},{"$f":"SKI!N32","v":47},{"$f":"BA!N32","v":42},{"$f":"RTM!AP32","v":47},{"$f":"MTK!O32","v":20},{"$f":"RTM!AR32","v":47},{"$f":"RTM!AS32","v":47},{"$f":"RTM!AT32","v":47},{"$f":"RTM!AU32","v":47},{"$f":"PJOK!N32","v":47},{"$f":"BD!N32","v":58},{"$f":"BIG!N32","v":71},{"$f":"ASWJ!N32","v":52},{"$f":"'MLK1'!N32","v":30},{"$f":"'MLK2'!N32","v":0},{"$f":"'MLK3'!N32","v":0},748,46.75,19,null,null,"cetak",null,null,"Pacu terus semangat belajarmu agar lebih meningkat prestasimu"]
[null,23,{"$f":"SW!C32","v":"23"},null,null,{"$f":"SW!G32","v":"MUHAMMAD AMINULLAH MAULUDANI"},null,{"$f":"AH!N33","v":35},{"$f":"AA!N33","v":39},{"$f":"FQ!N33","v":57},{"$f":"SKI!N33","v":42},{"$f":"BA!N33","v":35},{"$f":"RTM!AP33","v":37},{"$f":"MTK!O33","v":22.5},{"$f":"RTM!AR33","v":37},{"$f":"RTM!AS33","v":37},{"$f":"RTM!AT33","v":37},{"$f":"RTM!AU33","v":37},{"$f":"PJOK!N33","v":49},{"$f":"BD!N33","v":30},{"$f":"BIG!N33","v":30},{"$f":"ASWJ!N33","v":44},{"$f":"'MLK1'!N33","v":20},{"$f":"'MLK2'!N33","v":0},{"$f":"'MLK3'!N33","v":0},588.5,36.78125,30,null,null,"cetak",null,null,"Pacu terus semangat belajarmu agar lebih meningkat prestasimu"]
[null,24,{"$f":"SW!C33","v":"24"},null,null,{"$f":"SW!G33","v":"MUHAMMAD DAVIN  LEVANTINO"},null,{"$f":"AH!N34","v":68},{"$f":"AA!N34","v":64},{"$f":"FQ!N34","v":78},{"$f":"SKI!N34","v":52},{"$f":"BA!N34","v":35},{"$f":"RTM!AP34","v":50},{"$f":"MTK!O34","v":33.5},{"$f":"RTM!AR34","v":50},{"$f":"RTM!AS34","v":50},{"$f":"RTM!AT34","v":50},{"$f":"RTM!AU34","v":50},{"$f":"PJOK!N34","v":49},{"$f":"BD!N34","v":50},{"$f":"BIG!N34","v":74},{"$f":"ASWJ!N34","v":58},{"$f":"'MLK1'!N34","v":30},{"$f":"'MLK2'!N34","v":0},{"$f":"'MLK3'!N34","v":0},841.5,52.59375,13,null,null,"cetak",null,null,"Pacu terus semangat belajarmu agar lebih meningkat prestasimu"]
[null,25,{"$f":"SW!C34","v":"25"},null,null,{"$f":"SW!G34","v":"MUHAMMAD MAULANA PAHLEVY"},null,{"$f":"AH!N35","v":64},{"$f":"AA!N35","v":55},{"$f":"FQ!N35","v":64},{"$f":"SKI!N35","v":39},{"$f":"BA!N35","v":29},{"$f":"RTM!AP35","v":48},{"$f":"MTK!O35","v":40},{"$f":"RTM!AR35","v":48},{"$f":"RTM!AS35","v":48},{"$f":"RTM!AT35","v":48},{"$f":"RTM!AU35","v":48},{"$f":"PJOK!N35","v":45},{"$f":"BD!N35","v":48},{"$f":"BIG!N35","v":72},{"$f":"ASWJ!N35","v":48},{"$f":"'MLK1'!N35","v":20},{"$f":"'MLK2'!N35","v":0},{"$f":"'MLK3'!N35","v":0},764,47.75,18,null,null,"cetak",null,null,"Pacu terus semangat belajarmu agar lebih meningkat prestasimu"]
[null,26,{"$f":"SW!C35","v":"26"},null,null,{"$f":"SW!G35","v":"RADITYA NIRWANSYAH"},null,{"$f":"AH!N36","v":57},{"$f":"AA!N36","v":37},{"$f":"FQ!N36","v":39},{"$f":"SKI!N36","v":37},{"$f":"BA!N36","v":32},{"$f":"RTM!AP36","v":38},{"$f":"MTK!O36","v":26.5},{"$f":"RTM!AR36","v":38},{"$f":"RTM!AS36","v":38},{"$f":"RTM!AT36","v":38},{"$f":"RTM!AU36","v":38},{"$f":"PJOK!N36","v":45},{"$f":"BD!N36","v":40},{"$f":"BIG!N36","v":45},{"$f":"ASWJ!N36","v":52},{"$f":"'MLK1'!N36","v":20},{"$f":"'MLK2'!N36","v":0},{"$f":"'MLK3'!N36","v":0},620.5,38.78125,26,null,null,"cetak",null,null,"Pacu terus semangat belajarmu agar lebih meningkat prestasimu"]
[null,27,{"$f":"SW!C36","v":"27"},null,null,{"$f":"SW!G36","v":"REVINA SRI UTARI"},null,{"$f":"AH!N37","v":63},{"$f":"AA!N37","v":45},{"$f":"FQ!N37","v":51},{"$f":"SKI!N37","v":52},{"$f":"BA!N37","v":29},{"$f":"RTM!AP37","v":47},{"$f":"MTK!O37","v":23.5},{"$f":"RTM!AR37","v":47},{"$f":"RTM!AS37","v":47},{"$f":"RTM!AT37","v":47},{"$f":"RTM!AU37","v":47},{"$f":"PJOK!N37","v":40},{"$f":"BD!N37","v":47},{"$f":"BIG!N37","v":53},{"$f":"ASWJ!N37","v":54},{"$f":"'MLK1'!N37","v":25},{"$f":"'MLK2'!N37","v":0},{"$f":"'MLK3'!N37","v":0},717.5,44.84375,21,null,null,"cetak",null,null,"Pacu terus semangat belajarmu agar lebih meningkat prestasimu"]
[null,28,{"$f":"SW!C37","v":"28"},null,null,{"$f":"SW!G37","v":"REYHAN DWI ANDIKA"},null,{"$f":"AH!N38","v":59},{"$f":"AA!N38","v":45},{"$f":"FQ!N38","v":49},{"$f":"SKI!N38","v":49},{"$f":"BA!N38","v":17},{"$f":"RTM!AP38","v":39},{"$f":"MTK!O38","v":22.5},{"$f":"RTM!AR38","v":39},{"$f":"RTM!AS38","v":39},{"$f":"RTM!AT38","v":39},{"$f":"RTM!AU38","v":39},{"$f":"PJOK!N38","v":45},{"$f":"BD!N38","v":49},{"$f":"BIG!N38","v":30},{"$f":"ASWJ!N38","v":48},{"$f":"'MLK1'!N38","v":10},{"$f":"'MLK2'!N38","v":0},{"$f":"'MLK3'!N38","v":0},618.5,38.65625,27,null,null,"cetak",null,null,"Pacu terus semangat belajarmu agar lebih meningkat prestasimu"]
[null,29,{"$f":"SW!C38","v":"29"},null,null,{"$f":"SW!G38","v":"RISKA LAURA TRIA OCTAVIA"},null,{"$f":"AH!N39","v":75},{"$f":"AA!N39","v":82},{"$f":"FQ!N39","v":69},{"$f":"SKI!N39","v":52},{"$f":"BA!N39","v":35},{"$f":"RTM!AP39","v":65},{"$f":"MTK!O39","v":30},{"$f":"RTM!AR39","v":65},{"$f":"RTM!AS39","v":65},{"$f":"RTM!AT39","v":65},{"$f":"RTM!AU39","v":65},{"$f":"PJOK!N39","v":52},{"$f":"BD!N39","v":76},{"$f":"BIG!N39","v":75},{"$f":"ASWJ!N39","v":66},{"$f":"'MLK1'!N39","v":65},{"$f":"'MLK2'!N39","v":0},{"$f":"'MLK3'!N39","v":0},1002,62.625,2,null,null,"cetak",null,null,"Tingkatkan prestasimu dan teruslah belajar"]
[null,30,{"$f":"SW!C39","v":"30"},null,null,{"$f":"SW!G39","v":"ROHMADONA DWI SAFITRI"},null,{"$f":"AH!N40","v":82},{"$f":"AA!N40","v":94},{"$f":"FQ!N40","v":78},{"$f":"SKI!N40","v":57},{"$f":"BA!N40","v":39},{"$f":"RTM!AP40","v":67},{"$f":"MTK!O40","v":30},{"$f":"RTM!AR40","v":67},{"$f":"RTM!AS40","v":67},{"$f":"RTM!AT40","v":67},{"$f":"RTM!AU40","v":67},{"$f":"PJOK!N40","v":65},{"$f":"BD!N40","v":44},{"$f":"BIG!N40","v":60},{"$f":"ASWJ!N40","v":62},{"$f":"'MLK1'!N40","v":30},{"$f":"'MLK2'!N40","v":0},{"$f":"'MLK3'!N40","v":0},976,61,3,null,null,"cetak",null,null,"Tingkatkan prestasimu dan teruslah belajar"]
[null,31,{"$f":"SW!C40","v":"31"},null,null,{"$f":"SW!G40","v":"SALMAN ALFARIZI"},null,{"$f":"AH!N41","v":43},{"$f":"AA!N41","v":35},{"$f":"FQ!N41","v":58},{"$f":"SKI!N41","v":39},{"$f":"BA!N41","v":40},{"$f":"RTM!AP41","v":42},{"$f":"MTK!O41","v":22.5},{"$f":"RTM!AR41","v":42},{"$f":"RTM!AS41","v":42},{"$f":"RTM!AT41","v":42},{"$f":"RTM!AU41","v":42},{"$f":"PJOK!N41","v":47},{"$f":"BD!N41","v":55},{"$f":"BIG!N41","v":35},{"$f":"ASWJ!N41","v":60},{"$f":"'MLK1'!N41","v":25},{"$f":"'MLK2'!N41","v":0},{"$f":"'MLK3'!N41","v":0},669.5,41.84375,24,null,null,"cetak",null,null,"Pacu terus semangat belajarmu agar lebih meningkat prestasimu"]
[null,32,{"$f":"SW!C41","v":"32"},null,null,{"$f":"SW!G41","v":"TAUFIQ KURROHMAN"},null,{"$f":"AH!N42","v":47},{"$f":"AA!N42","v":35},{"$f":"FQ!N42","v":64},{"$f":"SKI!N42","v":42},{"$f":"BA!N42","v":47},{"$f":"RTM!AP42","v":48},{"$f":"MTK!O42","v":17},{"$f":"RTM!AR42","v":48},{"$f":"RTM!AS42","v":48},{"$f":"RTM!AT42","v":48},{"$f":"RTM!AU42","v":48},{"$f":"PJOK!N42","v":47},{"$f":"BD!N42","v":45},{"$f":"BIG!N42","v":42},{"$f":"ASWJ!N42","v":52},{"$f":"'MLK1'!N42","v":25},{"$f":"'MLK2'!N42","v":0},{"$f":"'MLK3'!N42","v":0},703,43.9375,22,null,null,"cetak",null,null,"Pacu terus semangat belajarmu agar lebih meningkat prestasimu"]
[null,33,{"$f":"SW!C42","v":""},null,null,{"$f":"SW!G42","v":0},null,{"$f":"AH!N43","v":0},{"$f":"AA!N43","v":0},{"$f":"FQ!N43","v":0},{"$f":"SKI!N43","v":0},{"$f":"BA!N43","v":0},{"$f":"RTM!AP43","v":""},{"$f":"MTK!O43","v":""},{"$f":"RTM!AR43","v":""},{"$f":"RTM!AS43","v":""},{"$f":"RTM!AT43","v":""},{"$f":"RTM!AU43","v":""},{"$f":"PJOK!N43","v":0},{"$f":"BD!N43","v":0},{"$f":"BIG!N43","v":0},{"$f":"ASWJ!N43","v":0},{"$f":"'MLK1'!N43","v":0},{"$f":"'MLK2'!N43","v":0},{"$f":"'MLK3'!N43","v":0},0,{"$f":"IFERROR(ROUND(AVERAGE(H51:Y51),0),\"\")","v":0},null,null,null,0]
[null,34,{"$f":"SW!C43","v":""},null,null,{"$f":"SW!G43","v":0},null,{"$f":"AH!N44","v":0},{"$f":"AA!N44","v":0},{"$f":"FQ!N44","v":0},{"$f":"SKI!N44","v":0},{"$f":"BA!N44","v":0},{"$f":"RTM!AP44","v":""},{"$f":"MTK!O44","v":""},{"$f":"RTM!AR44","v":""},{"$f":"RTM!AS44","v":""},{"$f":"RTM!AT44","v":""},{"$f":"RTM!AU44","v":""},{"$f":"PJOK!N44","v":0},{"$f":"BD!N44","v":0},{"$f":"BIG!N44","v":0},{"$f":"ASWJ!N44","v":0},{"$f":"'MLK1'!N44","v":0},{"$f":"'MLK2'!N44","v":0},{"$f":"'MLK3'!N44","v":0},0,0,null,null,null,0]
[null,35,{"$f":"SW!C44","v":""},null,null,{"$f":"SW!G44","v":0},null,{"$f":"AH!N45","v":0},{"$f":"AA!N45","v":0},{"$f":"FQ!N45","v":0},{"$f":"SKI!N45","v":0},{"$f":"BA!N45","v":0},{"$f":"RTM!AP45","v":""},{"$f":"MTK!O45","v":""},{"$f":"RTM!AR45","v":""},{"$f":"RTM!AS45","v":""},{"$f":"RTM!AT45","v":""},{"$f":"RTM!AU45","v":""},{"$f":"PJOK!N45","v":0},{"$f":"BD!N45","v":0},{"$f":"BIG!N45","v":0},{"$f":"ASWJ!N45","v":0},{"$f":"'MLK1'!N45","v":0},{"$f":"'MLK2'!N45","v":0},{"$f":"'MLK3'!N45","v":0},0,0,33,null,null,0]
[null,36,{"$f":"SW!C45","v":""},null,null,{"$f":"SW!G45","v":0},null,{"$f":"AH!N46","v":0},{"$f":"AA!N46","v":0},{"$f":"FQ!N46","v":0},{"$f":"SKI!N46","v":0},{"$f":"BA!N46","v":0},{"$f":"RTM!AP46","v":""},{"$f":"MTK!O46","v":""},{"$f":"RTM!AR46","v":""},{"$f":"RTM!AS46","v":""},{"$f":"RTM!AT46","v":""},{"$f":"RTM!AU46","v":""},{"$f":"PJOK!N46","v":0},{"$f":"BD!N46","v":0},{"$f":"BIG!N46","v":0},{"$f":"ASWJ!N46","v":0},{"$f":"'MLK1'!N46","v":0},{"$f":"'MLK2'!N46","v":0},{"$f":"'MLK3'!N46","v":0},0,0,33,null,null,0]
[null,37,{"$f":"SW!C46","v":""},null,null,{"$f":"SW!G46","v":0},null,{"$f":"AH!N47","v":0},{"$f":"AA!N47","v":0},{"$f":"FQ!N47","v":0},{"$f":"SKI!N47","v":0},{"$f":"BA!N47","v":0},{"$f":"RTM!AP47","v":""},{"$f":"MTK!O47","v":""},{"$f":"RTM!AR47","v":""},{"$f":"RTM!AS47","v":""},{"$f":"RTM!AT47","v":""},{"$f":"RTM!AU47","v":""},{"$f":"PJOK!N47","v":0},{"$f":"BD!N47","v":0},{"$f":"BIG!N47","v":0},{"$f":"ASWJ!N47","v":0},{"$f":"'MLK1'!N47","v":0},{"$f":"'MLK2'!N47","v":0},{"$f":"'MLK3'!N47","v":0},0,0,33,null,null,0]
[null,38,{"$f":"SW!C47","v":""},null,null,{"$f":"SW!G47","v":0},null,{"$f":"AH!N48","v":0},{"$f":"AA!N48","v":0},{"$f":"FQ!N48","v":0},{"$f":"SKI!N48","v":0},{"$f":"BA!N48","v":0},{"$f":"RTM!AP48","v":""},{"$f":"MTK!O48","v":""},{"$f":"RTM!AR48","v":""},{"$f":"RTM!AS48","v":""},{"$f":"RTM!AT48","v":""},{"$f":"RTM!AU48","v":""},{"$f":"PJOK!N48","v":0},{"$f":"BD!N48","v":0},{"$f":"BIG!N48","v":0},{"$f":"ASWJ!N48","v":0},{"$f":"'MLK1'!N48","v":0},{"$f":"'MLK2'!N48","v":0},{"$f":"'MLK3'!N48","v":0},0,0,33,null,null,0]
[null,39,{"$f":"SW!C48","v":""},null,null,{"$f":"SW!G48","v":0},null,{"$f":"AH!N49","v":0},{"$f":"AA!N49","v":0},{"$f":"FQ!N49","v":0},{"$f":"SKI!N49","v":0},{"$f":"BA!N49","v":0},{"$f":"RTM!AP49","v":""},{"$f":"MTK!O49","v":""},{"$f":"RTM!AR49","v":""},{"$f":"RTM!AS49","v":""},{"$f":"RTM!AT49","v":""},{"$f":"RTM!AU49","v":""},{"$f":"PJOK!N49","v":0},{"$f":"BD!N49","v":0},{"$f":"BIG!N49","v":0},{"$f":"ASWJ!N49","v":0},{"$f":"'MLK1'!N49","v":0},{"$f":"'MLK2'!N49","v":0},{"$f":"'MLK3'!N49","v":0},0,0,33,null,null,0]
[null,40,{"$f":"SW!C49","v":""},null,null,{"$f":"SW!G49","v":0},null,{"$f":"AH!N50","v":0},{"$f":"AA!N50","v":0},{"$f":"FQ!N50","v":0},{"$f":"SKI!N50","v":0},{"$f":"BA!N50","v":0},{"$f":"RTM!AP50","v":""},{"$f":"MTK!O50","v":""},{"$f":"RTM!AR50","v":""},{"$f":"RTM!AS50","v":""},{"$f":"RTM!AT50","v":""},{"$f":"RTM!AU50","v":""},{"$f":"PJOK!N50","v":0},{"$f":"BD!N50","v":0},{"$f":"BIG!N50","v":0},{"$f":"ASWJ!N50","v":0},{"$f":"'MLK1'!N50","v":0},{"$f":"'MLK2'!N50","v":0},{"$f":"'MLK3'!N50","v":0},0,0,33,null,null,0]
[null,41,{"$f":"SW!C50","v":""},null,null,{"$f":"SW!G50","v":0},null,{"$f":"AH!N51","v":0},{"$f":"AA!N51","v":0},{"$f":"FQ!N51","v":0},{"$f":"SKI!N51","v":0},{"$f":"BA!N51","v":0},{"$f":"RTM!AP51","v":""},{"$f":"MTK!O51","v":""},{"$f":"RTM!AR51","v":""},{"$f":"RTM!AS51","v":""},{"$f":"RTM!AT51","v":""},{"$f":"RTM!AU51","v":""},{"$f":"PJOK!N51","v":0},{"$f":"BD!N51","v":0},{"$f":"BIG!N51","v":0},{"$f":"ASWJ!N51","v":0},{"$f":"'MLK1'!N51","v":0},{"$f":"'MLK2'!N51","v":0},{"$f":"'MLK3'!N51","v":0},0,0,33,null,null,0]
[null,42,{"$f":"SW!C51","v":""},null,null,{"$f":"SW!G51","v":0},null,{"$f":"AH!N52","v":0},{"$f":"AA!N52","v":0},{"$f":"FQ!N52","v":0},{"$f":"SKI!N52","v":0},{"$f":"BA!N52","v":0},{"$f":"RTM!AP52","v":""},{"$f":"MTK!O52","v":""},{"$f":"RTM!AR52","v":""},{"$f":"RTM!AS52","v":""},{"$f":"RTM!AT52","v":""},{"$f":"RTM!AU52","v":""},{"$f":"PJOK!N52","v":0},{"$f":"BD!N52","v":0},{"$f":"BIG!N52","v":0},{"$f":"ASWJ!N52","v":0},{"$f":"'MLK1'!N52","v":0},{"$f":"'MLK2'!N52","v":0},{"$f":"'MLK3'!N52","v":0},0,0,33,null,null,0]
[null,43,{"$f":"SW!C52","v":""},null,null,{"$f":"SW!G52","v":0},null,{"$f":"AH!N53","v":0},{"$f":"AA!N53","v":0},{"$f":"FQ!N53","v":0},{"$f":"SKI!N53","v":0},{"$f":"BA!N53","v":0},{"$f":"RTM!AP53","v":""},{"$f":"MTK!O53","v":""},{"$f":"RTM!AR53","v":""},{"$f":"RTM!AS53","v":""},{"$f":"RTM!AT53","v":""},{"$f":"RTM!AU53","v":""},{"$f":"PJOK!N53","v":0},{"$f":"BD!N53","v":0},{"$f":"BIG!N53","v":0},{"$f":"ASWJ!N53","v":0},{"$f":"'MLK1'!N53","v":0},{"$f":"'MLK2'!N53","v":0},{"$f":"'MLK3'!N53","v":0},0,0,33,null,null,0]
[null,44,{"$f":"SW!C53","v":""},null,null,{"$f":"SW!G53","v":0},null,{"$f":"AH!N54","v":0},{"$f":"AA!N54","v":0},{"$f":"FQ!N54","v":0},{"$f":"SKI!N54","v":0},{"$f":"BA!N54","v":0},{"$f":"RTM!AP54","v":""},{"$f":"MTK!O54","v":""},{"$f":"RTM!AR54","v":""},{"$f":"RTM!AS54","v":""},{"$f":"RTM!AT54","v":""},{"$f":"RTM!AU54","v":""},{"$f":"PJOK!N54","v":0},{"$f":"BD!N54","v":0},{"$f":"BIG!N54","v":0},{"$f":"ASWJ!N54","v":0},{"$f":"'MLK1'!N54","v":0},{"$f":"'MLK2'!N54","v":0},{"$f":"'MLK3'!N54","v":0},0,0,33,null,null,0]
[null,45,{"$f":"SW!C54","v":""},null,null,{"$f":"SW!G54","v":0},null,{"$f":"AH!N55","v":0},{"$f":"AA!N55","v":0},{"$f":"FQ!N55","v":0},{"$f":"SKI!N55","v":0},{"$f":"BA!N55","v":0},{"$f":"RTM!AP55","v":""},{"$f":"MTK!O55","v":""},{"$f":"RTM!AR55","v":""},{"$f":"RTM!AS55","v":""},{"$f":"RTM!AT55","v":""},{"$f":"RTM!AU55","v":""},{"$f":"PJOK!N55","v":0},{"$f":"BD!N55","v":0},{"$f":"BIG!N55","v":0},{"$f":"ASWJ!N55","v":0},{"$f":"'MLK1'!N55","v":0},{"$f":"'MLK2'!N55","v":0},{"$f":"'MLK3'!N55","v":0},0,0,33,null,null,0]
[null,46,{"$f":"SW!C55","v":""},null,null,{"$f":"SW!G55","v":0},null,{"$f":"AH!N56","v":0},{"$f":"AA!N56","v":0},{"$f":"FQ!N56","v":0},{"$f":"SKI!N56","v":0},{"$f":"BA!N56","v":0},{"$f":"RTM!AP56","v":""},{"$f":"MTK!O56","v":""},{"$f":"RTM!AR56","v":""},{"$f":"RTM!AS56","v":""},{"$f":"RTM!AT56","v":""},{"$f":"RTM!AU56","v":""},{"$f":"PJOK!N56","v":0},{"$f":"BD!N56","v":0},{"$f":"BIG!N56","v":0},{"$f":"ASWJ!N56","v":0},{"$f":"'MLK1'!N56","v":0},{"$f":"'MLK2'!N56","v":0},{"$f":"'MLK3'!N56","v":0},0,0,33,null,null,0]
[null,47,{"$f":"SW!C56","v":""},null,null,{"$f":"SW!G56","v":0},null,{"$f":"AH!N57","v":0},{"$f":"AA!N57","v":0},{"$f":"FQ!N57","v":0},{"$f":"SKI!N57","v":0},{"$f":"BA!N57","v":0},{"$f":"RTM!AP57","v":""},{"$f":"MTK!O57","v":""},{"$f":"RTM!AR57","v":""},{"$f":"RTM!AS57","v":""},{"$f":"RTM!AT57","v":""},{"$f":"RTM!AU57","v":""},{"$f":"PJOK!N57","v":0},{"$f":"BD!N57","v":0},{"$f":"BIG!N57","v":0},{"$f":"ASWJ!N57","v":0},{"$f":"'MLK1'!N57","v":0},{"$f":"'MLK2'!N57","v":0},{"$f":"'MLK3'!N57","v":0},0,0,33,null,null,0]
[null,48,{"$f":"SW!C57","v":""},null,null,{"$f":"SW!G57","v":0},null,{"$f":"AH!N58","v":0},{"$f":"AA!N58","v":0},{"$f":"FQ!N58","v":0},{"$f":"SKI!N58","v":0},{"$f":"BA!N58","v":0},{"$f":"RTM!AP58","v":""},{"$f":"MTK!O58","v":""},{"$f":"RTM!AR58","v":""},{"$f":"RTM!AS58","v":""},{"$f":"RTM!AT58","v":""},{"$f":"RTM!AU58","v":""},{"$f":"PJOK!N58","v":0},{"$f":"BD!N58","v":0},{"$f":"BIG!N58","v":0},{"$f":"ASWJ!N58","v":0},{"$f":"'MLK1'!N58","v":0},{"$f":"'MLK2'!N58","v":0},{"$f":"'MLK3'!N58","v":0},0,0,33,null,null,0]
[null,49,{"$f":"SW!C58","v":""},null,null,{"$f":"SW!G58","v":0},null,{"$f":"AH!N59","v":0},{"$f":"AA!N59","v":0},{"$f":"FQ!N59","v":0},{"$f":"SKI!N59","v":0},{"$f":"BA!N59","v":0},{"$f":"RTM!AP59","v":""},{"$f":"MTK!O59","v":""},{"$f":"RTM!AR59","v":""},{"$f":"RTM!AS59","v":""},{"$f":"RTM!AT59","v":""},{"$f":"RTM!AU59","v":""},{"$f":"PJOK!N59","v":0},{"$f":"BD!N59","v":0},{"$f":"BIG!N59","v":0},{"$f":"ASWJ!N59","v":0},{"$f":"'MLK1'!N59","v":0},{"$f":"'MLK2'!N59","v":0},{"$f":"'MLK3'!N59","v":0},0,0,33,null,null,0]
[null,50,{"$f":"SW!C59","v":""},null,null,{"$f":"SW!G59","v":0},null,{"$f":"AH!N60","v":0},{"$f":"AA!N60","v":0},{"$f":"FQ!N60","v":0},{"$f":"SKI!N60","v":0},{"$f":"BA!N60","v":0},{"$f":"RTM!AP60","v":""},{"$f":"MTK!O60","v":""},{"$f":"RTM!AR60","v":""},{"$f":"RTM!AS60","v":""},{"$f":"RTM!AT60","v":""},{"$f":"RTM!AU60","v":""},{"$f":"PJOK!N60","v":0},{"$f":"BD!N60","v":0},{"$f":"BIG!N60","v":0},{"$f":"ASWJ!N60","v":0},{"$f":"'MLK1'!N60","v":0},{"$f":"'MLK2'!N60","v":0},{"$f":"'MLK3'!N60","v":0},0,0,33,null,null,0]
[null,51,{"$f":"SW!C60","v":""},null,null,{"$f":"SW!G60","v":0},null,{"$f":"AH!N61","v":0},{"$f":"AA!N61","v":0},{"$f":"FQ!N61","v":0},{"$f":"SKI!N61","v":0},{"$f":"BA!N61","v":0},{"$f":"RTM!AP61","v":""},{"$f":"MTK!O61","v":""},{"$f":"RTM!AR61","v":""},{"$f":"RTM!AS61","v":""},{"$f":"RTM!AT61","v":""},{"$f":"RTM!AU61","v":""},{"$f":"PJOK!N61","v":0},{"$f":"BD!N61","v":0},{"$f":"BIG!N61","v":0},{"$f":"ASWJ!N61","v":0},{"$f":"'MLK1'!N61","v":0},{"$f":"'MLK2'!N61","v":0},{"$f":"'MLK3'!N61","v":0},0,0,33,null,null,0]
[null,52,{"$f":"SW!C61","v":""},null,null,{"$f":"SW!G61","v":0},null,{"$f":"AH!N62","v":0},{"$f":"AA!N62","v":0},{"$f":"FQ!N62","v":0},{"$f":"SKI!N62","v":0},{"$f":"BA!N62","v":0},{"$f":"RTM!AP62","v":""},{"$f":"MTK!O62","v":""},{"$f":"RTM!AR62","v":""},{"$f":"RTM!AS62","v":""},{"$f":"RTM!AT62","v":""},{"$f":"RTM!AU62","v":""},{"$f":"PJOK!N62","v":0},{"$f":"BD!N62","v":0},{"$f":"BIG!N62","v":0},{"$f":"ASWJ!N62","v":0},{"$f":"'MLK1'!N62","v":0},{"$f":"'MLK2'!N62","v":0},{"$f":"'MLK3'!N62","v":0},0,0,33,null,null,0]
[null,53,{"$f":"SW!C62","v":""},null,null,{"$f":"SW!G62","v":0},null,{"$f":"AH!N63","v":0},{"$f":"AA!N63","v":0},{"$f":"FQ!N63","v":0},{"$f":"SKI!N63","v":0},{"$f":"BA!N63","v":0},{"$f":"RTM!AP63","v":""},{"$f":"MTK!O63","v":""},{"$f":"RTM!AR63","v":""},{"$f":"RTM!AS63","v":""},{"$f":"RTM!AT63","v":""},{"$f":"RTM!AU63","v":""},{"$f":"PJOK!N63","v":0},{"$f":"BD!N63","v":0},{"$f":"BIG!N63","v":0},{"$f":"ASWJ!N63","v":0},{"$f":"'MLK1'!N63","v":0},{"$f":"'MLK2'!N63","v":0},{"$f":"'MLK3'!N63","v":0},0,0,33,null,null,0]
[null,54,{"$f":"SW!C63","v":""},null,null,{"$f":"SW!G63","v":0},null,{"$f":"AH!N64","v":0},{"$f":"AA!N64","v":0},{"$f":"FQ!N64","v":0},{"$f":"SKI!N64","v":0},{"$f":"BA!N64","v":0},{"$f":"RTM!AP64","v":""},{"$f":"MTK!O64","v":""},{"$f":"RTM!AR64","v":""},{"$f":"RTM!AS64","v":""},{"$f":"RTM!AT64","v":""},{"$f":"RTM!AU64","v":""},{"$f":"PJOK!N64","v":0},{"$f":"BD!N64","v":0},{"$f":"BIG!N64","v":0},{"$f":"ASWJ!N64","v":0},{"$f":"'MLK1'!N64","v":0},{"$f":"'MLK2'!N64","v":0},{"$f":"'MLK3'!N64","v":0},0,0,33,null,null,0]
[null,55,{"$f":"SW!C64","v":""},null,null,{"$f":"SW!G64","v":0},null,{"$f":"AH!N65","v":0},{"$f":"AA!N65","v":0},{"$f":"FQ!N65","v":0},{"$f":"SKI!N65","v":0},{"$f":"BA!N65","v":0},{"$f":"RTM!AP65","v":""},{"$f":"MTK!O65","v":""},{"$f":"RTM!AR65","v":""},{"$f":"RTM!AS65","v":""},{"$f":"RTM!AT65","v":""},{"$f":"RTM!AU65","v":""},{"$f":"PJOK!N65","v":0},{"$f":"BD!N65","v":0},{"$f":"BIG!N65","v":0},{"$f":"ASWJ!N65","v":0},{"$f":"'MLK1'!N65","v":0},{"$f":"'MLK2'!N65","v":0},{"$f":"'MLK3'!N65","v":0},0,0,33,null,null,0]
[null,56,{"$f":"SW!C65","v":""},null,null,{"$f":"SW!G65","v":0},null,{"$f":"AH!N66","v":0},{"$f":"AA!N66","v":0},{"$f":"FQ!N66","v":0},{"$f":"SKI!N66","v":0},{"$f":"BA!N66","v":0},{"$f":"RTM!AP66","v":""},{"$f":"MTK!O66","v":""},{"$f":"RTM!AR66","v":""},{"$f":"RTM!AS66","v":""},{"$f":"RTM!AT66","v":""},{"$f":"RTM!AU66","v":""},{"$f":"PJOK!N66","v":0},{"$f":"BD!N66","v":0},{"$f":"BIG!N66","v":0},{"$f":"ASWJ!N66","v":0},{"$f":"'MLK1'!N66","v":0},{"$f":"'MLK2'!N66","v":0},{"$f":"'MLK3'!N66","v":0},0,0,33,null,null,0]
[null,57,{"$f":"SW!C66","v":""},null,null,{"$f":"SW!G66","v":0},null,{"$f":"AH!N67","v":0},{"$f":"AA!N67","v":0},{"$f":"FQ!N67","v":0},{"$f":"SKI!N67","v":0},{"$f":"BA!N67","v":0},{"$f":"RTM!AP67","v":""},{"$f":"MTK!O67","v":""},{"$f":"RTM!AR67","v":""},{"$f":"RTM!AS67","v":""},{"$f":"RTM!AT67","v":""},{"$f":"RTM!AU67","v":""},{"$f":"PJOK!N67","v":0},{"$f":"BD!N67","v":0},{"$f":"BIG!N67","v":0},{"$f":"ASWJ!N67","v":0},{"$f":"'MLK1'!N67","v":0},{"$f":"'MLK2'!N67","v":0},{"$f":"'MLK3'!N67","v":0},0,0,33,null,null,0]
[null,58,{"$f":"SW!C67","v":""},null,null,{"$f":"SW!G67","v":0},null,{"$f":"AH!N68","v":0},{"$f":"AA!N68","v":0},{"$f":"FQ!N68","v":0},{"$f":"SKI!N68","v":0},{"$f":"BA!N68","v":0},{"$f":"RTM!AP68","v":""},{"$f":"MTK!O68","v":""},{"$f":"RTM!AR68","v":""},{"$f":"RTM!AS68","v":""},{"$f":"RTM!AT68","v":""},{"$f":"RTM!AU68","v":""},{"$f":"PJOK!N68","v":0},{"$f":"BD!N68","v":0},{"$f":"BIG!N68","v":0},{"$f":"ASWJ!N68","v":0},{"$f":"'MLK1'!N68","v":0},{"$f":"'MLK2'!N68","v":0},{"$f":"'MLK3'!N68","v":0},0,0,33,null,null,0]
[null,59,{"$f":"SW!C68","v":""},null,null,{"$f":"SW!G68","v":0},null,{"$f":"AH!N69","v":0},{"$f":"AA!N69","v":0},{"$f":"FQ!N69","v":0},{"$f":"SKI!N69","v":0},{"$f":"BA!N69","v":0},{"$f":"RTM!AP69","v":""},{"$f":"MTK!O69","v":""},{"$f":"RTM!AR69","v":""},{"$f":"RTM!AS69","v":""},{"$f":"RTM!AT69","v":""},{"$f":"RTM!AU69","v":""},{"$f":"PJOK!N69","v":0},{"$f":"BD!N69","v":0},{"$f":"BIG!N69","v":0},{"$f":"ASWJ!N69","v":0},{"$f":"'MLK1'!N69","v":0},{"$f":"'MLK2'!N69","v":0},{"$f":"'MLK3'!N69","v":0},0,0,33,null,null,0]
[null,60,{"$f":"SW!C69","v":""},null,null,{"$f":"SW!G69","v":0},null,{"$f":"AH!N70","v":0},{"$f":"AA!N70","v":0},{"$f":"FQ!N70","v":0},{"$f":"SKI!N70","v":0},{"$f":"BA!N70","v":0},{"$f":"RTM!AP70","v":""},{"$f":"MTK!O70","v":""},{"$f":"RTM!AR70","v":""},{"$f":"RTM!AS70","v":""},{"$f":"RTM!AT70","v":""},{"$f":"RTM!AU70","v":""},{"$f":"PJOK!N70","v":0},{"$f":"BD!N70","v":0},{"$f":"BIG!N70","v":0},{"$f":"ASWJ!N70","v":0},{"$f":"'MLK1'!N70","v":0},{"$f":"'MLK2'!N70","v":0},{"$f":"'MLK3'!N70","v":0},0,0,33,null,null,0]
[null,61,{"$f":"SW!C70","v":""},null,null,{"$f":"SW!G70","v":0},null,{"$f":"AH!N71","v":0},{"$f":"AA!N71","v":0},{"$f":"FQ!N71","v":0},{"$f":"SKI!N71","v":0},{"$f":"BA!N71","v":0},{"$f":"RTM!AP71","v":""},{"$f":"MTK!O71","v":""},{"$f":"RTM!AR71","v":""},{"$f":"RTM!AS71","v":""},{"$f":"RTM!AT71","v":""},{"$f":"RTM!AU71","v":""},{"$f":"PJOK!N71","v":0},{"$f":"BD!N71","v":0},{"$f":"BIG!N71","v":0},{"$f":"ASWJ!N71","v":0},{"$f":"'MLK1'!N71","v":0},{"$f":"'MLK2'!N71","v":0},{"$f":"'MLK3'!N71","v":0},0,0,33,null,null,0]
[null,62,{"$f":"SW!C71","v":""},null,null,{"$f":"SW!G71","v":0},null,{"$f":"AH!N72","v":0},{"$f":"AA!N72","v":0},{"$f":"FQ!N72","v":0},{"$f":"SKI!N72","v":0},{"$f":"BA!N72","v":0},{"$f":"RTM!AP72","v":""},{"$f":"MTK!O72","v":""},{"$f":"RTM!AR72","v":""},{"$f":"RTM!AS72","v":""},{"$f":"RTM!AT72","v":""},{"$f":"RTM!AU72","v":""},{"$f":"PJOK!N72","v":0},{"$f":"BD!N72","v":0},{"$f":"BIG!N72","v":0},{"$f":"ASWJ!N72","v":0},{"$f":"'MLK1'!N72","v":0},{"$f":"'MLK2'!N72","v":0},{"$f":"'MLK3'!N72","v":0},0,0,33,null,null,0]
[null,63,{"$f":"SW!C72","v":""},null,null,{"$f":"SW!G72","v":0},null,{"$f":"AH!N73","v":0},{"$f":"AA!N73","v":0},{"$f":"FQ!N73","v":0},{"$f":"SKI!N73","v":0},{"$f":"BA!N73","v":0},{"$f":"RTM!AP73","v":""},{"$f":"MTK!O73","v":""},{"$f":"RTM!AR73","v":""},{"$f":"RTM!AS73","v":""},{"$f":"RTM!AT73","v":""},{"$f":"RTM!AU73","v":""},{"$f":"PJOK!N73","v":0},{"$f":"BD!N73","v":0},{"$f":"BIG!N73","v":0},{"$f":"ASWJ!N73","v":0},{"$f":"'MLK1'!N73","v":0},{"$f":"'MLK2'!N73","v":0},{"$f":"'MLK3'!N73","v":0},0,0,33,null,null,0]
[null,64,{"$f":"SW!C73","v":""},null,null,{"$f":"SW!G73","v":0},null,{"$f":"AH!N74","v":0},{"$f":"AA!N74","v":0},{"$f":"FQ!N74","v":0},{"$f":"SKI!N74","v":0},{"$f":"BA!N74","v":0},{"$f":"RTM!AP74","v":""},{"$f":"MTK!O74","v":""},{"$f":"RTM!AR74","v":""},{"$f":"RTM!AS74","v":""},{"$f":"RTM!AT74","v":""},{"$f":"RTM!AU74","v":""},{"$f":"PJOK!N74","v":0},{"$f":"BD!N74","v":0},{"$f":"BIG!N74","v":0},{"$f":"ASWJ!N74","v":0},{"$f":"'MLK1'!N74","v":0},{"$f":"'MLK2'!N74","v":0},{"$f":"'MLK3'!N74","v":0},0,0,33,null,null,0]
[null,65,{"$f":"SW!C74","v":""},null,null,{"$f":"SW!G74","v":0},null,{"$f":"AH!N75","v":0},{"$f":"AA!N75","v":0},{"$f":"FQ!N75","v":0},{"$f":"SKI!N75","v":0},{"$f":"BA!N75","v":0},{"$f":"RTM!AP75","v":""},{"$f":"MTK!O75","v":""},{"$f":"RTM!AR75","v":""},{"$f":"RTM!AS75","v":""},{"$f":"RTM!AT75","v":""},{"$f":"RTM!AU75","v":""},{"$f":"PJOK!N75","v":0},{"$f":"BD!N75","v":0},{"$f":"BIG!N75","v":0},{"$f":"ASWJ!N75","v":0},{"$f":"'MLK1'!N75","v":0},{"$f":"'MLK2'!N75","v":0},{"$f":"'MLK3'!N75","v":0},0,0,33,null,null,0]
[null,66,{"$f":"SW!C75","v":""},null,null,{"$f":"SW!G75","v":0},null,{"$f":"AH!N76","v":0},{"$f":"AA!N76","v":0},{"$f":"FQ!N76","v":0},{"$f":"SKI!N76","v":0},{"$f":"BA!N76","v":0},{"$f":"RTM!AP76","v":""},{"$f":"MTK!O76","v":""},{"$f":"RTM!AR76","v":""},{"$f":"RTM!AS76","v":""},{"$f":"RTM!AT76","v":""},{"$f":"RTM!AU76","v":""},{"$f":"PJOK!N76","v":0},{"$f":"BD!N76","v":0},{"$f":"BIG!N76","v":0},{"$f":"ASWJ!N76","v":0},{"$f":"'MLK1'!N76","v":0},{"$f":"'MLK2'!N76","v":0},{"$f":"'MLK3'!N76","v":0},{"$f":"SUM(H84:Y84)","v":0},{"$f":"IFERROR(ROUND(AVERAGE(H84:Y84),0),\"\")","v":0},{"$f":"RANK(Z84,$Z$19:$Z$107)","v":33},null,null,{"$f":"IF(C84=\"\",0,\"cetak\")","v":0}]
[null,67,{"$f":"SW!C76","v":""},null,null,{"$f":"SW!G76","v":0},null,{"$f":"AH!N77","v":0},{"$f":"AA!N77","v":0},{"$f":"FQ!N77","v":0},{"$f":"SKI!N77","v":0},{"$f":"BA!N77","v":0},{"$f":"RTM!AP77","v":""},{"$f":"MTK!O77","v":""},{"$f":"RTM!AR77","v":""},{"$f":"RTM!AS77","v":""},{"$f":"RTM!AT77","v":""},{"$f":"RTM!AU77","v":""},{"$f":"PJOK!N77","v":0},{"$f":"BD!N77","v":0},{"$f":"BIG!N77","v":0},{"$f":"ASWJ!N77","v":0},{"$f":"'MLK1'!N77","v":0},{"$f":"'MLK2'!N77","v":0},{"$f":"'MLK3'!N77","v":0},0,0,33,null,null,0]
[null,68,{"$f":"SW!C77","v":""},null,null,{"$f":"SW!G77","v":0},null,{"$f":"AH!N78","v":0},{"$f":"AA!N78","v":0},{"$f":"FQ!N78","v":0},{"$f":"SKI!N78","v":0},{"$f":"BA!N78","v":0},{"$f":"RTM!AP78","v":""},{"$f":"MTK!O78","v":""},{"$f":"RTM!AR78","v":""},{"$f":"RTM!AS78","v":""},{"$f":"RTM!AT78","v":""},{"$f":"RTM!AU78","v":""},{"$f":"PJOK!N78","v":0},{"$f":"BD!N78","v":0},{"$f":"BIG!N78","v":0},{"$f":"ASWJ!N78","v":0},{"$f":"'MLK1'!N78","v":0},{"$f":"'MLK2'!N78","v":0},{"$f":"'MLK3'!N78","v":0},0,0,33,null,null,0]
[null,69,{"$f":"SW!C78","v":""},null,null,{"$f":"SW!G78","v":0},null,{"$f":"AH!N79","v":0},{"$f":"AA!N79","v":0},{"$f":"FQ!N79","v":0},{"$f":"SKI!N79","v":0},{"$f":"BA!N79","v":0},{"$f":"RTM!AP79","v":""},{"$f":"MTK!O79","v":""},{"$f":"RTM!AR79","v":""},{"$f":"RTM!AS79","v":""},{"$f":"RTM!AT79","v":""},{"$f":"RTM!AU79","v":""},{"$f":"PJOK!N79","v":0},{"$f":"BD!N79","v":0},{"$f":"BIG!N79","v":0},{"$f":"ASWJ!N79","v":0},{"$f":"'MLK1'!N79","v":0},{"$f":"'MLK2'!N79","v":0},{"$f":"'MLK3'!N79","v":0},0,0,33,null,null,0]
[null,70,{"$f":"SW!C79","v":""},null,null,{"$f":"SW!G79","v":0},null,{"$f":"AH!N80","v":0},{"$f":"AA!N80","v":0},{"$f":"FQ!N80","v":0},{"$f":"SKI!N80","v":0},{"$f":"BA!N80","v":0},{"$f":"RTM!AP80","v":""},{"$f":"MTK!O80","v":""},{"$f":"RTM!AR80","v":""},{"$f":"RTM!AS80","v":""},{"$f":"RTM!AT80","v":""},{"$f":"RTM!AU80","v":""},{"$f":"PJOK!N80","v":0},{"$f":"BD!N80","v":0},{"$f":"BIG!N80","v":0},{"$f":"ASWJ!N80","v":0},{"$f":"'MLK1'!N80","v":0},{"$f":"'MLK2'!N80","v":0},{"$f":"'MLK3'!N80","v":0},0,0,33,null,null,0]
[null,71,{"$f":"SW!C80","v":""},null,null,{"$f":"SW!G80","v":0},null,{"$f":"AH!N81","v":0},{"$f":"AA!N81","v":0},{"$f":"FQ!N81","v":0},{"$f":"SKI!N81","v":0},{"$f":"BA!N81","v":0},{"$f":"RTM!AP81","v":""},{"$f":"MTK!O81","v":""},{"$f":"RTM!AR81","v":""},{"$f":"RTM!AS81","v":""},{"$f":"RTM!AT81","v":""},{"$f":"RTM!AU81","v":""},{"$f":"PJOK!N81","v":0},{"$f":"BD!N81","v":0},{"$f":"BIG!N81","v":0},{"$f":"ASWJ!N81","v":0},{"$f":"'MLK1'!N81","v":0},{"$f":"'MLK2'!N81","v":0},{"$f":"'MLK3'!N81","v":0},0,0,33,null,null,0]
[null,72,{"$f":"SW!C81","v":""},null,null,{"$f":"SW!G81","v":0},null,{"$f":"AH!N82","v":0},{"$f":"AA!N82","v":0},{"$f":"FQ!N82","v":0},{"$f":"SKI!N82","v":0},{"$f":"BA!N82","v":0},{"$f":"RTM!AP82","v":""},{"$f":"MTK!O82","v":""},{"$f":"RTM!AR82","v":""},{"$f":"RTM!AS82","v":""},{"$f":"RTM!AT82","v":""},{"$f":"RTM!AU82","v":""},{"$f":"PJOK!N82","v":0},{"$f":"BD!N82","v":0},{"$f":"BIG!N82","v":0},{"$f":"ASWJ!N82","v":0},{"$f":"'MLK1'!N82","v":0},{"$f":"'MLK2'!N82","v":0},{"$f":"'MLK3'!N82","v":0},0,0,33,null,null,0]
[null,73,{"$f":"SW!C82","v":""},null,null,{"$f":"SW!G82","v":0},null,{"$f":"AH!N83","v":0},{"$f":"AA!N83","v":0},{"$f":"FQ!N83","v":0},{"$f":"SKI!N83","v":0},{"$f":"BA!N83","v":0},{"$f":"RTM!AP83","v":""},{"$f":"MTK!O83","v":""},{"$f":"RTM!AR83","v":""},{"$f":"RTM!AS83","v":""},{"$f":"RTM!AT83","v":""},{"$f":"RTM!AU83","v":""},{"$f":"PJOK!N83","v":0},{"$f":"BD!N83","v":0},{"$f":"BIG!N83","v":0},{"$f":"ASWJ!N83","v":0},{"$f":"'MLK1'!N83","v":0},{"$f":"'MLK2'!N83","v":0},{"$f":"'MLK3'!N83","v":0},0,0,33,null,null,0]
[null,74,{"$f":"SW!C83","v":""},null,null,{"$f":"SW!G83","v":0},null,{"$f":"AH!N84","v":0},{"$f":"AA!N84","v":0},{"$f":"FQ!N84","v":0},{"$f":"SKI!N84","v":0},{"$f":"BA!N84","v":0},{"$f":"RTM!AP84","v":""},{"$f":"MTK!O84","v":""},{"$f":"RTM!AR84","v":""},{"$f":"RTM!AS84","v":""},{"$f":"RTM!AT84","v":""},{"$f":"RTM!AU84","v":""},{"$f":"PJOK!N84","v":0},{"$f":"BD!N84","v":0},{"$f":"BIG!N84","v":0},{"$f":"ASWJ!N84","v":0},{"$f":"'MLK1'!N84","v":0},{"$f":"'MLK2'!N84","v":0},{"$f":"'MLK3'!N84","v":0},0,0,33,null,null,0]
[null,75,{"$f":"SW!C84","v":""},null,null,{"$f":"SW!G84","v":0},null,{"$f":"AH!N85","v":0},{"$f":"AA!N85","v":0},{"$f":"FQ!N85","v":0},{"$f":"SKI!N85","v":0},{"$f":"BA!N85","v":0},{"$f":"RTM!AP85","v":""},{"$f":"MTK!O85","v":""},{"$f":"RTM!AR85","v":""},{"$f":"RTM!AS85","v":""},{"$f":"RTM!AT85","v":""},{"$f":"RTM!AU85","v":""},{"$f":"PJOK!N85","v":0},{"$f":"BD!N85","v":0},{"$f":"BIG!N85","v":0},{"$f":"ASWJ!N85","v":0},{"$f":"'MLK1'!N85","v":0},{"$f":"'MLK2'!N85","v":0},{"$f":"'MLK3'!N85","v":0},0,0,33,null,null,0]
[null,76,{"$f":"SW!C85","v":""},null,null,{"$f":"SW!G85","v":0},null,{"$f":"AH!N86","v":0},{"$f":"AA!N86","v":0},{"$f":"FQ!N86","v":0},{"$f":"SKI!N86","v":0},{"$f":"BA!N86","v":0},{"$f":"RTM!AP86","v":""},{"$f":"MTK!O86","v":""},{"$f":"RTM!AR86","v":""},{"$f":"RTM!AS86","v":""},{"$f":"RTM!AT86","v":""},{"$f":"RTM!AU86","v":""},{"$f":"PJOK!N86","v":0},{"$f":"BD!N86","v":0},{"$f":"BIG!N86","v":0},{"$f":"ASWJ!N86","v":0},{"$f":"'MLK1'!N86","v":0},{"$f":"'MLK2'!N86","v":0},{"$f":"'MLK3'!N86","v":0},0,0,33,null,null,0]
[null,77,{"$f":"SW!C86","v":""},null,null,{"$f":"SW!G86","v":0},null,{"$f":"AH!N87","v":0},{"$f":"AA!N87","v":0},{"$f":"FQ!N87","v":0},{"$f":"SKI!N87","v":0},{"$f":"BA!N87","v":0},{"$f":"RTM!AP87","v":""},{"$f":"MTK!O87","v":""},{"$f":"RTM!AR87","v":""},{"$f":"RTM!AS87","v":""},{"$f":"RTM!AT87","v":""},{"$f":"RTM!AU87","v":""},{"$f":"PJOK!N87","v":0},{"$f":"BD!N87","v":0},{"$f":"BIG!N87","v":0},{"$f":"ASWJ!N87","v":0},{"$f":"'MLK1'!N87","v":0},{"$f":"'MLK2'!N87","v":0},{"$f":"'MLK3'!N87","v":0},0,0,33,null,null,0]
[null,78,{"$f":"SW!C87","v":""},null,null,{"$f":"SW!G87","v":0},null,{"$f":"AH!N88","v":0},{"$f":"AA!N88","v":0},{"$f":"FQ!N88","v":0},{"$f":"SKI!N88","v":0},{"$f":"BA!N88","v":0},{"$f":"RTM!AP88","v":""},{"$f":"MTK!O88","v":""},{"$f":"RTM!AR88","v":""},{"$f":"RTM!AS88","v":""},{"$f":"RTM!AT88","v":""},{"$f":"RTM!AU88","v":""},{"$f":"PJOK!N88","v":0},{"$f":"BD!N88","v":0},{"$f":"BIG!N88","v":0},{"$f":"ASWJ!N88","v":0},{"$f":"'MLK1'!N88","v":0},{"$f":"'MLK2'!N88","v":0},{"$f":"'MLK3'!N88","v":0},0,0,33,null,null,0]
[null,79,{"$f":"SW!C88","v":""},null,null,{"$f":"SW!G88","v":0},null,{"$f":"AH!N89","v":0},{"$f":"AA!N89","v":0},{"$f":"FQ!N89","v":0},{"$f":"SKI!N89","v":0},{"$f":"BA!N89","v":0},{"$f":"RTM!AP89","v":""},{"$f":"MTK!O89","v":""},{"$f":"RTM!AR89","v":""},{"$f":"RTM!AS89","v":""},{"$f":"RTM!AT89","v":""},{"$f":"RTM!AU89","v":""},{"$f":"PJOK!N89","v":0},{"$f":"BD!N89","v":0},{"$f":"BIG!N89","v":0},{"$f":"ASWJ!N89","v":0},{"$f":"'MLK1'!N89","v":0},{"$f":"'MLK2'!N89","v":0},{"$f":"'MLK3'!N89","v":0},0,0,33,null,null,0]
[null,80,{"$f":"SW!C89","v":""},null,null,{"$f":"SW!G89","v":0},null,{"$f":"AH!N90","v":0},{"$f":"AA!N90","v":0},{"$f":"FQ!N90","v":0},{"$f":"SKI!N90","v":0},{"$f":"BA!N90","v":0},{"$f":"RTM!AP90","v":""},{"$f":"MTK!O90","v":""},{"$f":"RTM!AR90","v":""},{"$f":"RTM!AS90","v":""},{"$f":"RTM!AT90","v":""},{"$f":"RTM!AU90","v":""},{"$f":"PJOK!N90","v":0},{"$f":"BD!N90","v":0},{"$f":"BIG!N90","v":0},{"$f":"ASWJ!N90","v":0},{"$f":"'MLK1'!N90","v":0},{"$f":"'MLK2'!N90","v":0},{"$f":"'MLK3'!N90","v":0},0,0,33,null,null,0]
[null,81,{"$f":"SW!C90","v":""},null,null,{"$f":"SW!G90","v":0},null,{"$f":"AH!N91","v":0},{"$f":"AA!N91","v":0},{"$f":"FQ!N91","v":0},{"$f":"SKI!N91","v":0},{"$f":"BA!N91","v":0},{"$f":"RTM!AP91","v":""},{"$f":"MTK!O91","v":""},{"$f":"RTM!AR91","v":""},{"$f":"RTM!AS91","v":""},{"$f":"RTM!AT91","v":""},{"$f":"RTM!AU91","v":""},{"$f":"PJOK!N91","v":0},{"$f":"BD!N91","v":0},{"$f":"BIG!N91","v":0},{"$f":"ASWJ!N91","v":0},{"$f":"'MLK1'!N91","v":0},{"$f":"'MLK2'!N91","v":0},{"$f":"'MLK3'!N91","v":0},0,0,33,null,null,0]
[null,82,{"$f":"SW!C91","v":""},null,null,{"$f":"SW!G91","v":0},null,{"$f":"AH!N92","v":0},{"$f":"AA!N92","v":0},{"$f":"FQ!N92","v":0},{"$f":"SKI!N92","v":0},{"$f":"BA!N92","v":0},{"$f":"RTM!AP92","v":""},{"$f":"MTK!O92","v":""},{"$f":"RTM!AR92","v":""},{"$f":"RTM!AS92","v":""},{"$f":"RTM!AT92","v":""},{"$f":"RTM!AU92","v":""},{"$f":"PJOK!N92","v":0},{"$f":"BD!N92","v":0},{"$f":"BIG!N92","v":0},{"$f":"ASWJ!N92","v":0},{"$f":"'MLK1'!N92","v":0},{"$f":"'MLK2'!N92","v":0},{"$f":"'MLK3'!N92","v":0},0,0,33,null,null,0]
[null,83,{"$f":"SW!C92","v":""},null,null,{"$f":"SW!G92","v":0},null,{"$f":"AH!N93","v":0},{"$f":"AA!N93","v":0},{"$f":"FQ!N93","v":0},{"$f":"SKI!N93","v":0},{"$f":"BA!N93","v":0},{"$f":"RTM!AP93","v":""},{"$f":"MTK!O93","v":""},{"$f":"RTM!AR93","v":""},{"$f":"RTM!AS93","v":""},{"$f":"RTM!AT93","v":""},{"$f":"RTM!AU93","v":""},{"$f":"PJOK!N93","v":0},{"$f":"BD!N93","v":0},{"$f":"BIG!N93","v":0},{"$f":"ASWJ!N93","v":0},{"$f":"'MLK1'!N93","v":0},{"$f":"'MLK2'!N93","v":0},{"$f":"'MLK3'!N93","v":0},0,0,33,null,null,0]
[null,84,{"$f":"SW!C93","v":""},null,null,{"$f":"SW!G93","v":0},null,{"$f":"AH!N94","v":0},{"$f":"AA!N94","v":0},{"$f":"FQ!N94","v":0},{"$f":"SKI!N94","v":0},{"$f":"BA!N94","v":0},{"$f":"RTM!AP94","v":""},{"$f":"MTK!O94","v":""},{"$f":"RTM!AR94","v":""},{"$f":"RTM!AS94","v":""},{"$f":"RTM!AT94","v":""},{"$f":"RTM!AU94","v":""},{"$f":"PJOK!N94","v":0},{"$f":"BD!N94","v":0},{"$f":"BIG!N94","v":0},{"$f":"ASWJ!N94","v":0},{"$f":"'MLK1'!N94","v":0},{"$f":"'MLK2'!N94","v":0},{"$f":"'MLK3'!N94","v":0},0,0,33,null,null,0]
[null,85,{"$f":"SW!C94","v":""},null,null,{"$f":"SW!G94","v":0},null,{"$f":"AH!N95","v":0},{"$f":"AA!N95","v":0},{"$f":"FQ!N95","v":0},{"$f":"SKI!N95","v":0},{"$f":"BA!N95","v":0},{"$f":"RTM!AP95","v":""},{"$f":"MTK!O95","v":""},{"$f":"RTM!AR95","v":""},{"$f":"RTM!AS95","v":""},{"$f":"RTM!AT95","v":""},{"$f":"RTM!AU95","v":""},{"$f":"PJOK!N95","v":0},{"$f":"BD!N95","v":0},{"$f":"BIG!N95","v":0},{"$f":"ASWJ!N95","v":0},{"$f":"'MLK1'!N95","v":0},{"$f":"'MLK2'!N95","v":0},{"$f":"'MLK3'!N95","v":0},0,0,33,null,null,0]
[null,86,{"$f":"SW!C95","v":""},null,null,{"$f":"SW!G95","v":0},null,{"$f":"AH!N96","v":0},{"$f":"AA!N96","v":0},{"$f":"FQ!N96","v":0},{"$f":"SKI!N96","v":0},{"$f":"BA!N96","v":0},{"$f":"RTM!AP96","v":""},{"$f":"MTK!O96","v":""},{"$f":"RTM!AR96","v":""},{"$f":"RTM!AS96","v":""},{"$f":"RTM!AT96","v":""},{"$f":"RTM!AU96","v":""},{"$f":"PJOK!N96","v":0},{"$f":"BD!N96","v":0},{"$f":"BIG!N96","v":0},{"$f":"ASWJ!N96","v":0},{"$f":"'MLK1'!N96","v":0},{"$f":"'MLK2'!N96","v":0},{"$f":"'MLK3'!N96","v":0},0,0,33,null,null,0]
[null,87,{"$f":"SW!C96","v":""},null,null,{"$f":"SW!G96","v":0},null,{"$f":"AH!N97","v":0},{"$f":"AA!N97","v":0},{"$f":"FQ!N97","v":0},{"$f":"SKI!N97","v":0},{"$f":"BA!N97","v":0},{"$f":"RTM!AP97","v":""},{"$f":"MTK!O97","v":""},{"$f":"RTM!AR97","v":""},{"$f":"RTM!AS97","v":""},{"$f":"RTM!AT97","v":""},{"$f":"RTM!AU97","v":""},{"$f":"PJOK!N97","v":0},{"$f":"BD!N97","v":0},{"$f":"BIG!N97","v":0},{"$f":"ASWJ!N97","v":0},{"$f":"'MLK1'!N97","v":0},{"$f":"'MLK2'!N97","v":0},{"$f":"'MLK3'!N97","v":0},0,0,33,null,null,0]
[null,88,{"$f":"SW!C97","v":""},null,null,{"$f":"SW!G97","v":0},null,{"$f":"AH!N98","v":0},{"$f":"AA!N98","v":0},{"$f":"FQ!N98","v":0},{"$f":"SKI!N98","v":0},{"$f":"BA!N98","v":0},{"$f":"RTM!AP98","v":""},{"$f":"MTK!O98","v":""},{"$f":"RTM!AR98","v":""},{"$f":"RTM!AS98","v":""},{"$f":"RTM!AT98","v":""},{"$f":"RTM!AU98","v":""},{"$f":"PJOK!N98","v":0},{"$f":"BD!N98","v":0},{"$f":"BIG!N98","v":0},{"$f":"ASWJ!N98","v":0},{"$f":"'MLK1'!N98","v":0},{"$f":"'MLK2'!N98","v":0},{"$f":"'MLK3'!N98","v":0},0,0,33,null,null,0]
[null,89,{"$f":"SW!C98","v":""},null,null,{"$f":"SW!G98","v":0},null,{"$f":"AH!N99","v":0},{"$f":"AA!N99","v":0},{"$f":"FQ!N99","v":0},{"$f":"SKI!N99","v":0},{"$f":"BA!N99","v":0},{"$f":"RTM!AP99","v":""},{"$f":"MTK!O99","v":""},{"$f":"RTM!AR99","v":""},{"$f":"RTM!AS99","v":""},{"$f":"RTM!AT99","v":""},{"$f":"RTM!AU99","v":""},{"$f":"PJOK!N99","v":0},{"$f":"BD!N99","v":0},{"$f":"BIG!N99","v":0},{"$f":"ASWJ!N99","v":0},{"$f":"'MLK1'!N99","v":0},{"$f":"'MLK2'!N99","v":0},{"$f":"'MLK3'!N99","v":0},0,0,33,null,null,0]
[null,null,"JUMLAH",null,null,null,null,{"$f":"SUM(H19:H107)","v":1950},{"$f":"SUM(I19:I107)","v":1853},2015,1604,1165,1616,829.5,{"$f":"SUM(O19:O107)","v":1616},{"$f":"SUM(P19:P107)","v":1616},1616,1616,1515,1679,{"$f":"SUM(U19:U107)","v":1610},{"$f":"SUM(V19:V107)","v":1803},{"$f":"SUM(W19:W107)","v":995},0,0,"-"]
[null,null,"RATA-RATA",null,null,null,null,{"$f":"IFERROR(ROUND(AVERAGE(H19:H107),0),\"\")","v":22},{"$f":"IFERROR(ROUND(AVERAGE(I19:I107),0),\"\")","v":21},23,18,13,51,26,51,51,51,51,17,19,{"$f":"IFERROR(ROUND(AVERAGE(U19:U107),0),\"\")","v":18},{"$f":"IFERROR(ROUND(AVERAGE(V19:V107),0),\"\")","v":20},11,0,0]
[null,null,"NILAI TERTINGGI",null,null,null,null,{"$f":"MAX(H19:H107)","v":84},{"$f":"MAX(I19:I107)","v":94},84,65,60,67,40,67,67,67,67,65,76,84,77,65,0,0]
[null,null,"NILAI TERENDAH",null,null,null,null,{"$f":"MIN(H19:H107)","v":0},{"$f":"MIN(I19:I107)","v":0},0,0,0,34,12.5,34,34,34,34,0,0,0,0,0,0,0]
[]
[null,null,null,null,null,null,null,null,null,null,null,null,null,null,null,null,null,null,null,null,"Lumajang,",null,{"$f":"MN!H24","v":"8 Nopember 2019"}]
[null,null,null,null,null,null,null,null,null,null,null,null,null,null,null,null,null,null,null,null,null,null,{"$f":"MN!J24","v":"1 Muharram 1440 H"}]
[null,null,null,"Mengetahui,"]
[null,null,null,"Kepala Madrasah",null,null,null,null,null,null,null,null,null,null,null,null,null,null,null,null,{"$f":"\"Wali Kelas \"&UPPER(MN!D22)","v":"Wali Kelas V B"}]
[]
[]
[]
[]
[null,null,null,{"$f":"MN!D8","v":"SAHRONI, S.Pd.I"},null,null,null,null,null,null,null,null,null,null,null,null,null,null,null,null,{"$f":"MN!D24","v":"CHAYUL MU'AFA, S.Ag"}]
[null,null,null,{"$f":"\"NIP. \"&MN!D10","v":"NIP. -"},null,null,null,null,null,null,null,null,null,null,null,null,null,null,null,null,{"$f":"\"NIP. \"&MN!D26","v":"NIP. -"}]

{"sheet":"SW","index":21,"n_rows":98,"n_cols":11,"rows_kept":98,"cut":false,"hidden":false,"merged":[[94,4,94,5],[95,4,95,5],[96,4,96,5],[97,4,97,5],[89,4,89,5],[90,4,90,5],[91,4,91,5],[92,4,92,5],[93,4,93,5],[84,4,84,5],[85,4,85,5],[86,4,86,5],[87,4,87,5],[88,4,88,5],[79,4,79,5],[80,4,80,5],[81,4,81,5],[82,4,82,5],[83,4,83,5],[74,4,74,5],[75,4,75,5],[76,4,76,5],[77,4,77,5],[78,4,78,5],[69,4,69,5],[70,4,70,5],[71,4,71,5],[72,4,72,5],[73,4,73,5],[64,4,64,5],[65,4,65,5],[66,4,66,5],[67,4,67,5],[68,4,68,5],[59,4,59,5],[60,4,60,5],[61,4,61,5],[62,4,62,5],[63,4,63,5],[54,4,54,5],[55,4,55,5],[56,4,56,5],[57,4,57,5],[58,4,58,5],[49,4,49,5],[50,4,50,5],[51,4,51,5],[52,4,52,5],[53,4,53,5],[44,4,44,5],[45,4,45,5],[46,4,46,5],[47,4,47,5],[48,4,48,5],[39,4,39,5],[40,4,40,5],[41,4,41,5],[42,4,42,5],[43,4,43,5],[34,4,34,5],[35,4,35,5],[36,4,36,5],[37,4,37,5],[38,4,38,5],[29,4,29,5],[30,4,30,5],[31,4,31,5],[32,4,32,5],[33,4,33,5],[24,4,24,5],[25,4,25,5],[26,4,26,5],[27,4,27,5],[28,4,28,5],[19,4,19,5],[20,4,20,5],[21,4,21,5],[22,4,22,5],[23,4,23,5],[14,4,14,5],[15,4,15,5],[16,4,16,5],[17,4,17,5],[18,4,18,5],[9,4,9,5],[10,4,10,5],[11,4,11,5],[12,4,12,5],[13,4,13,5],[6,2,8,2],[6,3,8,3],[6,6,8,6],[6,10,8,10],[6,8,8,9],[6,4,8,5],[3,9,4,9],[1,2,1,10],[3,2,3,3],[4,2,4,3],[3,5,3,6],[4,5,4,6],[6,7,8,7]]}
[]
[null,null,"D A F T A R   S I S W A"]
[]
[null,null,"KELAS",null,":",{"$f":"UPPER(MN!D22)","v":"V B"},null,null,null,"↗"]
[null,null,"TAPEL",null,":",{"$f":"MN!D18","v":"2019 - 2020"}]
[]
[null,null,"No","No. Induk","NISN",null,"Nama Siswa","Jenis Kelamin","TTL",null,"Nama Ortu"]
[]
[]
[1,0,{"$f":"IF(G10<>\"\",B10+1&\"\",\"\")","v":"1"},4604,null,null,"ABD. ROCHMAN NAJA FATLAN PRATAMA","LAKI-LAKI","SIDOARJO","2008-11-14","mukhamad ilham"]
[2,null,{"$f":"IF(G11<>\"\",C10+1&\"\",\"\")","v":"2"},4432,"0094629929","0094629929","ABDURRAHMAN FAQIH","LAKI-LAKI","LUMAJANG","2009-01-16","NUR KHOLIQ"]
[3,null,{"$f":"IF(G12<>\"\",C11+1&\"\",\"\")","v":"3"},4400,"0088902075","0088902075","ACHMAD FARROIHUN MUSHOBIRONILLAH","LAKI-LAKI","LUMAJANG","2008-12-16","ACH KAMALI ALFAN"]
[4,null,"4",4433,"0086573527","0086573527","ACHMAD HASBI ASSIDDIQI","LAKI-LAKI","LUMAJANG","2008-03-05","MOH. FADLAN"]
[5,null,"5",4401,"0091876405","0091876405","ACHMAD REZA AKRAM ALAUDDIN","LAKI-LAKI","LUMAJANG","2009-05-05","DIAN BASKARA"]
[6,null,"6",4434,"0086607649","0086607649","ACHMAD YANI","LAKI-LAKI","LUMAJANG","2008-06-12","AKHJAB"]
[7,null,"7",4437,"0081576555","0081576555","AKHMAD RIDWAN","LAKI-LAKI","LUMAJANG","2008-01-01"]
[8,null,"8",4439,"0089018808","0089018808","ANDREAN DWI YULIANO","LAKI-LAKI","LUMAJANG","2008-11-11","YULIANTO"]
[9,null,"9",4405,"0087514073","0087514073","ASFAN FAKHRI BARANI","LAKI-LAKI","LUMAJANG","2008-10-18","MISTA'AT"]
[10,null,"10",4406,"0081007144","0081007144","DEVAN ADITYA SAPUTRA","LAKI-LAKI","LUMAJANG","2008-03-06","ADE DWI CAHYONO"]
[11,null,"11",4409,"0083758044","0083758044","FAHRUL AHMAD FAHREZA","LAKI-LAKI","LUMAJANG","2008-12-14","AHMAD SHODIQ"]
[12,null,"12",4442,"0094471054","0094471054","FAUZIA AMELIA PUTRI","PEREMPUAN","LUMAJANG","2009-01-30","HENDIK WIJANARKO"]
[13,null,"13",4411,"0097068634","0097068634","FAZA AZIFAH SALSABILA","PEREMPUAN","LUMAJANG","2009-03-23","SOLECHAN"]
[14,null,"14",4443,"0082570064","0082570064","HABIBIE NURUSSALAM","LAKI-LAKI","LUMAJANG","2008-04-23","ABD. SALAM"]
[15,null,"15",4444,"0084229361","0084229361","HIMATURROSYIDAH","PEREMPUAN","LUMAJANG","2008-09-29","IMAM CHULDI"]
[16,null,"16",4413,"0095974067","0095974067","IFKARINA NAILA SAUQYA","PEREMPUAN","LUMAJANG","2009-02-13","MU'TAMAR MUKHLIS"]
[17,null,"17",4446,"0091718649","0091718649","KEISA AYU SASKIYAH","PEREMPUAN","LUMAJANG","2009-02-02","IMAM"]
[18,null,"18",4448,"0088340300","0088340300","MOCHAMMAD RENO FIRMANSYAH","LAKI-LAKI","LUMAJANG","2008-04-21","DODIK HARIYANTO"]
[19,null,"19",4416,"0081395793","0081395793","MOHAMAD NUR KHAFID KHABIBULLOH","LAKI-LAKI","LUMAJANG","2008-06-06","MOHAMAD KHAMIM"]
[20,null,"20",4449,"0096141985","0096141985","MOHAMMAD NAUFAL NAWWARUDDIN","LAKI-LAKI","LUMAJANG","2009-02-19","NASIRIN "]
[21,null,"21",4450,"0089086128","0089086128","MUCHAMAD PRIMA PAMBUDI","LAKI-LAKI","LUMAJANG","2008-03-16","KHASAN ROCHIM"]
[22,null,"22",4418,"0083036088","0083036088","MUHAMMAD ALFAN FATHONI","LAKI-LAKI","LUMAJANG","2008-08-19","MOHAMAD SLAMET"]
[23,null,"23",4452,"0091175320","0091175320","MUHAMMAD AMINULLAH MAULUDANI","LAKI-LAKI","LUMAJANG","2009-03-09","ALI USMAN"]
[24,null,"24",4454,"0082247624","0082247624","MUHAMMAD DAVIN  LEVANTINO","LAKI-LAKI","LUMAJANG","2008-08-23","M. SHOLEH"]
[25,null,"25",4420,"0091413489","0091413489","MUHAMMAD MAULANA PAHLEVY","LAKI-LAKI","LUMAJANG","2009-04-08","MUHAMMAD ANSHORI"]
[26,null,"26",4459,"0088867343","0088867343","RADITYA NIRWANSYAH","LAKI-LAKI","LUMAJANG","2008-10-01","SUHENDIK"]
[27,null,"27",4460,"0086652924","0086652924","REVINA SRI UTARI","PEREMPUAN","LUMAJANG","2008-05-19","SUWITO"]
[28,null,"28",4425,"0087177616","0087177616","REYHAN DWI ANDIKA","LAKI-LAKI","LUMAJANG","2008-07-05","MAS'UDI"]
[29,null,"29",4461,"0089323439","0089323439","RISKA LAURA TRIA OCTAVIA","PEREMPUAN","LUMAJANG","2008-10-27","JUNI SAIFUL"]
[30,null,"30",4427,"0084859051","0084859051","ROHMADONA DWI SAFITRI","PEREMPUAN","LUMAJANG","2008-09-14","SUKARTO"]
[31,null,"31",4462,"0084286282","0084286282","SALMAN ALFARIZI","LAKI-LAKI","LUMAJANG","2008-04-16","EDI SISWANTO"]
[32,null,"32",4463,"0084035253","0084035253","TAUFIQ KURROHMAN","LAKI-LAKI","LUMAJANG","2008-04-25","SLAMET AGUNG BUDISANTOSO"]
[33,null,""]
[34,null,""]
[35,null,""]
[36,null,""]
[37,null,""]
[38,null,""]
[39,null,""]
[40,null,""]
[41,null,""]
[42,null,""]
[43,null,""]
[44,null,""]
[45,null,""]
[46,null,""]
[47,null,""]
[48,null,""]
[49,null,""]
[50,null,""]
[51,null,""]
[52,null,""]
[53,null,""]
[54,null,""]
[55,null,""]
[56,null,""]
[57,null,""]
[58,null,""]
[59,null,""]
[60,null,""]
[61,null,""]
[62,null,""]
[63,null,""]
[64,null,""]
[65,null,""]
[66,null,""]
[67,null,{"$f":"IF(G76<>\"\",C75+1&\"\",\"\")","v":""}]
[68,null,""]
[69,null,""]
[70,null,""]
[71,null,""]
[72,null,""]
[73,null,""]
[74,null,""]
[75,null,""]
[76,null,""]
[77,null,""]
[78,null,""]
[79,null,""]
[80,null,""]
[81,null,""]
[82,null,""]
[83,null,""]
[84,null,""]
[85,null,""]
[86,null,""]
[87,null,""]
[88,null,""]
[89,null,""]

{"sheet":"RAPORT","index":22,"n_rows":65,"n_cols":16,"rows_kept":65,"cut":false,"hidden":false,"merged":[[55,9,55,11],[47,2,47,5],[49,2,49,5],[43,8,43,9],[44,8,44,9],[45,8,45,9],[54,7,54,8],[54,9,54,11],[44,2,44,7],[44,11,45,11],[45,2,45,7],[37,2,43,2],[51,2,52,11],[38,8,38,9],[39,8,39,9],[40,8,40,9],[41,8,41,9],[42,8,42,9],[32,8,32,9],[34,8,34,9],[35,8,35,9],[36,8,36,9],[37,8,37,9],[33,8,33,9],[27,8,27,9],[28,8,28,9],[29,8,29,9],[30,8,30,9],[31,8,31,9],[14,2,14,5],[24,8,24,9],[15,2,15,5],[16,2,16,5],[17,2,17,5],[20,2,20,5],[19,2,19,5],[23,2,28,2],[25,8,25,9],[26,8,26,9],[15,7,15,8],[16,7,16,8],[17,7,17,8],[18,7,18,8],[19,7,19,8],[20,7,20,8],[10,15,11,15],[6,14,8,15],[11,7,11,8],[12,7,12,8],[12,2,12,5],[11,11,12,11],[11,2,11,5],[29,2,36,2],[4,5,4,10],[3,5,3,10],[6,5,6,10],[5,5,5,10],[18,2,18,5],[9,2,9,11],[10,2,10,11],[22,8,22,9],[23,8,23,9],[3,2,5,4],[6,2,6,4],[14,7,14,8],[22,3,22,7],[13,7,13,8],[13,2,13,5]]}
[]
[]
[]
[null,null,null,null,null,"LEMBAGA PENDIDIKAN MA'ARIF NU CABANG KABUPATEN LUMAJANG"]
[null,null,null,null,null,{"$f":"UPPER(MN!D28&\". \"&MN!D6)","v":"MIS. NURUL ISLAM LABRUK KIDUL"}]
[null,null,null,null,null,{"$f":"UPPER(\"(TERAKREDITASI \"&MN!D30&\")\")","v":"(TERAKREDITASI A)"}]
[null,null,null,null,null,{"$f":"\"Jl. \"&MN!D16","v":"Jl. Raya Labruk Kidul No.65 Labruk Kidul"},null,null,null,null,null,"KEMENAG RI",null,null,"↗"]
[]
[]
[null,null,"L A P O R A N   H A S I L   P E N I L A I A N   T E N G A H   S E M E S T E R"]
[null,null,null,null,null,null,null,null,null,null,null,null,null,null,null,32]
[null,null,"Nama Siswa",null,null,null,":",{"$f":"UPPER(VLOOKUP(P11,SW!A10:K98,7,FALSE))","v":"TAUFIQ KURROHMAN"},null,null,null,"PAS FOTO"]
[null,null,"Jenis Kelamin",null,null,null,":",{"$f":"UPPER(VLOOKUP(P11,SW!A10:K98,8,FALSE))","v":"LAKI-LAKI"}]
[null,null,"Kelas",null,null,null,":",{"$f":"UPPER(MN!D22)","v":"V B"}]
[null,null,"Tempat, Tanggal Lahir",null,null,null,":",{"$f":"PROPER(VLOOKUP(P11,SW!A10:K98,9,FALSE))&\", \"&TEXT(VLOOKUP(P11,SW!A10:K98,10,FALSE),\"DD MMMM YYYY\")","v":"Lumajang, 25 April 2008"}]
[null,null,"Nomor Induk",null,null,null,":",{"$f":"VLOOKUP(P11,SW!A10:K98,4,FALSE)","v":4463}]
[null,null,"NISN",null,null,null,":",{"$f":"VLOOKUP(P11,SW!A10:K98,5,FALSE)","v":"0084035253"}]
[null,null,"Nama Orang Tua",null,null,null,":",{"$f":"UPPER(VLOOKUP(P11,SW!A10:K98,11,FALSE))","v":"SLAMET AGUNG BUDISANTOSO"}]
[null,null,"Semester",null,null,null,":",{"$f":"UPPER(MN!D20)","v":"GANJIL"}]
[null,null,"Tahun Pelajaran",null,null,null,":",{"$f":"MN!D18","v":"2019 - 2020"}]
[null,null,"Satuan Pendidikan",null,null,null,":",{"$f":"UPPER(MN!D28&\". \"&MN!D6)","v":"MIS. NURUL ISLAM LABRUK KIDUL"}]
[]
[null,null,"NO","MATA PELAJARAN",null,null,null,null,"KKM",null,"NILAI","KETERANGAN",null,null,"view"]
[null,null,1,"Pendidikan Agama",null,null,null,null,"-",null,"-","-"]
[null,null,null,"a.","Al-Qur'an hadits",null,null,null,75,null,{"$f":"VLOOKUP(P11,REKAP!B19:AB107,7,FALSE)","v":47},{"$f":"IF(K25>=I25,\"TUNTAS\",IF(K25<I25,\"TIDAK TUNTAS\"))","v":"TIDAK TUNTAS"},null,null,{"$f":"IF(I25=\"\",0,\"cetak\")","v":"cetak"}]
[null,null,null,"b.","Aqidah Akhlaq",null,null,null,75,null,{"$f":"VLOOKUP(P11,REKAP!B19:AB107,8,FALSE)","v":35},{"$f":"IF(K26>=I26,\"TUNTAS\",IF(K26<I26,\"TIDAK TUNTAS\"))","v":"TIDAK TUNTAS"},null,null,{"$f":"IF(I26=\"\",0,\"cetak\")","v":"cetak"}]
[null,null,null,"c.","Fiqih",null,null,null,75,null,{"$f":"VLOOKUP(P11,REKAP!B19:AB107,9,FALSE)","v":64},"TIDAK TUNTAS",null,null,"cetak"]
[null,null,null,"d.","Sejarah Kebudayaan Islam (SKI)",null,null,null,75,null,{"$f":"VLOOKUP(P11,REKAP!B19:AB107,10,FALSE)","v":42},"TIDAK TUNTAS",null,null,"cetak"]
[null,null,null,"e.","Bahasa Arab",null,null,null,70,null,{"$f":"VLOOKUP(P11,REKAP!B19:AB107,11,FALSE)","v":47},{"$f":"IF(K29>=I29,\"TUNTAS\",IF(K29<I29,\"TIDAK TUNTAS\"))","v":"TIDAK TUNTAS"},null,null,"cetak"]
[null,null,2,"Pendidikan Umum",null,null,null,null,"-",null,"-","-",null,null,"cetak"]
[null,null,null,"a.","Bahasa Indonesia",null,null,null,70,null,{"$f":"VLOOKUP(P11,REKAP!B19:AB107,12,FALSE)","v":48},{"$f":"IF(K31>=I31,\"TUNTAS\",IF(K31<I31,\"TIDAK TUNTAS\"))","v":"TIDAK TUNTAS"},null,null,"cetak"]
[null,null,null,"b.","Matematika",null,null,null,70,null,{"$f":"VLOOKUP(P11,REKAP!B19:AB107,13,FALSE)","v":17},{"$f":"IF(K32>=I32,\"TUNTAS\",IF(K32<I32,\"TIDAK TUNTAS\"))","v":"TIDAK TUNTAS"},null,null,"cetak"]
[null,null,null,"c.","Ilmu Pengetahuan Alam (IPA)",null,null,null,70,null,{"$f":"VLOOKUP(P11,REKAP!B19:AB107,14,FALSE)","v":48},"TIDAK TUNTAS",null,null,"cetak"]
[null,null,null,"d.","Pendidikan Pancasila dan Kewarganegaraan (PPKn)",null,null,null,70,null,{"$f":"VLOOKUP(P11,REKAP!B19:AB107,15,FALSE)","v":48},"TIDAK TUNTAS",null,null,"cetak"]
[null,null,null,"e.","Ilmu Pengetahuan Sosial (IPS)",null,null,null,70,null,{"$f":"VLOOKUP(P11,REKAP!B19:AB107,16,FALSE)","v":48},"TIDAK TUNTAS",null,null,"cetak"]
[null,null,null,"f.","Sosial Budaya dan Prakarya (SBdP)",null,null,null,75,null,{"$f":"VLOOKUP(P11,REKAP!B19:AB107,17,FALSE)","v":48},"TIDAK TUNTAS",null,null,"cetak"]
[null,null,null,"g.","Pendidikan Jasmani, Olahraga dan Kesehatan (PJOK)",null,null,null,75,null,{"$f":"VLOOKUP(P11,REKAP!B19:AB107,18,FALSE)","v":47},"TIDAK TUNTAS",null,null,"cetak"]
[null,null,3,"Muatan Lokal",null,null,null,null,"-",null,"-","-",null,null,"cetak"]
[null,null,null,"a.","Bahasa Daerah",null,null,null,67,null,{"$f":"VLOOKUP(P11,REKAP!B19:AB107,19,FALSE)","v":45},"TIDAK TUNTAS",null,null,"cetak"]
[null,null,null,"b.","Bahasa Inggris",null,null,null,65,null,{"$f":"VLOOKUP(P11,REKAP!B19:AB107,20,FALSE)","v":42},"TIDAK TUNTAS",null,null,"cetak"]
[null,null,null,"c.","Aswaja (Ke-NU-An)",null,null,null,70,null,{"$f":"VLOOKUP(P11,REKAP!B19:AB107,21,FALSE)","v":52},"TIDAK TUNTAS",null,null,"cetak"]
[null,null,null,"d.",{"$f":"PROPER(MN!J12)","v":"Nahwu / Shorof"},null,null,null,60,null,{"$f":"VLOOKUP(P11,REKAP!B19:AB107,22,FALSE)","v":25},"TIDAK TUNTAS",null,null,"cetak"]
[null,null,null,"e.",{"$f":"PROPER(MN!J14)","v":"-"},null,null,null,null,null,{"$f":"VLOOKUP(P11,REKAP!B19:AB107,23,FALSE)","v":0},null,null,null,0]
[null,null,null,"f.",{"$f":"PROPER(MN!J16)","v":"-"},null,null,null,null,null,{"$f":"VLOOKUP(P11,REKAP!B19:AB107,24,FALSE)","v":0},null,null,null,0]
[null,null,"JUMLAH",null,null,null,null,null,{"$f":"SUM(I25:J44)","v":1132},null,{"$f":"VLOOKUP(P11,REKAP!B19:AB107,25,FALSE)","v":703},{"$f":"VLOOKUP(P11,REKAP!B19:AB107,27,FALSE)","v":22}]
[null,null,"RATA - RATA",null,null,null,null,null,{"$f":"IFERROR(ROUND(AVERAGE(I25:J44),0),\"\")","v":71},null,{"$f":"VLOOKUP(P11,REKAP!B19:AB107,26,FALSE)","v":43.9375}]
[]
[null,null,"Peringkat kelas ke-",null,null,null,":",{"$f":"VLOOKUP(P11,REKAP!B19:AB107,27,FALSE)","v":22},"Dari",":",{"$f":"MN!H26","v":32},"Siswa"]
[]
[null,null,"Pesan Wali Kelas",null,null,null,":"]
[]
[null,null,{"$f":"PROPER(VLOOKUP(P11,REKAP!B19:AH107,33,FALSE))","v":"Pacu Terus Semangat Belajarmu Agar Lebih Meningkat Prestasimu"}]
[]
[]
[null,null,null,null,null,null,null,"Lumajang,",null,{"$f":"MN!H24","v":"8 Nopember 2019"}]
[null,null,null,null,null,null,null,null,null,{"$f":"MN!J24","v":"1 Muharram 1440 H"}]
[]
[null,null,"Mengetahui,"]
[null,null,"Kepala Madrasah",null,null,null,null,{"$f":"\"Wali Kelas \"&UPPER(MN!D22)","v":"Wali Kelas V B"},null,null,"Wali Murid"]
[]
[]
[]
[]
[null,null,{"$f":"MN!D8","v":"SAHRONI, S.Pd.I"},null,null,null,null,{"$f":"MN!D24","v":"CHAYUL MU'AFA, S.Ag"},null,null,"………………………………"]
[null,null,{"$f":"\"NIP. \"&MN!D10","v":"NIP. -"},null,null,null,null,{"$f":"\"NIP. \"&MN!D26","v":"NIP. -"}]

{"sheet":"MN","index":23,"n_rows":30,"n_cols":10,"rows_kept":30,"cut":false,"hidden":false,"merged":[[27,5,29,9],[3,1,3,3],[5,5,5,9],[1,1,1,9],[9,7,11,7],[21,7,21,9],[23,7,23,8],[17,5,17,9],[25,7,25,8],[3,5,3,9]]}
[]
[null,{"$f":"UPPER(\"PENGOLAHAN PENILAIAN TENGAH SEMESTER \"&D20&\" TAHUN PELAJARAN \"&D18)","v":"PENGOLAHAN PENILAIAN TENGAH SEMESTER GANJIL TAHUN PELAJARAN 2019 - 2020"}]
[]
[null,"IDENTITAS MADRASAH",null,null,null,"DATA SISWA"]
[]
[null,"NAMA MADRASAH",":","NURUL ISLAM LABRUK KIDUL",null,"MATA PELAJARAN"]
[]
[null,"NAMA KEPALA MADRASAH",":","SAHRONI, S.Pd.I",null,"AA",null,"MTK",null,"PJOK"]
[]
[null,"NIP KEPALA MADRASAH",":","-",null,"AH",null,"TEMA",null,"BD"]
[]
[null,"KECAMATAN",":","SUMBERSUKO",null,"FQH",null,null,null,{"$f":"UPPER('MLK1'!G4)","v":"NAHWU / SHOROF"}]
[]
[null,"KABUPATEN",":","LUMAJANG",null,"SKI",null,"BIG",null,{"$f":"UPPER('MLK2'!G4)","v":"-"}]
[]
[null,"ALAMAT MADRASAH",":","Raya Labruk Kidul No.65 Labruk Kidul",null,"BA",null,"ASWJ",null,{"$f":"UPPER('MLK3'!G4)","v":"-"}]
[]
[null,"TAHUN PELAJARAN",":","2019 - 2020",null,"DATA OUT"]
[]
[null,"SEMESTER",":","Ganjil",null,"REKAPITULASI",null,"RAPORT",null,"ABOUT"]
[]
[null,"KELAS",":","V B",null,"SLOGAN",":","EXELLENT QURANIC SCHOOL"]
[]
[null,"NAMA WALI KELAS",":","CHAYUL MU'AFA, S.Ag",null,"TANGGAL RAPORT",":","8 Nopember 2019",null,"1 Muharram 1440 H"]
[]
[null,"NIP WALI KELAS",":","-",null,"JUMLAH SISWA",":",32,null,"SISWA"]
[]
[null,"TIPE MADRASAH",":","MIS",null,{"$f":"UPPER(D28&\". \"&D6)","v":"MIS. NURUL ISLAM LABRUK KIDUL"}]
[]
[null,"AKREDITASI",":","A"]

{"sheet":"AB","index":24,"n_rows":12,"n_cols":6,"rows_kept":12,"cut":false,"hidden":false,"merged":[[1,1,1,3],[3,5,11,5]]}
[]
[null,"MY ID PERSON",null,null,null,"Pas Foto"]
[]
[null,"Nama",":","NUR RATNA PRIHATININGSIH"]
[]
[null,"Tempat, Tanggal Lahir",":","Lumajang, 09 Januari 1987"]
[]
[null,"Alamat",":","Jl. KH. Musthofa No.10 Petahunan Kecamatan Sumbersuko Kabupaten Lumajang Propinsi Jawa Timur"]
[]
[null,"Pendidikan",":","S1 Pendidikan Bahasa Indonesia"]
[]
[null,"No. Telp.",":","082330430092"]