{"text_format":"1","workbook":"xlsx","n_sheets":25,"sheets":["T1","T2","T3","T4","T5","T6","RTM","MTK","PJOK","BD","BIG","ASWJ","AA","AH","FQ","SKI","BA","MLK1","MLK2","MLK3","REKAP","SW","RAPORT","MN","AB"],"not_rendered":{"charts":0,"images":5,"macros":0,"external_links":0,"defined_names":5,"comments":0,"pivot_tables":0},"unopened":[],"bounds":{"document_bytes":16777216,"sheet_cells":100000,"rows_first":2000,"rows_last":500,"rows_between":2000,"halvings":0,"cell_chars":16384,"cell_head_chars":4096},"cells_cut":0,"cells_raw":0,"read":"whole","date_system":"1900"}

{"sheet":"T1","index":0,"n_rows":100,"n_cols":47,"rows_kept":100,"cut":false,"hidden":false,"merged":[[4,23,5,24],[4,26,5,27],[4,29,5,30],[4,32,5,33],[1,1,1,46],[3,6,3,18],[3,42,5,45],[4,35,5,36],[4,38,5,40],[4,20,5,21],[8,41,9,46],[8,35,9,40],[8,23,8,34],[9,23,9,24],[9,25,9,26],[9,27,9,28],[9,29,9,30],[9,31,9,32],[9,33,9,34],[8,1,10,1],[8,4,10,4],[4,6,4,18],[5,6,5,18],[9,11,9,12],[9,13,9,14],[9,15,9,16],[8,5,8,16],[8,17,9,22],[9,5,9,6],[9,7,9,8],[9,9,9,10]]}
[]
[null,"D A F T A R   N I L A I"]
[]
[null,"MATA PELAJARAN",null,null,null,":",{"$f":"RTM!X5","v":"TEMA 1"},null,null,null,null,null,null,null,null,null,null,null,null,null,null,null,null,null,null,null,null,null,null,null,null,null,null,null,null,null,null,null,null,null,null,null,"۩MENU↗"]
[null,"KELAS",null,null,null,":",{"$f":"UPPER(MN!D22)","v":"VI B"},null,null,null,null,null,null,null,null,null,null,null,null,null,"TEMA 1",null,null,"TEMA 2",null,null,"TEMA 3",null,null,"TEMA 4",null,null,"TEMA 5",null,null,"TEMA 6",null,null,"REKAP"]
[null,"TAHUN PELAJARAN",null,null,null,":",{"$f":"MN!D18","v":"2019 - 2020"}]
[]
[]
[null,"No",null,null,"Nama Siswa","NILAI PG",null,null,null,null,null,null,null,null,null,null,null,0.5,null,null,null,null,null,"NILAI ESSAY",null,null,null,null,null,null,null,null,null,null,null,{"$f":"100%-R9","v":0.5},null,null,null,null,null,"JUMLAH"]
[null,null,"No. Induk","NISN",null,"BIN",null,"MTK",null,"IPA",null,"PPKn",null,"IPS",null,"SBDP",null,null,null,null,null,null,null,"BIN",null,"MTK",null,"IPA",null,"PPKn",null,"IPS",null,"SBDP"]
[null,null,null,null,null,"Naskah 1","Naskah 2","Naskah 1","Naskah 2","Naskah 1","Naskah 2","Naskah 1","Naskah 2","Naskah 1","Naskah 2","Naskah 1","Naskah 2","BIN","MTK","IPA","PPKn","IPS","SBDP","Naskah 1","Naskah 2","Naskah 1","Naskah 2","Naskah 1","Naskah 2","Naskah 1","Naskah 2","Naskah 1","Naskah 2","Naskah 1","Naskah 2","BIN","MTK","IPA","PPKn","IPS","SBDP","BIN","MTK","IPA","PPKn","IPS","SBDP"]
[null,1,null,null,{"$f":"SW!G10","v":"ACHID ATHIRIL ARDAN"},53,null,40,null,53,null,53,null,null,55,null,55,{"$f":"IFERROR(ROUND(AVERAGE(F12:G12)*$R$9,0),\"\")","v":27},{"$f":"IFERROR(ROUND(AVERAGE(H12:I12)*$R$9,0),\"\")","v":20},{"$f":"IFERROR(ROUND(AVERAGE(J12:K12)*$R$9,0),\"\")","v":27},{"$f":"IFERROR(ROUND(AVERAGE(L12:M12)*$R$9,0),\"\")","v":27},{"$f":"IFERROR(ROUND(AVERAGE(N12:O12)*$R$9,0),\"\")","v":28},{"$f":"IFERROR(ROUND(AVERAGE(P12:Q12)*$R$9,0),\"\")","v":28},90,null,46,null,90,null,90,null,null,60,null,60,{"$f":"IFERROR(ROUND(AVERAGE(X12:Y12)*$AJ$9,0),\"\")","v":45},{"$f":"IFERROR(ROUND(AVERAGE(Z12:AA12)*$AJ$9,0),\"\")","v":23},{"$f":"IFERROR(ROUND(AVERAGE(AB12:AC12)*$AJ$9,0),\"\")","v":45},{"$f":"IFERROR(ROUND(AVERAGE(AD12:AE12)*$AJ$9,0),\"\")","v":45},{"$f":"IFERROR(ROUND(AVERAGE(AF12:AG12)*$AJ$9,0),\"\")","v":30},{"$f":"IFERROR(ROUND(AVERAGE(AH12:AI12)*$AJ$9,0),\"\")","v":30},{"$f":"IFERROR(ROUND(AVERAGE(R12+AJ12),0),\"\")","v":72},{"$f":"IFERROR(ROUND(AVERAGE(S12+AK12),0),\"\")","v":43},72,72,58,58]
[null,2,null,null,{"$f":"SW!G11","v":"ACHMAD SEPTIAN HAMDANI"},63,null,47,null,63,null,63,null,null,65,null,65,32,24,{"$f":"IFERROR(ROUND(AVERAGE(J13:K13)*$R$9,0),\"\")","v":32},{"$f":"IFERROR(ROUND(AVERAGE(L13:M13)*$R$9,0),\"\")","v":32},{"$f":"IFERROR(ROUND(AVERAGE(N13:O13)*$R$9,0),\"\")","v":33},{"$f":"IFERROR(ROUND(AVERAGE(P13:Q13)*$R$9,0),\"\")","v":33},40,null,28,null,40,null,40,null,null,60,null,60,{"$f":"IFERROR(ROUND(AVERAGE(X13:Y13)*$AJ$9,0),\"\")","v":20},14,{"$f":"IFERROR(ROUND(AVERAGE(AB13:AC13)*$AJ$9,0),\"\")","v":20},{"$f":"IFERROR(ROUND(AVERAGE(AD13:AE13)*$AJ$9,0),\"\")","v":20},{"$f":"IFERROR(ROUND(AVERAGE(AF13:AG13)*$AJ$9,0),\"\")","v":30},{"$f":"IFERROR(ROUND(AVERAGE(AH13:AI13)*$AJ$9,0),\"\")","v":30},{"$f":"IFERROR(ROUND(AVERAGE(R13+AJ13),0),\"\")","v":52},{"$f":"IFERROR(ROUND(AVERAGE(S13+AK13),0),\"\")","v":38},{"$f":"IFERROR(ROUND(AVERAGE(T13+AL13),0),\"\")","v":52},{"$f":"IFERROR(ROUND(AVERAGE(U13+AM13),0),\"\")","v":52},{"$f":"IFERROR(ROUND(AVERAGE(V13+AN13),0),\"\")","v":63},{"$f":"IFERROR(ROUND(AVERAGE(W13+AO13),0),\"\")","v":63}]
[null,3,null,null,{"$f":"SW!G12","v":"ACHMAD SULAIMAN"},20,null,20,null,20,null,20,null,null,30,null,30,10,10,10,10,15,15,30,null,10,null,30,null,30,null,null,60,null,60,15,5,15,15,30,30,25,15,25,25,45,45]
[null,4,null,null,{"$f":"SW!G13","v":"AIRLANGGA DWIKA RIZQI"},37,null,47,null,37,null,37,null,null,35,null,35,19,24,19,19,18,18,60,null,28,null,60,null,60,null,null,40,null,40,30,14,30,30,20,20,49,38,49,49,38,38]
[null,5,null,null,{"$f":"SW!G14","v":"AUFAN AZKAL ABRORI"},37,null,47,null,37,null,37,null,null,30,null,30,19,24,19,19,15,15,70,null,46,null,70,null,70,null,null,30,null,30,35,23,35,35,15,15,54,47,54,54,30,30]
[null,6,null,null,{"$f":"SW!G15","v":"AZZA PRISHAL DWI PUTRA"},37,null,53,null,37,null,37,null,null,35,null,35,19,27,19,19,18,18,60,null,64,null,60,null,60,null,null,70,null,70,30,32,30,30,35,35,49,59,49,49,53,53]
[null,7,null,null,{"$f":"SW!G16","v":"EKA AULIYA` PUTRI"},67,null,40,null,67,null,67,null,null,55,null,55,34,20,34,34,28,28,90,null,28,null,90,null,90,null,null,90,null,90,45,14,45,45,45,45,79,34,79,79,73,73]
[null,8,null,null,{"$f":"SW!G17","v":"ERSA PUSPITA EKA ROSA LINDA"},50,null,40,null,50,null,50,null,null,40,null,40,25,20,25,25,20,20,70,null,28,null,70,null,70,null,null,40,null,40,35,14,35,35,20,20,60,34,60,60,40,40]
[null,9,null,null,{"$f":"SW!G18","v":"FABIYAN TRI BAKTI OKTAFIAN"},57,null,47,null,57,null,57,null,null,40,null,40,29,24,29,29,20,20,60,null,64,null,60,null,60,null,null,60,null,60,30,32,30,30,30,30,59,56,59,59,50,50]
[null,10,null,null,{"$f":"SW!G19","v":"FELISITA APRILIA NUR NIHAYA"},47,null,47,null,47,null,47,null,null,30,null,30,24,24,24,24,15,15,80,null,10,null,80,null,80,null,null,30,null,30,40,5,40,40,15,15,64,29,64,64,30,30]
[null,11,null,null,{"$f":"SW!G20","v":"FIRDA DWI ANDRIANI"},47,null,53,null,47,null,47,null,null,35,null,35,24,27,24,24,18,18,60,null,64,null,60,null,60,null,null,40,null,40,30,32,30,30,20,20,54,59,54,54,38,38]
[null,12,null,null,{"$f":"SW!G21","v":"GILANG AKBAR PRASETYO"},57,null,47,null,57,null,57,null,null,40,null,40,29,24,29,29,20,20,60,null,10,null,60,null,60,null,null,50,null,50,30,5,30,30,25,25,59,29,59,59,45,45]
[null,13,null,null,{"$f":"SW!G22","v":"IFTAH IZZAH EMILIA  MAHMUD"},47,null,73,null,47,null,47,null,null,45,null,45,24,37,24,24,23,23,60,null,28,null,60,null,60,null,null,60,null,60,30,14,30,30,30,30,54,51,54,54,53,53]
[null,14,null,null,{"$f":"SW!G23","v":"INES ARIFANI MAULINA"},53,null,47,null,53,null,53,null,null,40,null,40,27,24,27,27,20,20,60,null,46,null,60,null,60,null,null,80,null,80,30,23,30,30,40,40,57,47,57,57,60,60]
[null,15,null,null,{"$f":"SW!G24","v":"IYAAD  AFLAKHA RAMZII"},50,null,40,null,50,null,50,null,null,60,null,60,25,20,25,25,30,30,70,null,28,null,70,null,70,null,null,80,null,80,35,14,35,35,40,40,60,34,60,60,70,70]
[null,16,null,null,{"$f":"SW!G25","v":"JULI ANDRIYANTO"},23,null,53,null,23,null,23,null,null,35,null,35,12,27,12,12,18,18,70,null,28,null,70,null,70,null,null,40,null,40,35,14,35,35,20,20,47,41,47,47,38,38]
[null,17,null,null,{"$f":"SW!G26","v":"LIYA FEBRIYANI"},77,null,60,null,77,null,77,null,null,50,null,50,39,30,39,39,25,25,90,null,72,null,90,null,90,null,null,70,null,70,45,36,45,45,35,35,84,66,84,84,60,60]
[null,18,null,null,{"$f":"SW!G27","v":"LIZATUL CHAIYUNI"},63,null,53,null,63,null,63,null,null,50,null,50,32,27,32,32,25,25,80,null,46,null,80,null,80,null,null,50,null,50,40,23,40,40,25,25,72,50,72,72,50,50]
[null,19,null,null,{"$f":"SW!G28","v":"M.AL HAFIZ"},63,null,27,null,63,null,63,null,null,55,null,55,32,14,32,32,28,28,100,null,10,null,100,null,100,null,null,80,null,80,50,5,50,50,40,40,82,19,82,82,68,68]
[null,20,null,null,{"$f":"SW!G29","v":"M. RIZKY RIDWAN"},43,null,53,null,43,null,43,null,null,55,null,55,22,27,22,22,28,28,50,null,28,null,50,null,50,null,null,70,null,70,25,14,25,25,35,35,47,41,47,47,63,63]
[null,21,null,null,{"$f":"SW!G30","v":"MOCHAMAD RAFLI DIAN SAPUTRA"},47,null,27,null,47,null,47,null,null,40,null,40,24,14,24,24,20,20,60,null,64,null,60,null,60,null,null,70,null,70,30,32,30,30,35,35,54,46,54,54,55,55]
[null,22,null,null,{"$f":"SW!G31","v":"MOCHAMMAD AFAREL PUTRA RAMDHANA"},83,null,67,null,83,null,83,null,null,55,null,55,42,34,42,42,28,28,100,null,82,null,100,null,100,null,null,90,null,90,50,41,50,50,45,45,92,75,92,92,73,73]
[null,23,null,null,{"$f":"SW!G32","v":"MUHAMAD JEFRI MAULANA"},43,null,53,null,43,null,43,null,null,30,null,30,22,27,22,22,15,15,70,null,64,null,70,null,70,null,null,40,null,40,35,32,35,35,20,20,57,59,57,57,35,35]
[null,24,null,null,{"$f":"SW!G33","v":"MUHAMMAD DWI WILDAN BAGUS KURNIAWAN"},27,null,33,null,27,null,27,null,null,30,null,30,14,17,14,14,15,15,70,null,10,null,70,null,70,null,null,80,null,80,35,5,35,35,40,40,49,22,49,49,55,55]
[null,25,null,null,{"$f":"SW!G34","v":"MUHAMMAD FARIL FIRMANSYA"},40,null,27,null,40,null,40,null,null,25,null,25,20,14,20,20,13,13,50,null,28,null,50,null,50,null,null,60,null,60,25,14,25,25,30,30,45,28,45,45,43,43]
[null,26,null,null,{"$f":"SW!G35","v":"MUHAMMAD FARIZ UBAIDILLA"},53,null,73,null,53,null,53,null,null,50,null,50,27,37,27,27,25,25,60,null,64,null,60,null,60,null,null,70,null,70,30,32,30,30,35,35,57,69,57,57,60,60]
[null,27,null,null,{"$f":"SW!G36","v":"MUHAMMAD MAULANA ZIDANIL ILMI"},73,null,47,null,73,null,73,null,null,25,null,25,37,24,37,37,13,13,90,null,46,null,90,null,90,null,null,60,null,60,45,23,45,45,30,30,82,47,82,82,43,43]
[null,28,null,null,{"$f":"SW!G37","v":"MUHAMMAD SUTRISNO ISMAIL"},37,null,33,null,37,null,37,null,null,35,null,35,19,17,19,19,18,18,40,null,26,null,40,null,40,null,null,60,null,60,20,13,20,20,30,30,39,30,39,39,48,48]
[null,29,null,null,{"$f":"SW!G38","v":"NOVITA ERNIAWAN"},67,null,60,null,67,null,67,null,null,50,null,50,34,30,34,34,25,25,90,null,64,null,90,null,90,null,null,60,null,60,45,32,45,45,30,30,79,62,79,79,55,55]
[null,30,null,null,{"$f":"SW!G39","v":"PUTRI AULIA DWI AGUSTIN"},77,null,40,null,77,null,77,null,null,35,null,35,39,20,39,39,18,18,100,null,26,null,100,null,100,null,null,100,null,100,50,13,50,50,50,50,89,33,89,89,68,68]
[null,31,null,null,{"$f":"SW!G40","v":"STANY RAFIDAH RAHMANIA"},30,null,40,null,30,null,30,null,null,25,null,25,15,20,15,15,13,13,40,null,28,null,40,null,40,null,null,40,null,40,20,14,20,20,20,20,35,34,35,35,33,33]
[null,32,null,null,{"$f":"SW!G41","v":"USWATUN KHASANAH"},50,null,40,null,50,null,50,null,null,40,null,40,25,20,25,25,20,20,100,null,10,null,100,null,100,null,null,80,null,80,50,5,50,50,40,40,75,25,75,75,60,60]
[null,33,null,null,{"$f":"SW!G42","v":"VIKROUL KHAMILA"},53,null,53,null,53,null,53,null,null,45,null,45,{"$f":"IFERROR(ROUND(AVERAGE(F44:G44)*$R$9,0),\"\")","v":27},{"$f":"IFERROR(ROUND(AVERAGE(H44:I44)*$R$9,0),\"\")","v":27},27,27,23,23,100,null,100,null,100,null,100,null,null,80,null,80,50,50,50,50,40,40,77,77,77,77,63,63]
[null,34,null,null,{"$f":"SW!G43","v":0},null,null,null,null,null,null,null,null,null,null,null,null,"","","","","","",null,null,null,null,null,null,null,null,null,null,null,null,"","","","","","","","","","","",""]
[null,35,null,null,{"$f":"SW!G44","v":0},null,null,null,null,null,null,null,null,null,null,null,null,"","","","","","",null,null,null,null,null,null,null,null,null,null,null,null,"","","","","","","","","","","",""]
[null,36,null,null,{"$f":"SW!G45","v":0},null,null,null,null,null,null,null,null,null,null,null,null,"","","","","","",null,null,null,null,null,null,null,null,null,null,null,null,"","","","","","","","","","","",""]
[null,37,null,null,{"$f":"SW!G46","v":0},null,null,null,null,null,null,null,null,null,null,null,null,"","","","","","",null,null,null,null,null,null,null,null,null,null,null,null,"","","","","","","","","","","",""]
[null,38,null,null,{"$f":"SW!G47","v":0},null,null,null,null,null,null,null,null,null,null,null,null,"","","","","","",null,null,null,null,null,null,null,null,null,null,null,null,"","","","","","","","","","","",""]
[null,39,null,null,{"$f":"SW!G48","v":0},null,null,null,null,null,null,null,null,null,null,null,null,"","","","","","",null,null,null,null,null,null,null,null,null,null,null,null,"","","","","","","","","","","",""]
[null,40,null,null,{"$f":"SW!G49","v":0},null,null,null,null,null,null,null,null,null,null,null,null,"","","","","","",null,null,null,null,null,null,null,null,null,null,null,null,"","","","","","","","","","","",""]
[null,41,null,null,{"$f":"SW!G50","v":0},null,null,null,null,null,null,null,null,null,null,null,null,"","","","","","",null,null,null,null,null,null,null,null,null,null,null,null,"","","","","","","","","","","",""]
[null,42,null,null,{"$f":"SW!G51","v":0},null,null,null,null,null,null,null,null,null,null,null,null,"","","","","","",null,null,null,null,null,null,null,null,null,null,null,null,"","","","","","","","","","","",""]
[null,43,null,null,{"$f":"SW!G52","v":0},null,null,null,null,null,null,null,null,null,null,null,null,"","","","","","",null,null,null,null,null,null,null,null,null,null,null,null,"","","","","","","","","","","",""]
[null,44,null,null,{"$f":"SW!G53","v":0},null,null,null,null,null,null,null,null,null,null,null,null,"","","","","","",null,null,null,null,null,null,null,null,null,null,null,null,"","","","","","","","","","","",""]
[null,45,null,null,{"$f":"SW!G54","v":0},null,null,null,null,null,null,null,null,null,null,null,null,"","","","","","",null,null,null,null,null,null,null,null,null,null,null,null,"","","","","","","","","","","",""]
[null,46,null,null,{"$f":"SW!G55","v":0},null,null,null,null,null,null,null,null,null,null,null,null,"","","","","","",null,null,null,null,null,null,null,null,null,null,null,null,"","","","","","","","","","","",""]
[null,47,null,null,{"$f":"SW!G56","v":0},null,null,null,null,null,null,null,null,null,null,null,null,"","","","","","",null,null,null,null,null,null,null,null,null,null,null,null,"","","","","","","","","","","",""]
[null,48,null,null,{"$f":"SW!G57","v":0},null,null,null,null,null,null,null,null,null,null,null,null,"","","","","","",null,null,null,null,null,null,null,null,null,null,null,null,"","","","","","","","","","","",""]
[null,49,null,null,{"$f":"SW!G58","v":0},null,null,null,null,null,null,null,null,null,null,null,null,"","","","","","",null,null,null,null,null,null,null,null,null,null,null,null,"","","","","","","","","","","",""]
[null,50,null,null,{"$f":"SW!G59","v":0},null,null,null,null,null,null,null,null,null,null,null,null,"","","","","","",null,null,null,null,null,null,null,null,null,null,null,null,"","","","","","","","","","","",""]
[null,51,null,null,{"$f":"SW!G60","v":0},null,null,null,null,null,null,null,null,null,null,null,null,"","","","","","",null,null,null,null,null,null,null,null,null,null,null,null,"","","","","","","","","","","",""]
[null,52,null,null,{"$f":"SW!G61","v":0},null,null,null,null,null,null,null,null,null,null,null,null,"","","","","","",null,null,null,null,null,null,null,null,null,null,null,null,"","","","","","","","","","","",""]
[null,53,null,null,{"$f":"SW!G62","v":0},null,null,null,null,null,null,null,null,null,null,null,null,"","","","","","",null,null,null,null,null,null,null,null,null,null,null,null,"","","","","","","","","","","",""]
[null,54,null,null,{"$f":"SW!G63","v":0},null,null,null,null,null,null,null,null,null,null,null,null,"","","","","","",null,null,null,null,null,null,null,null,null,null,null,null,"","","","","","","","","","","",""]
[null,55,null,null,{"$f":"SW!G64","v":0},null,null,null,null,null,null,null,null,null,null,null,null,"","","","","","",null,null,null,null,null,null,null,null,null,null,null,null,"","","","","","","","","","","",""]
[null,56,null,null,{"$f":"SW!G65","v":0},null,null,null,null,null,null,null,null,null,null,null,null,"","","","","","",null,null,null,null,null,null,null,null,null,null,null,null,"","","","","","","","","","","",""]
[null,57,null,null,{"$f":"SW!G66","v":0},null,null,null,null,null,null,null,null,null,null,null,null,"","","","","","",null,null,null,null,null,null,null,null,null,null,null,null,"","","","","","","","","","","",""]
[null,58,null,null,{"$f":"SW!G67","v":0},null,null,null,null,null,null,null,null,null,null,null,null,"","","","","","",null,null,null,null,null,null,null,null,null,null,null,null,"","","","","","","","","","","",""]
[null,59,null,null,{"$f":"SW!G68","v":0},null,null,null,null,null,null,null,null,null,null,null,null,"","","","","","",null,null,null,null,null,null,null,null,null,null,null,null,"","","","","","","","","","","",""]
[null,60,null,null,{"$f":"SW!G69","v":0},null,null,null,null,null,null,null,null,null,null,null,null,"","","","","","",null,null,null,null,null,null,null,null,null,null,null,null,"","","","","","","","","","","",""]
[null,61,null,null,{"$f":"SW!G70","v":0},null,null,null,null,null,null,null,null,null,null,null,null,"","","","","","",null,null,null,null,null,null,null,null,null,null,null,null,"","","","","","","","","","","",""]
[null,62,null,null,{"$f":"SW!G71","v":0},null,null,null,null,null,null,null,null,null,null,null,null,"","","","","","",null,null,null,null,null,null,null,null,null,null,null,null,"","","","","","","","","","","",""]
[null,63,null,null,{"$f":"SW!G72","v":0},null,null,null,null,null,null,null,null,null,null,null,null,"","","","","","",null,null,null,null,null,null,null,null,null,null,null,null,"","","","","","","","","","","",""]
[null,64,null,null,{"$f":"SW!G73","v":0},null,null,null,null,null,null,null,null,null,null,null,null,"","","","","","",null,null,null,null,null,null,null,null,null,null,null,null,"","","","","","","","","","","",""]
[null,65,null,null,{"$f":"SW!G74","v":0},null,null,null,null,null,null,null,null,null,null,null,null,{"$f":"IFERROR(ROUND(AVERAGE(F76:G76)*$R$9,0),\"\")","v":""},{"$f":"IFERROR(ROUND(AVERAGE(H76:I76)*$R$9,0),\"\")","v":""},"","","","",null,null,null,null,null,null,null,null,null,null,null,null,"","","","","","","","","","","",""]
[null,66,null,null,{"$f":"SW!G75","v":0},null,null,null,null,null,null,null,null,null,null,null,null,"","",{"$f":"IFERROR(ROUND(AVERAGE(J77:K77)*$R$9,0),\"\")","v":""},{"$f":"IFERROR(ROUND(AVERAGE(L77:M77)*$R$9,0),\"\")","v":""},{"$f":"IFERROR(ROUND(AVERAGE(N77:O77)*$R$9,0),\"\")","v":""},{"$f":"IFERROR(ROUND(AVERAGE(P77:Q77)*$R$9,0),\"\")","v":""},null,null,null,null,null,null,null,null,null,null,null,null,{"$f":"IFERROR(ROUND(AVERAGE(X77:Y77)*$AJ$9,0),\"\")","v":""},{"$f":"IFERROR(ROUND(AVERAGE(Z77:AA77)*$AJ$9,0),\"\")","v":""},{"$f":"IFERROR(ROUND(AVERAGE(AB77:AC77)*$AJ$9,0),\"\")","v":""},{"$f":"IFERROR(ROUND(AVERAGE(AD77:AE77)*$AJ$9,0),\"\")","v":""},{"$f":"IFERROR(ROUND(AVERAGE(AF77:AG77)*$AJ$9,0),\"\")","v":""},{"$f":"IFERROR(ROUND(AVERAGE(AH77:AI77)*$AJ$9,0),\"\")","v":""},{"$f":"IFERROR(ROUND(AVERAGE(R77+AJ77),0),\"\")","v":""},{"$f":"IFERROR(ROUND(AVERAGE(S77+AK77),0),\"\")","v":""},{"$f":"IFERROR(ROUND(AVERAGE(T77+AL77),0),\"\")","v":""},{"$f":"IFERROR(ROUND(AVERAGE(U77+AM77),0),\"\")","v":""},{"$f":"IFERROR(ROUND(AVERAGE(V77+AN77),0),\"\")","v":""},{"$f":"IFERROR(ROUND(AVERAGE(W77+AO77),0),\"\")","v":""}]
[null,67,null,null,{"$f":"SW!G76","v":0},null,null,null,null,null,null,null,null,null,null,null,null,"","","","","","",null,null,null,null,null,null,null,null,null,null,null,null,"","","","","","","","","","","",""]
[null,68,null,null,{"$f":"SW!G77","v":0},null,null,null,null,null,null,null,null,null,null,null,null,"","","","","","",null,null,null,null,null,null,null,null,null,null,null,null,"","","","","","","","","","","",""]
[null,69,null,null,{"$f":"SW!G78","v":0},null,null,null,null,null,null,null,null,null,null,null,null,"","","","","","",null,null,null,null,null,null,null,null,null,null,null,null,"","","","","","","","","","","",""]
[null,70,null,null,{"$f":"SW!G79","v":0},null,null,null,null,null,null,null,null,null,null,null,null,"","","","","","",null,null,null,null,null,null,null,null,null,null,null,null,"","","","","","","","","","","",""]
[null,71,null,null,{"$f":"SW!G80","v":0},null,null,null,null,null,null,null,null,null,null,null,null,"","","","","","",null,null,null,null,null,null,null,null,null,null,null,null,"","","","","","","","","","","",""]
[null,72,null,null,{"$f":"SW!G81","v":0},null,null,null,null,null,null,null,null,null,null,null,null,"","","","","","",null,null,null,null,null,null,null,null,null,null,null,null,"","","","","","","","","","","",""]
[null,73,null,null,{"$f":"SW!G82","v":0},null,null,null,null,null,null,null,null,null,null,null,null,"","","","","","",null,null,null,null,null,null,null,null,null,null,null,null,"","","","","","","","","","","",""]
[null,74,null,null,{"$f":"SW!G83","v":0},null,null,null,null,null,null,null,null,null,null,null,null,"","","","","","",null,null,null,null,null,null,null,null,null,null,null,null,"","","","","","","","","","","",""]
[null,75,null,null,{"$f":"SW!G84","v":0},null,null,null,null,null,null,null,null,null,null,null,null,"","","","","","",null,null,null,null,null,null,null,null,null,null,null,null,"","","","","","","","","","","",""]
[null,76,null,null,{"$f":"SW!G85","v":0},null,null,null,null,null,null,null,null,null,null,null,null,"","","","","","",null,null,null,null,null,null,null,null,null,null,null,null,"","","","","","","","","","","",""]
[null,77,null,null,{"$f":"SW!G86","v":0},null,null,null,null,null,null,null,null,null,null,null,null,"","","","","","",null,null,null,null,null,null,null,null,null,null,null,null,"","","","","","","","","","","",""]
[null,78,null,null,{"$f":"SW!G87","v":0},null,null,null,null,null,null,null,null,null,null,null,null,"","","","","","",null,null,null,null,null,null,null,null,null,null,null,null,"","","","","","","","","","","",""]
[null,79,null,null,{"$f":"SW!G88","v":0},null,null,null,null,null,null,null,null,null,null,null,null,"","","","","","",null,null,null,null,null,null,null,null,null,null,null,null,"","","","","","","","","","","",""]
[null,80,null,null,{"$f":"SW!G89","v":0},null,null,null,null,null,null,null,null,null,null,null,null,"","","","","","",null,null,null,null,null,null,null,null,null,null,null,null,"","","","","","","","","","","",""]
[null,81,null,null,{"$f":"SW!G90","v":0},null,null,null,null,null,null,null,null,null,null,null,null,"","","","","","",null,null,null,null,null,null,null,null,null,null,null,null,"","","","","","","","","","","",""]
[null,82,null,null,{"$f":"SW!G91","v":0},null,null,null,null,null,null,null,null,null,null,null,null,"","","","","","",null,null,null,null,null,null,null,null,null,null,null,null,"","","","","","","","","","","",""]
[null,83,null,null,{"$f":"SW!G92","v":0},null,null,null,null,null,null,null,null,null,null,null,null,"","","","","","",null,null,null,null,null,null,null,null,null,null,null,null,"","","","","","","","","","","",""]
[null,84,null,null,{"$f":"SW!G93","v":0},null,null,null,null,null,null,null,null,null,null,null,null,"","","","","","",null,null,null,null,null,null,null,null,null,null,null,null,"","","","","","","","","","","",""]
[null,85,null,null,{"$f":"SW!G94","v":0},null,null,null,null,null,null,null,null,null,null,null,null,"","","","","","",null,null,null,null,null,null,null,null,null,null,null,null,"","","","","","","","","","","",""]
[null,86,null,null,{"$f":"SW!G95","v":0},null,null,null,null,null,null,null,null,null,null,null,null,"","","","","","",null,null,null,null,null,null,null,null,null,null,null,null,"","","","","","","","","","","",""]
[null,87,null,null,{"$f":"SW!G96","v":0},null,null,null,null,null,null,null,null,null,null,null,null,"","","","","","",null,null,null,null,null,null,null,null,null,null,null,null,"","","","","","","","","","","",""]
[null,88,null,null,{"$f":"SW!G97","v":0},null,null,null,null,null,null,null,null,null,null,null,null,"","","","","","",null,null,null,null,null,null,null,null,null,null,null,null,"","","","","","","","","","","",""]
[null,89,null,null,{"$f":"SW!G98","v":0},null,null,null,null,null,null,null,null,null,null,null,null,"","","","","","",null,null,null,null,null,null,null,null,null,null,null,null,"","","","","","","","","","","",""]

{"sheet":"T2","index":1,"n_rows":100,"n_cols":47,"rows_kept":100,"cut":false,"hidden":false,"merged":[[4,20,5,21],[4,23,5,24],[4,26,5,27],[4,29,5,30],[4,32,5,33],[9,29,9,30],[9,31,9,32],[9,33,9,34],[4,35,5,36],[4,38,5,40],[9,13,9,14],[9,15,9,16],[9,23,9,24],[9,25,9,26],[9,27,9,28],[8,1,10,1],[8,4,10,4],[8,5,8,16],[8,17,9,22],[1,1,1,46],[3,6,3,18],[3,42,5,45],[4,6,4,18],[5,6,5,18],[8,23,8,34],[8,35,9,40],[8,41,9,46],[9,5,9,6],[9,7,9,8],[9,9,9,10],[9,11,9,12]]}
[]
[null,"D A F T A R   N I L A I"]
[]
[null,"MATA PELAJARAN",null,null,null,":",{"$f":"RTM!AA5","v":"TEMA 2"},null,null,null,null,null,null,null,null,null,null,null,null,null,null,null,null,null,null,null,null,null,null,null,null,null,null,null,null,null,null,null,null,null,null,null,"۩MENU↗"]
[null,"KELAS",null,null,null,":",{"$f":"UPPER(MN!D22)","v":"VI B"},null,null,null,null,null,null,null,null,null,null,null,null,null,"TEMA 1",null,null,"TEMA 2",null,null,"TEMA 3",null,null,"TEMA 4",null,null,"TEMA 5",null,null,"TEMA 6",null,null,"REKAP"]
[null,"TAHUN PELAJARAN",null,null,null,":",{"$f":"MN!D18","v":"2019 - 2020"}]
[]
[]
[null,"No",null,null,"Nama Siswa","NILAI PG",null,null,null,null,null,null,null,null,null,null,null,0.5,null,null,null,null,null,"NILAI ESSAY",null,null,null,null,null,null,null,null,null,null,null,{"$f":"100%-R9","v":0.5},null,null,null,null,null,"JUMLAH"]
[null,null,"No. Induk","NISN",null,"BIN",null,"MTK",null,"IPA",null,"PPKn",null,"IPS",null,"SBDP",null,null,null,null,null,null,null,"BIN",null,"MTK",null,"IPA",null,"PPKn",null,"IPS",null,"SBDP"]
[null,null,null,null,null,"Naskah 1","Naskah 2","Naskah 1","Naskah 2","Naskah 1","Naskah 2","Naskah 1","Naskah 2","Naskah 1","Naskah 2","Naskah 1","Naskah 2","BIN","MTK","IPA","PPKn","IPS","SBDP","Naskah 1","Naskah 2","Naskah 1","Naskah 2","Naskah 1","Naskah 2","Naskah 1","Naskah 2","Naskah 1","Naskah 2","Naskah 1","Naskah 2","BIN","MTK","IPA","PPKn","IPS","SBDP","BIN","MTK","IPA","PPKn","IPS","SBDP"]
[null,1,null,null,{"$f":"SW!G10","v":"ACHID ATHIRIL ARDAN"},30,null,null,null,30,null,30,null,null,40,null,40,{"$f":"IFERROR(ROUND(AVERAGE(F12:G12)*$R$9,0),\"\")","v":15},{"$f":"IFERROR(ROUND(AVERAGE(H12:I12)*$R$9,0),\"\")","v":""},{"$f":"IFERROR(ROUND(AVERAGE(J12:K12)*$R$9,0),\"\")","v":15},{"$f":"IFERROR(ROUND(AVERAGE(L12:M12)*$R$9,0),\"\")","v":15},{"$f":"IFERROR(ROUND(AVERAGE(N12:O12)*$R$9,0),\"\")","v":20},{"$f":"IFERROR(ROUND(AVERAGE(P12:Q12)*$R$9,0),\"\")","v":20},70,null,null,null,70,null,70,null,null,40,null,40,{"$f":"IFERROR(ROUND(AVERAGE(X12:Y12)*$AJ$9,0),\"\")","v":35},{"$f":"IFERROR(ROUND(AVERAGE(Z12:AA12)*$AJ$9,0),\"\")","v":""},{"$f":"IFERROR(ROUND(AVERAGE(AB12:AC12)*$AJ$9,0),\"\")","v":35},{"$f":"IFERROR(ROUND(AVERAGE(AD12:AE12)*$AJ$9,0),\"\")","v":35},{"$f":"IFERROR(ROUND(AVERAGE(AF12:AG12)*$AJ$9,0),\"\")","v":20},{"$f":"IFERROR(ROUND(AVERAGE(AH12:AI12)*$AJ$9,0),\"\")","v":20},{"$f":"IFERROR(ROUND(AVERAGE(R12+AJ12),0),\"\")","v":50},"",50,50,40,40]
[null,2,null,null,{"$f":"SW!G11","v":"ACHMAD SEPTIAN HAMDANI"},67,null,null,null,67,null,67,null,null,45,null,45,{"$f":"IFERROR(ROUND(AVERAGE(F13:G13)*$R$9,0),\"\")","v":34},{"$f":"IFERROR(ROUND(AVERAGE(H13:I13)*$R$9,0),\"\")","v":""},{"$f":"IFERROR(ROUND(AVERAGE(J13:K13)*$R$9,0),\"\")","v":34},{"$f":"IFERROR(ROUND(AVERAGE(L13:M13)*$R$9,0),\"\")","v":34},{"$f":"IFERROR(ROUND(AVERAGE(N13:O13)*$R$9,0),\"\")","v":23},{"$f":"IFERROR(ROUND(AVERAGE(P13:Q13)*$R$9,0),\"\")","v":23},100,null,null,null,100,null,100,null,null,60,null,60,{"$f":"IFERROR(ROUND(AVERAGE(X13:Y13)*$AJ$9,0),\"\")","v":50},"",{"$f":"IFERROR(ROUND(AVERAGE(AB13:AC13)*$AJ$9,0),\"\")","v":50},{"$f":"IFERROR(ROUND(AVERAGE(AD13:AE13)*$AJ$9,0),\"\")","v":50},{"$f":"IFERROR(ROUND(AVERAGE(AF13:AG13)*$AJ$9,0),\"\")","v":30},{"$f":"IFERROR(ROUND(AVERAGE(AH13:AI13)*$AJ$9,0),\"\")","v":30},84,"",84,84,53,53]
[null,3,null,null,{"$f":"SW!G12","v":"ACHMAD SULAIMAN"},13,null,null,null,13,null,13,null,null,20,null,20,7,"",7,7,10,10,60,null,null,null,60,null,60,null,null,60,null,60,30,"",30,30,30,30,37,"",37,37,40,40]
[null,4,null,null,{"$f":"SW!G13","v":"AIRLANGGA DWIKA RIZQI"},40,null,null,null,40,null,40,null,null,30,null,30,20,"",20,20,15,15,60,null,null,null,60,null,60,null,null,60,null,60,30,"",30,30,30,30,50,"",50,50,45,45]
[null,5,null,null,{"$f":"SW!G14","v":"AUFAN AZKAL ABRORI"},30,null,null,null,30,null,30,null,null,45,null,45,15,"",15,15,23,23,60,null,null,null,60,null,60,null,null,80,null,80,30,"",30,30,40,40,45,"",45,45,63,63]
[null,6,null,null,{"$f":"SW!G15","v":"AZZA PRISHAL DWI PUTRA"},47,null,null,null,47,null,47,null,null,45,null,45,24,"",24,24,23,23,60,null,null,null,60,null,60,null,null,40,null,40,30,"",30,30,20,20,54,"",54,54,43,43]
[null,7,null,null,{"$f":"SW!G16","v":"EKA AULIYA` PUTRI"},73,null,null,null,73,null,73,null,null,35,null,35,37,"",37,37,18,18,80,null,null,null,80,null,80,null,null,60,null,60,40,"",40,40,30,30,77,"",77,77,48,48]
[null,8,null,null,{"$f":"SW!G17","v":"ERSA PUSPITA EKA ROSA LINDA"},50,null,null,null,50,null,50,null,null,25,null,25,25,"",25,25,13,13,80,null,null,null,80,null,80,null,null,80,null,80,40,"",40,40,40,40,65,"",65,65,53,53]
[null,9,null,null,{"$f":"SW!G18","v":"FABIYAN TRI BAKTI OKTAFIAN"},50,null,null,null,50,null,50,null,null,30,null,30,25,"",25,25,15,15,70,null,null,null,70,null,70,null,null,80,null,80,35,"",35,35,40,40,60,"",60,60,55,55]
[null,10,null,null,{"$f":"SW!G19","v":"FELISITA APRILIA NUR NIHAYA"},50,null,null,null,50,null,50,null,null,50,null,50,25,"",25,25,25,25,100,null,null,null,100,null,100,null,null,40,null,40,50,"",50,50,20,20,75,"",75,75,45,45]
[null,11,null,null,{"$f":"SW!G20","v":"FIRDA DWI ANDRIANI"},53,null,null,null,53,null,53,null,null,40,null,40,27,"",27,27,20,20,80,null,null,null,80,null,80,null,null,60,null,60,40,"",40,40,30,30,67,"",67,67,50,50]
[null,12,null,null,{"$f":"SW!G21","v":"GILANG AKBAR PRASETYO"},40,null,null,null,40,null,40,null,null,35,null,35,20,"",20,20,18,18,60,null,null,null,60,null,60,null,null,40,null,40,30,"",30,30,20,20,50,"",50,50,38,38]
[null,13,null,null,{"$f":"SW!G22","v":"IFTAH IZZAH EMILIA  MAHMUD"},57,null,null,null,57,null,57,null,null,40,null,40,29,"",29,29,20,20,80,null,null,null,80,null,80,null,null,80,null,80,40,"",40,40,40,40,69,"",69,69,60,60]
[null,14,null,null,{"$f":"SW!G23","v":"INES ARIFANI MAULINA"},60,null,null,null,60,null,60,null,null,45,null,45,30,"",30,30,23,23,80,null,null,null,80,null,80,null,null,80,null,80,40,"",40,40,40,40,70,"",70,70,63,63]
[null,15,null,null,{"$f":"SW!G24","v":"IYAAD  AFLAKHA RAMZII"},63,null,null,null,63,null,63,null,null,45,null,45,32,"",32,32,23,23,80,null,null,null,80,null,80,null,null,80,null,80,40,"",40,40,40,40,72,"",72,72,63,63]
[null,16,null,null,{"$f":"SW!G25","v":"JULI ANDRIYANTO"},47,null,null,null,47,null,47,null,null,20,null,20,24,"",24,24,10,10,40,null,null,null,40,null,40,null,null,30,null,30,20,"",20,20,15,15,44,"",44,44,25,25]
[null,17,null,null,{"$f":"SW!G26","v":"LIYA FEBRIYANI"},60,null,null,null,60,null,60,null,null,35,null,35,30,"",30,30,18,18,80,null,null,null,80,null,80,null,null,60,null,60,40,"",40,40,30,30,{"$f":"IFERROR(ROUND(AVERAGE(R28+AJ28),0),\"\")","v":70},"",70,70,48,48]
[null,18,null,null,{"$f":"SW!G27","v":"LIZATUL CHAIYUNI"},50,null,null,null,50,null,50,null,null,25,null,25,25,"",25,25,13,13,60,null,null,null,60,null,60,null,null,60,null,60,30,"",30,30,30,30,55,"",55,55,43,43]
[null,19,null,null,{"$f":"SW!G28","v":"M.AL HAFIZ"},63,null,null,null,63,null,63,null,null,30,null,30,32,"",32,32,15,15,60,null,null,null,60,null,60,null,null,40,null,40,30,"",30,30,20,20,62,"",62,62,35,35]
[null,20,null,null,{"$f":"SW!G29","v":"M. RIZKY RIDWAN"},47,null,null,null,47,null,47,null,null,45,null,45,24,"",24,24,23,23,60,null,null,null,60,null,60,null,null,20,null,20,30,"",30,30,10,10,54,"",54,54,33,33]
[null,21,null,null,{"$f":"SW!G30","v":"MOCHAMAD RAFLI DIAN SAPUTRA"},37,null,null,null,37,null,37,null,null,55,null,55,19,"",19,19,28,28,100,null,null,null,100,null,100,null,null,60,null,60,50,"",50,50,30,30,69,"",69,69,58,58]
[null,22,null,null,{"$f":"SW!G31","v":"MOCHAMMAD AFAREL PUTRA RAMDHANA"},67,null,null,null,67,null,67,null,null,15,null,15,34,"",34,34,8,8,100,null,null,null,100,null,100,null,null,60,null,60,50,"",50,50,30,30,84,"",84,84,38,38]
[null,23,null,null,{"$f":"SW!G32","v":"MUHAMAD JEFRI MAULANA"},60,null,null,null,60,null,60,null,null,40,null,40,30,"",30,30,20,20,80,null,null,null,80,null,80,null,null,100,null,100,40,"",40,40,50,50,70,"",70,70,70,70]
[null,24,null,null,{"$f":"SW!G33","v":"MUHAMMAD DWI WILDAN BAGUS KURNIAWAN"},27,null,null,null,27,null,27,null,null,50,null,50,14,"",14,14,25,25,60,null,null,null,60,null,60,null,null,20,null,20,30,"",30,30,10,10,44,"",44,44,35,35]
[null,25,null,null,{"$f":"SW!G34","v":"MUHAMMAD FARIL FIRMANSYA"},30,null,null,null,30,null,30,null,null,40,null,40,15,"",15,15,20,20,80,null,null,null,80,null,80,null,null,80,null,80,40,"",40,40,40,40,55,"",55,55,60,60]
[null,26,null,null,{"$f":"SW!G35","v":"MUHAMMAD FARIZ UBAIDILLA"},73,null,null,null,73,null,73,null,null,35,null,35,37,"",37,37,18,18,80,null,null,null,80,null,80,null,null,80,null,80,40,"",40,40,40,40,77,"",77,77,58,58]
[null,27,null,null,{"$f":"SW!G36","v":"MUHAMMAD MAULANA ZIDANIL ILMI"},67,null,null,null,67,null,67,null,null,40,null,40,34,"",34,34,20,20,80,null,null,null,80,null,80,null,null,60,null,60,40,"",40,40,30,30,74,"",74,74,50,50]
[null,28,null,null,{"$f":"SW!G37","v":"MUHAMMAD SUTRISNO ISMAIL"},27,null,null,null,27,null,27,null,null,55,null,55,14,"",14,14,28,28,80,null,null,null,80,null,80,null,null,60,null,60,40,"",40,40,30,30,54,"",54,54,58,58]
[null,29,null,null,{"$f":"SW!G38","v":"NOVITA ERNIAWAN"},63,null,null,null,63,null,63,null,null,35,null,35,32,"",32,32,18,18,80,null,null,null,80,null,80,null,null,100,null,100,40,"",40,40,50,50,72,"",72,72,68,68]
[null,30,null,null,{"$f":"SW!G39","v":"PUTRI AULIA DWI AGUSTIN"},53,null,null,null,53,null,53,null,null,50,null,50,27,"",27,27,25,25,80,null,null,null,80,null,80,null,null,80,null,80,40,"",40,40,40,40,67,"",67,67,65,65]
[null,31,null,null,{"$f":"SW!G40","v":"STANY RAFIDAH RAHMANIA"},40,null,null,null,40,null,40,null,null,40,null,40,20,"",20,20,20,20,60,null,null,null,60,null,60,null,null,60,null,60,30,"",30,30,30,30,50,"",50,50,50,50]
[null,32,null,null,{"$f":"SW!G41","v":"USWATUN KHASANAH"},50,null,null,null,50,null,50,null,null,45,null,45,25,"",25,25,23,23,80,null,null,null,80,null,80,null,null,60,null,60,40,"",40,40,30,30,65,"",65,65,53,53]
[null,33,null,null,{"$f":"SW!G42","v":"VIKROUL KHAMILA"},67,null,null,null,67,null,67,null,null,25,null,25,34,"",34,34,13,13,80,null,null,null,80,null,80,null,null,80,null,80,40,"",40,40,40,40,74,"",74,74,53,53]
[null,34,null,null,{"$f":"SW!G43","v":0},null,null,null,null,null,null,null,null,null,null,null,null,"","","","","","",null,null,null,null,null,null,null,null,null,null,null,null,"","","","","","","","","","","",""]
[null,35,null,null,{"$f":"SW!G44","v":0},null,null,null,null,null,null,null,null,null,null,null,null,"","","","","","",null,null,null,null,null,null,null,null,null,null,null,null,"","","","","","","","","","","",""]
[null,36,null,null,{"$f":"SW!G45","v":0},null,null,null,null,null,null,null,null,null,null,null,null,"","","","","","",null,null,null,null,null,null,null,null,null,null,null,null,"","","","","","","","","","","",""]
[null,37,null,null,{"$f":"SW!G46","v":0},null,null,null,null,null,null,null,null,null,null,null,null,"","","","","","",null,null,null,null,null,null,null,null,null,null,null,null,"","","","","","","","","","","",""]
[null,38,null,null,{"$f":"SW!G47","v":0},null,null,null,null,null,null,null,null,null,null,null,null,"","","","","","",null,null,null,null,null,null,null,null,null,null,null,null,"","","","","","","","","","","",""]
[null,39,null,null,{"$f":"SW!G48","v":0},null,null,null,null,null,null,null,null,null,null,null,null,"","","","","","",null,null,null,null,null,null,null,null,null,null,null,null,"","","","","","","","","","","",""]
[null,40,null,null,{"$f":"SW!G49","v":0},null,null,null,null,null,null,null,null,null,null,null,null,"","","","","","",null,null,null,null,null,null,null,null,null,null,null,null,"","","","","","","","","","","",""]
[null,41,null,null,{"$f":"SW!G50","v":0},null,null,null,null,null,null,null,null,null,null,null,null,"","","","","","",null,null,null,null,null,null,null,null,null,null,null,null,"","","","","","","","","","","",""]
[null,42,null,null,{"$f":"SW!G51","v":0},null,null,null,null,null,null,null,null,null,null,null,null,"","","","","","",null,null,null,null,null,null,null,null,null,null,null,null,"","","","","","","","","","","",""]
[null,43,null,null,{"$f":"SW!G52","v":0},null,null,null,null,null,null,null,null,null,null,null,null,"","","","","","",null,null,null,null,null,null,null,null,null,null,null,null,"","","","","","","","","","","",""]
[null,44,null,null,{"$f":"SW!G53","v":0},null,null,null,null,null,null,null,null,null,null,null,null,"","","","","","",null,null,null,null,null,null,null,null,null,null,null,null,"","","","","","","","","","","",""]
[null,45,null,null,{"$f":"SW!G54","v":0},null,null,null,null,null,null,null,null,null,null,null,null,"","","","","","",null,null,null,null,null,null,null,null,null,null,null,null,"","","","","","","","","","","",""]
[null,46,null,null,{"$f":"SW!G55","v":0},null,null,null,null,null,null,null,null,null,null,null,null,"","","","","","",null,null,null,null,null,null,null,null,null,null,null,null,"","","","","","","","","","","",""]
[null,47,null,null,{"$f":"SW!G56","v":0},null,null,null,null,null,null,null,null,null,null,null,null,"","","","","","",null,null,null,null,null,null,null,null,null,null,null,null,"","","","","","","","","","","",""]
[null,48,null,null,{"$f":"SW!G57","v":0},null,null,null,null,null,null,null,null,null,null,null,null,"","","","","","",null,null,null,null,null,null,null,null,null,null,null,null,"","","","","","","","","","","",""]
[null,49,null,null,{"$f":"SW!G58","v":0},null,null,null,null,null,null,null,null,null,null,null,null,"","","","","","",null,null,null,null,null,null,null,null,null,null,null,null,"","","","","","","","","","","",""]
[null,50,null,null,{"$f":"SW!G59","v":0},null,null,null,null,null,null,null,null,null,null,null,null,"","","","","","",null,null,null,null,null,null,null,null,null,null,null,null,"","","","","","","","","","","",""]
[null,51,null,null,{"$f":"SW!G60","v":0},null,null,null,null,null,null,null,null,null,null,null,null,"","","","","","",null,null,null,null,null,null,null,null,null,null,null,null,"","","","","","","","","","","",""]
[null,52,null,null,{"$f":"SW!G61","v":0},null,null,null,null,null,null,null,null,null,null,null,null,"","","","","","",null,null,null,null,null,null,null,null,null,null,null,null,"","","","","","","","","","","",""]
[null,53,null,null,{"$f":"SW!G62","v":0},null,null,null,null,null,null,null,null,null,null,null,null,"","","","","","",null,null,null,null,null,null,null,null,null,null,null,null,"","","","","","","","","","","",""]
[null,54,null,null,{"$f":"SW!G63","v":0},null,null,null,null,null,null,null,null,null,null,null,null,"","","","","","",null,null,null,null,null,null,null,null,null,null,null,null,"","","","","","","","","","","",""]
[null,55,null,null,{"$f":"SW!G64","v":0},null,null,null,null,null,null,null,null,null,null,null,null,"","","","","","",null,null,null,null,null,null,null,null,null,null,null,null,"","","","","","","","","","","",""]
[null,56,null,null,{"$f":"SW!G65","v":0},null,null,null,null,null,null,null,null,null,null,null,null,"","","","","","",null,null,null,null,null,null,null,null,null,null,null,null,"","","","","","","","","","","",""]
[null,57,null,null,{"$f":"SW!G66","v":0},null,null,null,null,null,null,null,null,null,null,null,null,"","","","","","",null,null,null,null,null,null,null,null,null,null,null,null,"","","","","","","","","","","",""]
[null,58,null,null,{"$f":"SW!G67","v":0},null,null,null,null,null,null,null,null,null,null,null,null,"","","","","","",null,null,null,null,null,null,null,null,null,null,null,null,"","","","","","","","","","","",""]
[null,59,null,null,{"$f":"SW!G68","v":0},null,null,null,null,null,null,null,null,null,null,null,null,"","","","","","",null,null,null,null,null,null,null,null,null,null,null,null,"","","","","","","","","",{"$f":"IFERROR(ROUND(AVERAGE(U70+AM70),0),\"\")","v":""},"",""]
[null,60,null,null,{"$f":"SW!G69","v":0},null,null,null,null,null,null,null,null,null,null,null,null,"","","","","","",null,null,null,null,null,null,null,null,null,null,null,null,"","","","","","",{"$f":"IFERROR(ROUND(AVERAGE(R71+AJ71),0),\"\")","v":""},"","","","",""]
[null,61,null,null,{"$f":"SW!G70","v":0},null,null,null,null,null,null,null,null,null,null,null,null,"","","","","","",null,null,null,null,null,null,null,null,null,null,null,null,"","","","","","","","","","","",""]
[null,62,null,null,{"$f":"SW!G71","v":0},null,null,null,null,null,null,null,null,null,null,null,null,"","","","","","",null,null,null,null,null,null,null,null,null,null,null,null,"","","","","","","","","","","",""]
[null,63,null,null,{"$f":"SW!G72","v":0},null,null,null,null,null,null,null,null,null,null,null,null,"","","","","","",null,null,null,null,null,null,null,null,null,null,null,null,"","","","","","","","","","","",""]
[null,64,null,null,{"$f":"SW!G73","v":0},null,null,null,null,null,null,null,null,null,null,null,null,"","","","","","",null,null,null,null,null,null,null,null,null,null,null,null,"","","","","","","","","","","",""]
[null,65,null,null,{"$f":"SW!G74","v":0},null,null,null,null,null,null,null,null,null,null,null,null,"","","","","","",null,null,null,null,null,null,null,null,null,null,null,null,"","","","","","","","","","","",""]
[null,66,null,null,{"$f":"SW!G75","v":0},null,null,null,null,null,null,null,null,null,null,null,null,{"$f":"IFERROR(ROUND(AVERAGE(F77:G77)*$R$9,0),\"\")","v":""},{"$f":"IFERROR(ROUND(AVERAGE(H77:I77)*$R$9,0),\"\")","v":""},{"$f":"IFERROR(ROUND(AVERAGE(J77:K77)*$R$9,0),\"\")","v":""},{"$f":"IFERROR(ROUND(AVERAGE(L77:M77)*$R$9,0),\"\")","v":""},{"$f":"IFERROR(ROUND(AVERAGE(N77:O77)*$R$9,0),\"\")","v":""},{"$f":"IFERROR(ROUND(AVERAGE(P77:Q77)*$R$9,0),\"\")","v":""},null,null,null,null,null,null,null,null,null,null,null,null,{"$f":"IFERROR(ROUND(AVERAGE(X77:Y77)*$AJ$9,0),\"\")","v":""},{"$f":"IFERROR(ROUND(AVERAGE(Z77:AA77)*$AJ$9,0),\"\")","v":""},{"$f":"IFERROR(ROUND(AVERAGE(AB77:AC77)*$AJ$9,0),\"\")","v":""},{"$f":"IFERROR(ROUND(AVERAGE(AD77:AE77)*$AJ$9,0),\"\")","v":""},{"$f":"IFERROR(ROUND(AVERAGE(AF77:AG77)*$AJ$9,0),\"\")","v":""},{"$f":"IFERROR(ROUND(AVERAGE(AH77:AI77)*$AJ$9,0),\"\")","v":""},"","","","","",""]
[null,67,null,null,{"$f":"SW!G76","v":0},null,null,null,null,null,null,null,null,null,null,null,null,"","","","","","",null,null,null,null,null,null,null,null,null,null,null,null,"","","","","","","","","","","",""]
[null,68,null,null,{"$f":"SW!G77","v":0},null,null,null,null,null,null,null,null,null,null,null,null,"","","","","","",null,null,null,null,null,null,null,null,null,null,null,null,"","","","","","","","","","","",""]
[null,69,null,null,{"$f":"SW!G78","v":0},null,null,null,null,null,null,null,null,null,null,null,null,"","","","","","",null,null,null,null,null,null,null,null,null,null,null,null,"","","","","","","","","","","",""]
[null,70,null,null,{"$f":"SW!G79","v":0},null,null,null,null,null,null,null,null,null,null,null,null,"","","","","","",null,null,null,null,null,null,null,null,null,null,null,null,"","","","","","","","","","","",""]
[null,71,null,null,{"$f":"SW!G80","v":0},null,null,null,null,null,null,null,null,null,null,null,null,"","","","","","",null,null,null,null,null,null,null,null,null,null,null,null,"","","","","","","","","","","",""]
[null,72,null,null,{"$f":"SW!G81","v":0},null,null,null,null,null,null,null,null,null,null,null,null,"","","","","","",null,null,null,null,null,null,null,null,null,null,null,null,"","","","","","","","","","","",""]
[null,73,null,null,{"$f":"SW!G82","v":0},null,null,null,null,null,null,null,null,null,null,null,null,"","","","","","",null,null,null,null,null,null,null,null,null,null,null,null,"","","","","","","","","","","",""]
[null,74,null,null,{"$f":"SW!G83","v":0},null,null,null,null,null,null,null,null,null,null,null,null,"","","","","","",null,null,null,null,null,null,null,null,null,null,null,null,"","","","","","","","","","","",""]
[null,75,null,null,{"$f":"SW!G84","v":0},null,null,null,null,null,null,null,null,null,null,null,null,"","","","","","",null,null,null,null,null,null,null,null,null,null,null,null,"","","","","","","","","","","",""]
[null,76,null,null,{"$f":"SW!G85","v":0},null,null,null,null,null,null,null,null,null,null,null,null,"","","","","","",null,null,null,null,null,null,null,null,null,null,null,null,"","","","","","","","","","","",""]
[null,77,null,null,{"$f":"SW!G86","v":0},null,null,null,null,null,null,null,null,null,null,null,null,"","","","","","",null,null,null,null,null,null,null,null,null,null,null,null,"","","","","","","","","","","",""]
[null,78,null,null,{"$f":"SW!G87","v":0},null,null,null,null,null,null,null,null,null,null,null,null,"","","","","","",null,null,null,null,null,null,null,null,null,null,null,null,"","","","","","","","","","","",""]
[null,79,null,null,{"$f":"SW!G88","v":0},null,null,null,null,null,null,null,null,null,null,null,null,"","","","","","",null,null,null,null,null,null,null,null,null,null,null,null,"","","","","","","","","","","",""]
[null,80,null,null,{"$f":"SW!G89","v":0},null,null,null,null,null,null,null,null,null,null,null,null,"","","","","","",null,null,null,null,null,null,null,null,null,null,null,null,"","","","","","","","","","","",""]
[null,81,null,null,{"$f":"SW!G90","v":0},null,null,null,null,null,null,null,null,null,null,null,null,"","","","","","",null,null,null,null,null,null,null,null,null,null,null,null,"","","","","","","","","","","",""]
[null,82,null,null,{"$f":"SW!G91","v":0},null,null,null,null,null,null,null,null,null,null,null,null,"","","","","","",null,null,null,null,null,null,null,null,null,null,null,null,"","","","","","","","","","","",""]
[null,83,null,null,{"$f":"SW!G92","v":0},null,null,null,null,null,null,null,null,null,null,null,null,"","","","","","",null,null,null,null,null,null,null,null,null,null,null,null,"","","","","","","","","","","",""]
[null,84,null,null,{"$f":"SW!G93","v":0},null,null,null,null,null,null,null,null,null,null,null,null,"","","","","","",null,null,null,null,null,null,null,null,null,null,null,null,"","","","","","","","","","","",""]
[null,85,null,null,{"$f":"SW!G94","v":0},null,null,null,null,null,null,null,null,null,null,null,null,"","","","","","",null,null,null,null,null,null,null,null,null,null,null,null,"","","","","","","","","","","",""]
[null,86,null,null,{"$f":"SW!G95","v":0},null,null,null,null,null,null,null,null,null,null,null,null,"","","","","","",null,null,null,null,null,null,null,null,null,null,null,null,"","","","","","","","","","","",""]
[null,87,null,null,{"$f":"SW!G96","v":0},null,null,null,null,null,null,null,null,null,null,null,null,"","","","","","",null,null,null,null,null,null,null,null,null,null,null,null,"","","","","","","","","","","",""]
[null,88,null,null,{"$f":"SW!G97","v":0},null,null,null,null,null,null,null,null,null,null,null,null,"","","","","","",null,null,null,null,null,null,null,null,null,null,null,null,"","","","","","","","","","","",""]
[null,89,null,null,{"$f":"SW!G98","v":0},null,null,null,null,null,null,null,null,null,null,null,null,"","","","","","",null,null,null,null,null,null,null,null,null,null,null,null,"","","","","","","","","","","",""]

{"sheet":"T3","index":2,"n_rows":100,"n_cols":47,"rows_kept":100,"cut":false,"hidden":false,"merged":[[8,35,9,40],[8,41,9,46],[9,5,9,6],[9,7,9,8],[9,9,9,10],[9,11,9,12],[9,13,9,14],[9,31,9,32],[9,33,9,34],[9,15,9,16],[9,23,9,24],[9,25,9,26],[9,27,9,28],[9,29,9,30],[8,1,10,1],[8,4,10,4],[8,5,8,16],[8,17,9,22],[8,23,8,34],[1,1,1,46],[3,6,3,18],[3,42,5,45],[4,6,4,18],[5,6,5,18],[4,20,5,21],[4,23,5,24],[4,26,5,27],[4,29,5,30],[4,32,5,33],[4,35,5,36],[4,38,5,40]]}
[]
[null,"D A F T A R   N I L A I"]
[]
[null,"MATA PELAJARAN",null,null,null,":",{"$f":"RTM!AD5","v":"TEMA 3"},null,null,null,null,null,null,null,null,null,null,null,null,null,null,null,null,null,null,null,null,null,null,null,null,null,null,null,null,null,null,null,null,null,null,null,"۩MENU↗"]
[null,"KELAS",null,null,null,":",{"$f":"UPPER(MN!D22)","v":"VI B"},null,null,null,null,null,null,null,null,null,null,null,null,null,"TEMA 1",null,null,"TEMA 2",null,null,"TEMA 3",null,null,"TEMA 4",null,null,"TEMA 5",null,null,"TEMA 6",null,null,"REKAP"]
[null,"TAHUN PELAJARAN",null,null,null,":",{"$f":"MN!D18","v":"2019 - 2020"}]
[]
[]
[null,"No",null,null,"Nama Siswa","NILAI PG",null,null,null,null,null,null,null,null,null,null,null,0.5,null,null,null,null,null,"NILAI ESSAY",null,null,null,null,null,null,null,null,null,null,null,{"$f":"100%-R9","v":0.5},null,null,null,null,null,"JUMLAH"]
[null,null,"No. Induk","NISN",null,"BIN",null,"MTK",null,"IPA",null,"PPKn",null,"IPS",null,"SBDP",null,null,null,null,null,null,null,"BIN",null,"MTK",null,"IPA",null,"PPKn",null,"IPS",null,"SBDP"]
[null,null,null,null,null,"Naskah 1","Naskah 2","Naskah 1","Naskah 2","Naskah 1","Naskah 2","Naskah 1","Naskah 2","Naskah 1","Naskah 2","Naskah 1","Naskah 2","BIN","MTK","IPA","PPKn","IPS","SBDP","Naskah 1","Naskah 2","Naskah 1","Naskah 2","Naskah 1","Naskah 2","Naskah 1","Naskah 2","Naskah 1","Naskah 2","Naskah 1","Naskah 2","BIN","MTK","IPA","PPKn","IPS","SBDP","BIN","MTK","IPA","PPKn","IPS","SBDP"]
[null,1,null,null,{"$f":"SW!G10","v":"ACHID ATHIRIL ARDAN"},33,null,null,null,33,null,33,null,null,30,null,30,{"$f":"IFERROR(ROUND(AVERAGE(F12:G12)*$R$9,0),\"\")","v":17},{"$f":"IFERROR(ROUND(AVERAGE(H12:I12)*$R$9,0),\"\")","v":""},{"$f":"IFERROR(ROUND(AVERAGE(J12:K12)*$R$9,0),\"\")","v":17},{"$f":"IFERROR(ROUND(AVERAGE(L12:M12)*$R$9,0),\"\")","v":17},{"$f":"IFERROR(ROUND(AVERAGE(N12:O12)*$R$9,0),\"\")","v":15},{"$f":"IFERROR(ROUND(AVERAGE(P12:Q12)*$R$9,0),\"\")","v":15},72,null,null,null,72,null,72,null,null,70,null,70,{"$f":"IFERROR(ROUND(AVERAGE(X12:Y12)*$AJ$9,0),\"\")","v":36},{"$f":"IFERROR(ROUND(AVERAGE(Z12:AA12)*$AJ$9,0),\"\")","v":""},{"$f":"IFERROR(ROUND(AVERAGE(AB12:AC12)*$AJ$9,0),\"\")","v":36},{"$f":"IFERROR(ROUND(AVERAGE(AD12:AE12)*$AJ$9,0),\"\")","v":36},{"$f":"IFERROR(ROUND(AVERAGE(AF12:AG12)*$AJ$9,0),\"\")","v":35},{"$f":"IFERROR(ROUND(AVERAGE(AH12:AI12)*$AJ$9,0),\"\")","v":35},{"$f":"IFERROR(ROUND(AVERAGE(R12+AJ12),0),\"\")","v":53},"",53,53,50,50]
[null,2,null,null,{"$f":"SW!G11","v":"ACHMAD SEPTIAN HAMDANI"},73,null,null,null,73,null,73,null,null,45,null,45,{"$f":"IFERROR(ROUND(AVERAGE(F13:G13)*$R$9,0),\"\")","v":37},{"$f":"IFERROR(ROUND(AVERAGE(H13:I13)*$R$9,0),\"\")","v":""},{"$f":"IFERROR(ROUND(AVERAGE(J13:K13)*$R$9,0),\"\")","v":37},{"$f":"IFERROR(ROUND(AVERAGE(L13:M13)*$R$9,0),\"\")","v":37},{"$f":"IFERROR(ROUND(AVERAGE(N13:O13)*$R$9,0),\"\")","v":23},{"$f":"IFERROR(ROUND(AVERAGE(P13:Q13)*$R$9,0),\"\")","v":23},63,null,null,null,63,null,63,null,null,70,null,70,{"$f":"IFERROR(ROUND(AVERAGE(X13:Y13)*$AJ$9,0),\"\")","v":32},"",{"$f":"IFERROR(ROUND(AVERAGE(AB13:AC13)*$AJ$9,0),\"\")","v":32},{"$f":"IFERROR(ROUND(AVERAGE(AD13:AE13)*$AJ$9,0),\"\")","v":32},{"$f":"IFERROR(ROUND(AVERAGE(AF13:AG13)*$AJ$9,0),\"\")","v":35},{"$f":"IFERROR(ROUND(AVERAGE(AH13:AI13)*$AJ$9,0),\"\")","v":35},69,"",69,69,58,58]
[null,3,null,null,{"$f":"SW!G12","v":"ACHMAD SULAIMAN"},23,null,null,null,23,null,23,null,null,25,null,25,12,"",12,12,13,13,30,null,null,null,30,null,30,null,null,20,null,20,15,"",15,15,10,10,27,"",27,27,23,23]
[null,4,null,null,{"$f":"SW!G13","v":"AIRLANGGA DWIKA RIZQI"},33,null,null,null,33,null,33,null,null,15,null,15,17,"",17,17,8,8,82,null,null,null,82,null,82,null,null,85,null,85,41,"",41,41,43,43,58,"",58,58,51,51]
[null,5,null,null,{"$f":"SW!G14","v":"AUFAN AZKAL ABRORI"},33,null,null,null,33,null,33,null,null,50,null,50,17,"",17,17,25,25,63,null,null,null,63,null,63,null,null,70,null,70,32,"",32,32,35,35,49,"",49,49,60,60]
[null,6,null,null,{"$f":"SW!G15","v":"AZZA PRISHAL DWI PUTRA"},33,null,null,null,33,null,33,null,null,40,null,40,17,"",17,17,20,20,52,null,null,null,52,null,52,null,null,40,null,40,26,"",26,26,20,20,43,"",43,43,40,40]
[null,7,null,null,{"$f":"SW!G16","v":"EKA AULIYA` PUTRI"},77,null,null,null,77,null,77,null,null,40,null,40,39,"",39,39,20,20,100,null,null,null,100,null,100,null,null,85,null,85,50,"",50,50,43,43,89,"",89,89,63,63]
[null,8,null,null,{"$f":"SW!G17","v":"ERSA PUSPITA EKA ROSA LINDA"},60,null,null,null,60,null,60,null,null,45,null,45,30,"",30,30,23,23,72,null,null,null,72,null,72,null,null,70,null,70,36,"",36,36,35,35,66,"",66,66,58,58]
[null,9,null,null,{"$f":"SW!G18","v":"FABIYAN TRI BAKTI OKTAFIAN"},67,null,null,null,67,null,67,null,null,50,null,50,34,"",34,34,25,25,63,null,null,null,63,null,63,null,null,85,null,85,32,"",32,32,43,43,66,"",66,66,68,68]
[null,10,null,null,{"$f":"SW!G19","v":"FELISITA APRILIA NUR NIHAYA"},67,null,null,null,67,null,67,null,null,50,null,50,34,"",34,34,25,25,41,null,null,null,41,null,41,null,null,70,null,70,21,"",21,21,35,35,55,"",55,55,60,60]
[null,11,null,null,{"$f":"SW!G20","v":"FIRDA DWI ANDRIANI"},47,null,null,null,47,null,47,null,null,50,null,50,24,"",24,24,25,25,52,null,null,null,52,null,52,null,null,70,null,70,26,"",26,26,35,35,50,"",50,50,60,60]
[null,12,null,null,{"$f":"SW!G21","v":"GILANG AKBAR PRASETYO"},50,null,null,null,50,null,50,null,null,50,null,50,25,"",25,25,25,25,63,null,null,null,63,null,63,null,null,85,null,85,32,"",32,32,43,43,57,"",57,57,68,68]
[null,13,null,null,{"$f":"SW!G22","v":"IFTAH IZZAH EMILIA  MAHMUD"},53,null,null,null,53,null,53,null,null,50,null,50,27,"",27,27,25,25,72,null,null,null,72,null,72,null,null,85,null,85,36,"",36,36,43,43,63,"",63,63,{"$f":"IFERROR(ROUND(AVERAGE(V24+AN24),0),\"\")","v":68},68]
[null,14,null,null,{"$f":"SW!G23","v":"INES ARIFANI MAULINA"},57,null,null,null,57,null,57,null,null,35,null,35,29,"",29,29,18,18,100,null,null,null,100,null,100,null,null,70,null,70,50,"",50,50,35,35,79,"",79,79,53,53]
[null,15,null,null,{"$f":"SW!G24","v":"IYAAD  AFLAKHA RAMZII"},47,null,null,null,47,null,47,null,null,25,null,25,24,"",24,24,13,13,72,null,null,null,72,null,72,null,null,30,null,30,36,"",36,36,15,15,60,"",60,60,28,28]
[null,16,null,null,{"$f":"SW!G25","v":"JULI ANDRIYANTO"},50,null,null,null,50,null,50,null,null,50,null,50,25,"",25,25,25,25,52,null,null,null,52,null,52,null,null,70,null,70,26,"",26,26,35,35,51,"",51,51,60,60]
[null,17,null,null,{"$f":"SW!G26","v":"LIYA FEBRIYANI"},97,null,null,null,97,null,97,null,null,60,null,60,49,"",49,49,30,30,74,null,null,null,74,null,74,null,null,70,null,70,37,"",37,37,35,35,{"$f":"IFERROR(ROUND(AVERAGE(R28+AJ28),0),\"\")","v":86},"",86,86,65,65]
[null,18,null,null,{"$f":"SW!G27","v":"LIZATUL CHAIYUNI"},77,null,null,null,77,null,77,null,null,50,null,50,39,"",39,39,25,25,85,null,null,null,85,null,85,null,null,40,null,40,43,"",43,43,20,20,82,"",82,82,45,45]
[null,19,null,null,{"$f":"SW!G28","v":"M.AL HAFIZ"},57,null,null,null,57,null,57,null,null,35,null,35,29,"",29,29,18,18,72,null,null,null,72,null,72,null,null,70,null,70,36,"",36,36,35,35,65,"",65,65,53,53]
[null,20,null,null,{"$f":"SW!G29","v":"M. RIZKY RIDWAN"},43,null,null,null,43,null,43,null,null,25,null,25,22,"",22,22,13,13,52,null,null,null,52,null,52,null,null,40,null,40,26,"",26,26,20,20,48,"",48,48,33,33]
[null,21,null,null,{"$f":"SW!G30","v":"MOCHAMAD RAFLI DIAN SAPUTRA"},73,null,null,null,73,null,73,null,null,50,null,50,37,"",37,37,25,25,52,null,null,null,52,null,52,null,null,40,null,40,26,"",26,26,20,20,63,"",63,63,45,45]
[null,22,null,null,{"$f":"SW!G31","v":"MOCHAMMAD AFAREL PUTRA RAMDHANA"},80,null,null,null,80,null,80,null,null,60,null,60,40,"",40,40,30,30,74,null,null,null,74,null,74,null,null,70,null,70,37,"",37,37,35,35,77,"",77,77,65,65]
[null,23,null,null,{"$f":"SW!G32","v":"MUHAMAD JEFRI MAULANA"},70,null,null,null,70,null,70,null,null,50,null,50,35,"",35,35,25,25,63,null,null,null,63,null,63,null,null,70,null,70,32,"",32,32,35,35,67,"",67,67,60,60]
[null,24,null,null,{"$f":"SW!G33","v":"MUHAMMAD DWI WILDAN BAGUS KURNIAWAN"},33,null,null,null,33,null,33,null,null,10,null,10,17,"",17,17,5,5,52,null,null,null,52,null,52,null,null,70,null,70,26,"",26,26,35,35,43,"",43,43,40,40]
[null,25,null,null,{"$f":"SW!G34","v":"MUHAMMAD FARIL FIRMANSYA"},43,null,null,null,43,null,43,null,null,25,null,25,22,"",22,22,13,13,52,null,null,null,52,null,52,null,null,70,null,70,26,"",26,26,35,35,48,"",48,48,48,48]
[null,26,null,null,{"$f":"SW!G35","v":"MUHAMMAD FARIZ UBAIDILLA"},70,null,null,null,70,null,70,null,null,65,null,65,35,"",35,35,33,33,53,null,null,null,53,null,53,null,null,70,null,70,27,"",27,27,35,35,62,"",62,62,68,68]
[null,27,null,null,{"$f":"SW!G36","v":"MUHAMMAD MAULANA ZIDANIL ILMI"},87,null,null,null,87,null,87,null,null,60,null,60,44,"",44,44,30,30,85,null,null,null,85,null,85,null,null,85,null,85,43,"",43,43,43,43,87,"",87,87,73,73]
[null,28,null,null,{"$f":"SW!G37","v":"MUHAMMAD SUTRISNO ISMAIL"},20,null,null,null,20,null,20,null,null,30,null,30,10,"",10,10,15,15,41,null,null,null,41,null,41,null,null,40,null,40,21,"",21,21,20,20,31,"",31,31,35,35]
[null,29,null,null,{"$f":"SW!G38","v":"NOVITA ERNIAWAN"},70,null,null,null,70,null,70,null,null,80,null,80,35,"",35,35,40,40,63,null,null,null,63,null,63,null,null,70,null,70,32,"",32,32,35,35,67,"",67,67,75,75]
[null,30,null,null,{"$f":"SW!G39","v":"PUTRI AULIA DWI AGUSTIN"},53,null,null,null,53,null,53,null,null,35,null,35,27,"",27,27,18,18,85,null,null,null,85,null,85,null,null,40,null,40,43,"",43,43,20,20,70,"",70,70,38,38]
[null,31,null,null,{"$f":"SW!G40","v":"STANY RAFIDAH RAHMANIA"},27,null,null,null,27,null,27,null,null,20,null,20,14,"",14,14,10,10,63,null,null,null,63,null,63,null,null,70,null,70,32,"",32,32,35,35,46,"",46,46,45,45]
[null,32,null,null,{"$f":"SW!G41","v":"USWATUN KHASANAH"},60,null,null,null,60,null,60,null,null,10,null,10,30,"",30,30,5,5,52,null,null,null,52,null,52,null,null,78,null,78,26,"",26,26,39,39,56,"",56,56,44,44]
[null,33,null,null,{"$f":"SW!G42","v":"VIKROUL KHAMILA"},67,null,null,null,67,null,67,null,null,35,null,35,34,"",34,34,18,18,63,null,null,null,63,null,63,null,null,70,null,70,32,"",32,32,35,35,66,"",66,66,53,53]
[null,34,null,null,{"$f":"SW!G43","v":0},null,null,null,null,null,null,null,null,null,null,null,null,"","","","","","",null,null,null,null,null,null,null,null,null,null,null,null,"","","","","","","","","","","",""]
[null,35,null,null,{"$f":"SW!G44","v":0},null,null,null,null,null,null,null,null,null,null,null,null,"","","","","","",null,null,null,null,null,null,null,null,null,null,null,null,"","","","","","","","","","","",""]
[null,36,null,null,{"$f":"SW!G45","v":0},null,null,null,null,null,null,null,null,null,null,null,null,"","","","","","",null,null,null,null,null,null,null,null,null,null,null,null,"","","","","","","","","","","",""]
[null,37,null,null,{"$f":"SW!G46","v":0},null,null,null,null,null,null,null,null,null,null,null,null,"","","","","","",null,null,null,null,null,null,null,null,null,null,null,null,"","","","","","","","","","","",""]
[null,38,null,null,{"$f":"SW!G47","v":0},null,null,null,null,null,null,null,null,null,null,null,null,"","","","","","",null,null,null,null,null,null,null,null,null,null,null,null,"","","","","","","","","","","",""]
[null,39,null,null,{"$f":"SW!G48","v":0},null,null,null,null,null,null,null,null,null,null,null,null,"","","","","","",null,null,null,null,null,null,null,null,null,null,null,null,"","","","","","","","","","","",""]
[null,40,null,null,{"$f":"SW!G49","v":0},null,null,null,null,null,null,null,null,null,null,null,null,"","","","","","",null,null,null,null,null,null,null,null,null,null,null,null,"","","","","","","","","","","",""]
[null,41,null,null,{"$f":"SW!G50","v":0},null,null,null,null,null,null,null,null,null,null,null,null,"","","","","","",null,null,null,null,null,null,null,null,null,null,null,null,"","","","","","","","","","","",""]
[null,42,null,null,{"$f":"SW!G51","v":0},null,null,null,null,null,null,null,null,null,null,null,null,"","","","","","",null,null,null,null,null,null,null,null,null,null,null,null,"","","","","","","","","","","",""]
[null,43,null,null,{"$f":"SW!G52","v":0},null,null,null,null,null,null,null,null,null,null,null,null,"","","","","","",null,null,null,null,null,null,null,null,null,null,null,null,"","","","","","","","","","","",""]
[null,44,null,null,{"$f":"SW!G53","v":0},null,null,null,null,null,null,null,null,null,null,null,null,"","","","","","",null,null,null,null,null,null,null,null,null,null,null,null,"","","","","","","","","","","",""]
[null,45,null,null,{"$f":"SW!G54","v":0},null,null,null,null,null,null,null,null,null,null,null,null,"","","","","","",null,null,null,null,null,null,null,null,null,null,null,null,"","","","","","","","","","","",""]
[null,46,null,null,{"$f":"SW!G55","v":0},null,null,null,null,null,null,null,null,null,null,null,null,"","","","","","",null,null,null,null,null,null,null,null,null,null,null,null,"","","","","","","","","","","",""]
[null,47,null,null,{"$f":"SW!G56","v":0},null,null,null,null,null,null,null,null,null,null,null,null,"","","","","","",null,null,null,null,null,null,null,null,null,null,null,null,"","","","","","","","","","","",""]
[null,48,null,null,{"$f":"SW!G57","v":0},null,null,null,null,null,null,null,null,null,null,null,null,"","","","","","",null,null,null,null,null,null,null,null,null,null,null,null,"","","","","","","","","","","",""]
[null,49,null,null,{"$f":"SW!G58","v":0},null,null,null,null,null,null,null,null,null,null,null,null,"","","","","","",null,null,null,null,null,null,null,null,null,null,null,null,"","","","","","","","","","","",""]
[null,50,null,null,{"$f":"SW!G59","v":0},null,null,null,null,null,null,null,null,null,null,null,null,"","","","","","",null,null,null,null,null,null,null,null,null,null,null,null,"","","","","","","","","","","",""]
[null,51,null,null,{"$f":"SW!G60","v":0},null,null,null,null,null,null,null,null,null,null,null,null,"","","","","","",null,null,null,null,null,null,null,null,null,null,null,null,"","","","","","","","","","","",""]
[null,52,null,null,{"$f":"SW!G61","v":0},null,null,null,null,null,null,null,null,null,null,null,null,"","","","","","",null,null,null,null,null,null,null,null,null,null,null,null,"","","","","","","","","","","",""]
[null,53,null,null,{"$f":"SW!G62","v":0},null,null,null,null,null,null,null,null,null,null,null,null,"","","","","","",null,null,null,null,null,null,null,null,null,null,null,null,"","","","","","","","","","","",""]
[null,54,null,null,{"$f":"SW!G63","v":0},null,null,null,null,null,null,null,null,null,null,null,null,"","","","","","",null,null,null,null,null,null,null,null,null,null,null,null,"","","","","","","","","","","",""]
[null,55,null,null,{"$f":"SW!G64","v":0},null,null,null,null,null,null,null,null,null,null,null,null,"","","","","","",null,null,null,null,null,null,null,null,null,null,null,null,"","","","","","","","","","","",""]
[null,56,null,null,{"$f":"SW!G65","v":0},null,null,null,null,null,null,null,null,null,null,null,null,"","","","","","",null,null,null,null,null,null,null,null,null,null,null,null,"","","","","","","","","","","",""]
[null,57,null,null,{"$f":"SW!G66","v":0},null,null,null,null,null,null,null,null,null,null,null,null,"","","","","","",null,null,null,null,null,null,null,null,null,null,null,null,"","","","","","","","","","","",""]
[null,58,null,null,{"$f":"SW!G67","v":0},null,null,null,null,null,null,null,null,null,null,null,null,"","","","","","",null,null,null,null,null,null,null,null,null,null,null,null,"","","","","","","","","","","",""]
[null,59,null,null,{"$f":"SW!G68","v":0},null,null,null,null,null,null,null,null,null,null,null,null,"","","","","","",null,null,null,null,null,null,null,null,null,null,null,null,"","","","","","","","","",{"$f":"IFERROR(ROUND(AVERAGE(U70+AM70),0),\"\")","v":""},"",""]
[null,60,null,null,{"$f":"SW!G69","v":0},null,null,null,null,null,null,null,null,null,null,null,null,"","","","","","",null,null,null,null,null,null,null,null,null,null,null,null,"","","","","","",{"$f":"IFERROR(ROUND(AVERAGE(R71+AJ71),0),\"\")","v":""},"","","","",""]
[null,61,null,null,{"$f":"SW!G70","v":0},null,null,null,null,null,null,null,null,null,null,null,null,"","","","","","",null,null,null,null,null,null,null,null,null,null,null,null,"","","","","","","","","","","",""]
[null,62,null,null,{"$f":"SW!G71","v":0},null,null,null,null,null,null,null,null,null,null,null,null,"","","","","","",null,null,null,null,null,null,null,null,null,null,null,null,"","","","","","","","","","","",""]
[null,63,null,null,{"$f":"SW!G72","v":0},null,null,null,null,null,null,null,null,null,null,null,null,"","","","","","",null,null,null,null,null,null,null,null,null,null,null,null,"","","","","","","","","","","",""]
[null,64,null,null,{"$f":"SW!G73","v":0},null,null,null,null,null,null,null,null,null,null,null,null,"","","","","","",null,null,null,null,null,null,null,null,null,null,null,null,"","","","","","","","","","","",""]
[null,65,null,null,{"$f":"SW!G74","v":0},null,null,null,null,null,null,null,null,null,null,null,null,"","","","","","",null,null,null,null,null,null,null,null,null,null,null,null,"","","","","","","","","","","",""]
[null,66,null,null,{"$f":"SW!G75","v":0},null,null,null,null,null,null,null,null,null,null,null,null,{"$f":"IFERROR(ROUND(AVERAGE(F77:G77)*$R$9,0),\"\")","v":""},{"$f":"IFERROR(ROUND(AVERAGE(H77:I77)*$R$9,0),\"\")","v":""},{"$f":"IFERROR(ROUND(AVERAGE(J77:K77)*$R$9,0),\"\")","v":""},{"$f":"IFERROR(ROUND(AVERAGE(L77:M77)*$R$9,0),\"\")","v":""},{"$f":"IFERROR(ROUND(AVERAGE(N77:O77)*$R$9,0),\"\")","v":""},{"$f":"IFERROR(ROUND(AVERAGE(P77:Q77)*$R$9,0),\"\")","v":""},null,null,null,null,null,null,null,null,null,null,null,null,{"$f":"IFERROR(ROUND(AVERAGE(X77:Y77)*$AJ$9,0),\"\")","v":""},{"$f":"IFERROR(ROUND(AVERAGE(Z77:AA77)*$AJ$9,0),\"\")","v":""},{"$f":"IFERROR(ROUND(AVERAGE(AB77:AC77)*$AJ$9,0),\"\")","v":""},{"$f":"IFERROR(ROUND(AVERAGE(AD77:AE77)*$AJ$9,0),\"\")","v":""},{"$f":"IFERROR(ROUND(AVERAGE(AF77:AG77)*$AJ$9,0),\"\")","v":""},{"$f":"IFERROR(ROUND(AVERAGE(AH77:AI77)*$AJ$9,0),\"\")","v":""},"","","","","",""]
[null,67,null,null,{"$f":"SW!G76","v":0},null,null,null,null,null,null,null,null,null,null,null,null,"","","","","","",null,null,null,null,null,null,null,null,null,null,null,null,"","","","","","","","","","","",""]
[null,68,null,null,{"$f":"SW!G77","v":0},null,null,null,null,null,null,null,null,null,null,null,null,"","","","","","",null,null,null,null,null,null,null,null,null,null,null,null,"","","","","","","","","","","",""]
[null,69,null,null,{"$f":"SW!G78","v":0},null,null,null,null,null,null,null,null,null,null,null,null,"","","","","","",null,null,null,null,null,null,null,null,null,null,null,null,"","","","","","","","","","","",""]
[null,70,null,null,{"$f":"SW!G79","v":0},null,null,null,null,null,null,null,null,null,null,null,null,"","","","","","",null,null,null,null,null,null,null,null,null,null,null,null,"","","","","","","","","","","",""]
[null,71,null,null,{"$f":"SW!G80","v":0},null,null,null,null,null,null,null,null,null,null,null,null,"","","","","","",null,null,null,null,null,null,null,null,null,null,null,null,"","","","","","","","","","","",""]
[null,72,null,null,{"$f":"SW!G81","v":0},null,null,null,null,null,null,null,null,null,null,null,null,"","","","","","",null,null,null,null,null,null,null,null,null,null,null,null,"","","","","","","","","","","",""]
[null,73,null,null,{"$f":"SW!G82","v":0},null,null,null,null,null,null,null,null,null,null,null,null,"","","","","","",null,null,null,null,null,null,null,null,null,null,null,null,"","","","","","","","","","","",""]
[null,74,null,null,{"$f":"SW!G83","v":0},null,null,null,null,null,null,null,null,null,null,null,null,"","","","","","",null,null,null,null,null,null,null,null,null,null,null,null,"","","","","","","","","","","",""]
[null,75,null,null,{"$f":"SW!G84","v":0},null,null,null,null,null,null,null,null,null,null,null,null,"","","","","","",null,null,null,null,null,null,null,null,null,null,null,null,"","","","","","","","","","","",""]
[null,76,null,null,{"$f":"SW!G85","v":0},null,null,null,null,null,null,null,null,null,null,null,null,"","","","","","",null,null,null,null,null,null,null,null,null,null,null,null,"","","","","","","","","","","",""]
[null,77,null,null,{"$f":"SW!G86","v":0},null,null,null,null,null,null,null,null,null,null,null,null,"","","","","","",null,null,null,null,null,null,null,null,null,null,null,null,"","","","","","","","","","","",""]
[null,78,null,null,{"$f":"SW!G87","v":0},null,null,null,null,null,null,null,null,null,null,null,null,"","","","","","",null,null,null,null,null,null,null,null,null,null,null,null,"","","","","","","","","","","",""]
[null,79,null,null,{"$f":"SW!G88","v":0},null,null,null,null,null,null,null,null,null,null,null,null,"","","","","","",null,null,null,null,null,null,null,null,null,null,null,null,"","","","","","","","","","","",""]
[null,80,null,null,{"$f":"SW!G89","v":0},null,null,null,null,null,null,null,null,null,null,null,null,"","","","","","",null,null,null,null,null,null,null,null,null,null,null,null,"","","","","","","","","","","",""]
[null,81,null,null,{"$f":"SW!G90","v":0},null,null,null,null,null,null,null,null,null,null,null,null,"","","","","","",null,null,null,null,null,null,null,null,null,null,null,null,"","","","","","","","","","","",""]
[null,82,null,null,{"$f":"SW!G91","v":0},null,null,null,null,null,null,null,null,null,null,null,null,"","","","","","",null,null,null,null,null,null,null,null,null,null,null,null,"","","","","","","","","","","",""]
[null,83,null,null,{"$f":"SW!G92","v":0},null,null,null,null,null,null,null,null,null,null,null,null,"","","","","","",null,null,null,null,null,null,null,null,null,null,null,null,"","","","","","","","","","","",""]
[null,84,null,null,{"$f":"SW!G93","v":0},null,null,null,null,null,null,null,null,null,null,null,null,"","","","","","",null,null,null,null,null,null,null,null,null,null,null,null,"","","","","","","","","","","",""]
[null,85,null,null,{"$f":"SW!G94","v":0},null,null,null,null,null,null,null,null,null,null,null,null,"","","","","","",null,null,null,null,null,null,null,null,null,null,null,null,"","","","","","","","","","","",""]
[null,86,null,null,{"$f":"SW!G95","v":0},null,null,null,null,null,null,null,null,null,null,null,null,"","","","","","",null,null,null,null,null,null,null,null,null,null,null,null,"","","","","","","","","","","",""]
[null,87,null,null,{"$f":"SW!G96","v":0},null,null,null,null,null,null,null,null,null,null,null,null,"","","","","","",null,null,null,null,null,null,null,null,null,null,null,null,"","","","","","","","","","","",""]
[null,88,null,null,{"$f":"SW!G97","v":0},null,null,null,null,null,null,null,null,null,null,null,null,"","","","","","",null,null,null,null,null,null,null,null,null,null,null,null,"","","","","","","","","","","",""]
[null,89,null,null,{"$f":"SW!G98","v":0},null,null,null,null,null,null,null,null,null,null,null,null,"","","","","","",null,null,null,null,null,null,null,null,null,null,null,null,"","","","","","","","","","","",""]

{"sheet":"T4","index":3,"n_rows":100,"n_cols":47,"rows_kept":100,"cut":false,"hidden":false,"merged":[[8,35,9,40],[8,41,9,46],[9,5,9,6],[9,7,9,8],[9,9,9,10],[9,11,9,12],[9,13,9,14],[9,31,9,32],[9,33,9,34],[9,15,9,16],[9,23,9,24],[9,25,9,26],[9,27,9,28],[9,29,9,30],[8,1,10,1],[8,4,10,4],[8,5,8,16],[8,17,9,22],[8,23,8,34],[1,1,1,46],[3,6,3,18],[3,42,5,45],[4,6,4,18],[5,6,5,18],[4,20,5,21],[4,23,5,24],[4,26,5,27],[4,29,5,30],[4,32,5,33],[4,35,5,36],[4,38,5,40]]}
[]
[null,"D A F T A R   N I L A I"]
[]
[null,"MATA PELAJARAN",null,null,null,":",{"$f":"RTM!AG5","v":"TEMA 4"},null,null,null,null,null,null,null,null,null,null,null,null,null,null,null,null,null,null,null,null,null,null,null,null,null,null,null,null,null,null,null,null,null,null,null,"۩MENU↗"]
[null,"KELAS",null,null,null,":",{"$f":"UPPER(MN!D22)","v":"VI B"},null,null,null,null,null,null,null,null,null,null,null,null,null,"TEMA 1",null,null,"TEMA 2",null,null,"TEMA 3",null,null,"TEMA 4",null,null,"TEMA 5",null,null,"TEMA 6",null,null,"REKAP"]
[null,"TAHUN PELAJARAN",null,null,null,":",{"$f":"MN!D18","v":"2019 - 2020"}]
[]
[]
[null,"No",null,null,"Nama Siswa","NILAI PG",null,null,null,null,null,null,null,null,null,null,null,0.6,null,null,null,null,null,"NILAI ESSAY",null,null,null,null,null,null,null,null,null,null,null,{"$f":"100%-R9","v":0.4},null,null,null,null,null,"JUMLAH"]
[null,null,"No. Induk","NISN",null,"BIN",null,"MTK",null,"IPA",null,"PPKn",null,"IPS",null,"SBDP",null,null,null,null,null,null,null,"BIN",null,"MTK",null,"IPA",null,"PPKn",null,"IPS",null,"SBDP"]
[null,null,null,null,null,"Naskah 1","Naskah 2","Naskah 1","Naskah 2","Naskah 1","Naskah 2","Naskah 1","Naskah 2","Naskah 1","Naskah 2","Naskah 1","Naskah 2","BIN","MTK","IPA","PPKn","IPS","SBDP","Naskah 1","Naskah 2","Naskah 1","Naskah 2","Naskah 1","Naskah 2","Naskah 1","Naskah 2","Naskah 1","Naskah 2","Naskah 1","Naskah 2","BIN","MTK","IPA","PPKn","IPS","SBDP","BIN","MTK","IPA","PPKn","IPS","SBDP"]
[null,1,null,null,{"$f":"SW!G10","v":"ACHID ATHIRIL ARDAN"},null,null,null,null,null,null,null,null,null,null,null,null,{"$f":"IFERROR(ROUND(AVERAGE(F12:G12)*$R$9,0),\"\")","v":""},{"$f":"IFERROR(ROUND(AVERAGE(H12:I12)*$R$9,0),\"\")","v":""},{"$f":"IFERROR(ROUND(AVERAGE(J12:K12)*$R$9,0),\"\")","v":""},{"$f":"IFERROR(ROUND(AVERAGE(L12:M12)*$R$9,0),\"\")","v":""},{"$f":"IFERROR(ROUND(AVERAGE(N12:O12)*$R$9,0),\"\")","v":""},{"$f":"IFERROR(ROUND(AVERAGE(P12:Q12)*$R$9,0),\"\")","v":""},null,null,null,null,null,null,null,null,null,null,null,null,{"$f":"IFERROR(ROUND(AVERAGE(X12:Y12)*$AJ$9,0),\"\")","v":""},{"$f":"IFERROR(ROUND(AVERAGE(Z12:AA12)*$AJ$9,0),\"\")","v":""},{"$f":"IFERROR(ROUND(AVERAGE(AB12:AC12)*$AJ$9,0),\"\")","v":""},{"$f":"IFERROR(ROUND(AVERAGE(AD12:AE12)*$AJ$9,0),\"\")","v":""},{"$f":"IFERROR(ROUND(AVERAGE(AF12:AG12)*$AJ$9,0),\"\")","v":""},{"$f":"IFERROR(ROUND(AVERAGE(AH12:AI12)*$AJ$9,0),\"\")","v":""},{"$f":"IFERROR(ROUND(AVERAGE(R12+AJ12),0),\"\")","v":""},"","","","",""]
[null,2,null,null,{"$f":"SW!G11","v":"ACHMAD SEPTIAN HAMDANI"},null,null,null,null,null,null,null,null,null,null,null,null,{"$f":"IFERROR(ROUND(AVERAGE(F13:G13)*$R$9,0),\"\")","v":""},{"$f":"IFERROR(ROUND(AVERAGE(H13:I13)*$R$9,0),\"\")","v":""},{"$f":"IFERROR(ROUND(AVERAGE(J13:K13)*$R$9,0),\"\")","v":""},{"$f":"IFERROR(ROUND(AVERAGE(L13:M13)*$R$9,0),\"\")","v":""},{"$f":"IFERROR(ROUND(AVERAGE(N13:O13)*$R$9,0),\"\")","v":""},{"$f":"IFERROR(ROUND(AVERAGE(P13:Q13)*$R$9,0),\"\")","v":""},null,null,null,null,null,null,null,null,null,null,null,null,{"$f":"IFERROR(ROUND(AVERAGE(X13:Y13)*$AJ$9,0),\"\")","v":""},"",{"$f":"IFERROR(ROUND(AVERAGE(AB13:AC13)*$AJ$9,0),\"\")","v":""},{"$f":"IFERROR(ROUND(AVERAGE(AD13:AE13)*$AJ$9,0),\"\")","v":""},{"$f":"IFERROR(ROUND(AVERAGE(AF13:AG13)*$AJ$9,0),\"\")","v":""},{"$f":"IFERROR(ROUND(AVERAGE(AH13:AI13)*$AJ$9,0),\"\")","v":""},"","","","","",""]
[null,3,null,null,{"$f":"SW!G12","v":"ACHMAD SULAIMAN"},null,null,null,null,null,null,null,null,null,null,null,null,"","","","","","",null,null,null,null,null,null,null,null,null,null,null,null,"","","","","","","","","","","",""]
[null,4,null,null,{"$f":"SW!G13","v":"AIRLANGGA DWIKA RIZQI"},null,null,null,null,null,null,null,null,null,null,null,null,"","","","","","",null,null,null,null,null,null,null,null,null,null,null,null,"","","","","","","","","","","",""]
[null,5,null,null,{"$f":"SW!G14","v":"AUFAN AZKAL ABRORI"},null,null,null,null,null,null,null,null,null,null,null,null,"","","","","","",null,null,null,null,null,null,null,null,null,null,null,null,"","","","","","","","","","","",""]
[null,6,null,null,{"$f":"SW!G15","v":"AZZA PRISHAL DWI PUTRA"},null,null,null,null,null,null,null,null,null,null,null,null,"","","","","","",null,null,null,null,null,null,null,null,null,null,null,null,"","","","","","","","","","","",""]
[null,7,null,null,{"$f":"SW!G16","v":"EKA AULIYA` PUTRI"},null,null,null,null,null,null,null,null,null,null,null,null,"","","","","","",null,null,null,null,null,null,null,null,null,null,null,null,"","","","","","","","","","","",""]
[null,8,null,null,{"$f":"SW!G17","v":"ERSA PUSPITA EKA ROSA LINDA"},null,null,null,null,null,null,null,null,null,null,null,null,"","","","","","",null,null,null,null,null,null,null,null,null,null,null,null,"","","","","","","","","","","",""]
[null,9,null,null,{"$f":"SW!G18","v":"FABIYAN TRI BAKTI OKTAFIAN"},null,null,null,null,null,null,null,null,null,null,null,null,"","","","","","",null,null,null,null,null,null,null,null,null,null,null,null,"","","","","","","","","","","",""]
[null,10,null,null,{"$f":"SW!G19","v":"FELISITA APRILIA NUR NIHAYA"},null,null,null,null,null,null,null,null,null,null,null,null,"","","","","","",null,null,null,null,null,null,null,null,null,null,null,null,"","","","","","","","","","","",""]
[null,11,null,null,{"$f":"SW!G20","v":"FIRDA DWI ANDRIANI"},null,null,null,null,null,null,null,null,null,null,null,null,"","","","","","",null,null,null,null,null,null,null,null,null,null,null,null,"","","","","","","","","","","",""]
[null,12,null,null,{"$f":"SW!G21","v":"GILANG AKBAR PRASETYO"},null,null,null,null,null,null,null,null,null,null,null,null,"","","","","","",null,null,null,null,null,null,null,null,null,null,null,null,"","","","","","","","","","","",""]
[null,13,null,null,{"$f":"SW!G22","v":"IFTAH IZZAH EMILIA  MAHMUD"},null,null,null,null,null,null,null,null,null,null,null,null,"","","","","","",null,null,null,null,null,null,null,null,null,null,null,null,"","","","","","","","","","","",""]
[null,14,null,null,{"$f":"SW!G23","v":"INES ARIFANI MAULINA"},null,null,null,null,null,null,null,null,null,null,null,null,"","","","","","",null,null,null,null,null,null,null,null,null,null,null,null,"","","","","","","","","","","",""]
[null,15,null,null,{"$f":"SW!G24","v":"IYAAD  AFLAKHA RAMZII"},null,null,null,null,null,null,null,null,null,null,null,null,"","","","","","",null,null,null,null,null,null,null,null,null,null,null,null,"","","","","","","","","","","",""]
[null,16,null,null,{"$f":"SW!G25","v":"JULI ANDRIYANTO"},null,null,null,null,null,null,null,null,null,null,null,null,"","","","","","",null,null,null,null,null,null,null,null,null,null,null,null,"","","","","","","","","","","",""]
[null,17,null,null,{"$f":"SW!G26","v":"LIYA FEBRIYANI"},null,null,null,null,null,null,null,null,null,null,null,null,"","","","","","",null,null,null,null,null,null,null,null,null,null,null,null,"","","","","","",{"$f":"IFERROR(ROUND(AVERAGE(R28+AJ28),0),\"\")","v":""},"","","","",""]
[null,18,null,null,{"$f":"SW!G27","v":"LIZATUL CHAIYUNI"},null,null,null,null,null,null,null,null,null,null,null,null,"","","","","","",null,null,null,null,null,null,null,null,null,null,null,null,"","","","","","","","","","","",""]
[null,19,null,null,{"$f":"SW!G28","v":"M.AL HAFIZ"},null,null,null,null,null,null,null,null,null,null,null,null,"","","","","","",null,null,null,null,null,null,null,null,null,null,null,null,"","","","","","","","","","","",""]
[null,20,null,null,{"$f":"SW!G29","v":"M. RIZKY RIDWAN"},null,null,null,null,null,null,null,null,null,null,null,null,"","","","","","",null,null,null,null,null,null,null,null,null,null,null,null,"","","","","","","","","","","",""]
[null,21,null,null,{"$f":"SW!G30","v":"MOCHAMAD RAFLI DIAN SAPUTRA"},null,null,null,null,null,null,null,null,null,null,null,null,"","","","","","",null,null,null,null,null,null,null,null,null,null,null,null,"","","","","","","","","","","",""]
[null,22,null,null,{"$f":"SW!G31","v":"MOCHAMMAD AFAREL PUTRA RAMDHANA"},null,null,null,null,null,null,null,null,null,null,null,null,"","","","","","",null,null,null,null,null,null,null,null,null,null,null,null,"","","","","","","","","","","",""]
[null,23,null,null,{"$f":"SW!G32","v":"MUHAMAD JEFRI MAULANA"},null,null,null,null,null,null,null,null,null,null,null,null,"","","","","","",null,null,null,null,null,null,null,null,null,null,null,null,"","","","","","","","","","","",""]
[null,24,null,null,{"$f":"SW!G33","v":"MUHAMMAD DWI WILDAN BAGUS KURNIAWAN"},null,null,null,null,null,null,null,null,null,null,null,null,"","","","","","",null,null,null,null,null,null,null,null,null,null,null,null,"","","","","","","","","","","",""]
[null,25,null,null,{"$f":"SW!G34","v":"MUHAMMAD FARIL FIRMANSYA"},null,null,null,null,null,null,null,null,null,null,null,null,"","","","","","",null,null,null,null,null,null,null,null,null,null,null,null,"","","","","","","","","","","",""]
[null,26,null,null,{"$f":"SW!G35","v":"MUHAMMAD FARIZ UBAIDILLA"},null,null,null,null,null,null,null,null,null,null,null,null,"","","","","","",null,null,null,null,null,null,null,null,null,null,null,null,"","","","","","","","","","","",""]
[null,27,null,null,{"$f":"SW!G36","v":"MUHAMMAD MAULANA ZIDANIL ILMI"},null,null,null,null,null,null,null,null,null,null,null,null,"","","","","","",null,null,null,null,null,null,null,null,null,null,null,null,"","","","","","","","","","","",""]
[null,28,null,null,{"$f":"SW!G37","v":"MUHAMMAD SUTRISNO ISMAIL"},null,null,null,null,null,null,null,null,null,null,null,null,"","","","","","",null,null,null,null,null,null,null,null,null,null,null,null,"","","","","","","","","","","",""]
[null,29,null,null,{"$f":"SW!G38","v":"NOVITA ERNIAWAN"},null,null,null,null,null,null,null,null,null,null,null,null,"","","","","","",null,null,null,null,null,null,null,null,null,null,null,null,"","","","","","","","","","","",""]
[null,30,null,null,{"$f":"SW!G39","v":"PUTRI AULIA DWI AGUSTIN"},null,null,null,null,null,null,null,null,null,null,null,null,"","","","","","",null,null,null,null,null,null,null,null,null,null,null,null,"","","","","","","","","","","",""]
[null,31,null,null,{"$f":"SW!G40","v":"STANY RAFIDAH RAHMANIA"},null,null,null,null,null,null,null,null,null,null,null,null,"","","","","","",null,null,null,null,null,null,null,null,null,null,null,null,"","","","","","","","","","","",""]
[null,32,null,null,{"$f":"SW!G41","v":"USWATUN KHASANAH"},null,null,null,null,null,null,null,null,null,null,null,null,"","","","","","",null,null,null,null,null,null,null,null,null,null,null,null,"","","","","","","","","","","",""]
[null,33,null,null,{"$f":"SW!G42","v":"VIKROUL KHAMILA"},null,null,null,null,null,null,null,null,null,null,null,null,"","","","","","",null,null,null,null,null,null,null,null,null,null,null,null,"","","","","","","","","","","",""]
[null,34,null,null,{"$f":"SW!G43","v":0},null,null,null,null,null,null,null,null,null,null,null,null,"","","","","","",null,null,null,null,null,null,null,null,null,null,null,null,"","","","","","","","","","","",""]
[null,35,null,null,{"$f":"SW!G44","v":0},null,null,null,null,null,null,null,null,null,null,null,null,"","","","","","",null,null,null,null,null,null,null,null,null,null,null,null,"","","","","","","","","","","",""]
[null,36,null,null,{"$f":"SW!G45","v":0},null,null,null,null,null,null,null,null,null,null,null,null,"","","","","","",null,null,null,null,null,null,null,null,null,null,null,null,"","","","","","","","","","","",""]
[null,37,null,null,{"$f":"SW!G46","v":0},null,null,null,null,null,null,null,null,null,null,null,null,"","","","","","",null,null,null,null,null,null,null,null,null,null,null,null,"","","","","","","","","","","",""]
[null,38,null,null,{"$f":"SW!G47","v":0},null,null,null,null,null,null,null,null,null,null,null,null,"","","","","","",null,null,null,null,null,null,null,null,null,null,null,null,"","","","","","","","","","","",""]
[null,39,null,null,{"$f":"SW!G48","v":0},null,null,null,null,null,null,null,null,null,null,null,null,"","","","","","",null,null,null,null,null,null,null,null,null,null,null,null,"","","","","","","","","","","",""]
[null,40,null,null,{"$f":"SW!G49","v":0},null,null,null,null,null,null,null,null,null,null,null,null,"","","","","","",null,null,null,null,null,null,null,null,null,null,null,null,"","","","","","","","","","","",""]
[null,41,null,null,{"$f":"SW!G50","v":0},null,null,null,null,null,null,null,null,null,null,null,null,"","","","","","",null,null,null,null,null,null,null,null,null,null,null,null,"","","","","","","","","","","",""]
[null,42,null,null,{"$f":"SW!G51","v":0},null,null,null,null,null,null,null,null,null,null,null,null,"","","","","","",null,null,null,null,null,null,null,null,null,null,null,null,"","","","","","","","","","","",""]
[null,43,null,null,{"$f":"SW!G52","v":0},null,null,null,null,null,null,null,null,null,null,null,null,"","","","","","",null,null,null,null,null,null,null,null,null,null,null,null,"","","","","","","","","","","",""]
[null,44,null,null,{"$f":"SW!G53","v":0},null,null,null,null,null,null,null,null,null,null,null,null,"","","","","","",null,null,null,null,null,null,null,null,null,null,null,null,"","","","","","","","","","","",""]
[null,45,null,null,{"$f":"SW!G54","v":0},null,null,null,null,null,null,null,null,null,null,null,null,"","","","","","",null,null,null,null,null,null,null,null,null,null,null,null,"","","","","","","","","","","",""]
[null,46,null,null,{"$f":"SW!G55","v":0},null,null,null,null,null,null,null,null,null,null,null,null,"","","","","","",null,null,null,null,null,null,null,null,null,null,null,null,"","","","","","","","","","","",""]
[null,47,null,null,{"$f":"SW!G56","v":0},null,null,null,null,null,null,null,null,null,null,null,null,"","","","","","",null,null,null,null,null,null,null,null,null,null,null,null,"","","","","","","","","","","",""]
[null,48,null,null,{"$f":"SW!G57","v":0},null,null,null,null,null,null,null,null,null,null,null,null,"","","","","","",null,null,null,null,null,null,null,null,null,null,null,null,"","","","","","","","","","","",""]
[null,49,null,null,{"$f":"SW!G58","v":0},null,null,null,null,null,null,null,null,null,null,null,null,"","","","","","",null,null,null,null,null,null,null,null,null,null,null,null,"","","","","","","","","","","",""]
[null,50,null,null,{"$f":"SW!G59","v":0},null,null,null,null,null,null,null,null,null,null,null,null,"","","","","","",null,null,null,null,null,null,null,null,null,null,null,null,"","","","","","","","","","","",""]
[null,51,null,null,{"$f":"SW!G60","v":0},null,null,null,null,null,null,null,null,null,null,null,null,"","","","","","",null,null,null,null,null,null,null,null,null,null,null,null,"","","","","","","","","","","",""]
[null,52,null,null,{"$f":"SW!G61","v":0},null,null,null,null,null,null,null,null,null,null,null,null,"","","","","","",null,null,null,null,null,null,null,null,null,null,null,null,"","","","","","","","","","","",""]
[null,53,null,null,{"$f":"SW!G62","v":0},null,null,null,null,null,null,null,null,null,null,null,null,"","","","","","",null,null,null,null,null,null,null,null,null,null,null,null,"","","","","","","","","","","",""]
[null,54,null,null,{"$f":"SW!G63","v":0},null,null,null,null,null,null,null,null,null,null,null,null,"","","","","","",null,null,null,null,null,null,null,null,null,null,null,null,"","","","","","","","","","","",""]
[null,55,null,null,{"$f":"SW!G64","v":0},null,null,null,null,null,null,null,null,null,null,null,null,"","","","","","",null,null,null,null,null,null,null,null,null,null,null,null,"","","","","","","","","","","",""]
[null,56,null,null,{"$f":"SW!G65","v":0},null,null,null,null,null,null,null,null,null,null,null,null,"","","","","","",null,null,null,null,null,null,null,null,null,null,null,null,"","","","","","","","","","","",""]
[null,57,null,null,{"$f":"SW!G66","v":0},null,null,null,null,null,null,null,null,null,null,null,null,"","","","","","",null,null,null,null,null,null,null,null,null,null,null,null,"","","","","","","","","","","",""]
[null,58,null,null,{"$f":"SW!G67","v":0},null,null,null,null,null,null,null,null,null,null,null,null,"","","","","","",null,null,null,null,null,null,null,null,null,null,null,null,"","","","","","","","","","","",""]
[null,59,null,null,{"$f":"SW!G68","v":0},null,null,null,null,null,null,null,null,null,null,null,null,"","","","","","",null,null,null,null,null,null,null,null,null,null,null,null,"","","","","","","","","",{"$f":"IFERROR(ROUND(AVERAGE(U70+AM70),0),\"\")","v":""},"",""]
[null,60,null,null,{"$f":"SW!G69","v":0},null,null,null,null,null,null,null,null,null,null,null,null,"","","","","","",null,null,null,null,null,null,null,null,null,null,null,null,"","","","","","",{"$f":"IFERROR(ROUND(AVERAGE(R71+AJ71),0),\"\")","v":""},"","","","",""]
[null,61,null,null,{"$f":"SW!G70","v":0},null,null,null,null,null,null,null,null,null,null,null,null,"","","","","","",null,null,null,null,null,null,null,null,null,null,null,null,"","","","","","","","","","","",""]
[null,62,null,null,{"$f":"SW!G71","v":0},null,null,null,null,null,null,null,null,null,null,null,null,"","","","","","",null,null,null,null,null,null,null,null,null,null,null,null,"","","","","","","","","","","",""]
[null,63,null,null,{"$f":"SW!G72","v":0},null,null,null,null,null,null,null,null,null,null,null,null,"","","","","","",null,null,null,null,null,null,null,null,null,null,null,null,"","","","","","","","","","","",""]
[null,64,null,null,{"$f":"SW!G73","v":0},null,null,null,null,null,null,null,null,null,null,null,null,"","","","","","",null,null,null,null,null,null,null,null,null,null,null,null,"","","","","","","","","","","",""]
[null,65,null,null,{"$f":"SW!G74","v":0},null,null,null,null,null,null,null,null,null,null,null,null,"","","","","","",null,null,null,null,null,null,null,null,null,null,null,null,"","","","","","","","","","","",""]
[null,66,null,null,{"$f":"SW!G75","v":0},null,null,null,null,null,null,null,null,null,null,null,null,{"$f":"IFERROR(ROUND(AVERAGE(F77:G77)*$R$9,0),\"\")","v":""},{"$f":"IFERROR(ROUND(AVERAGE(H77:I77)*$R$9,0),\"\")","v":""},{"$f":"IFERROR(ROUND(AVERAGE(J77:K77)*$R$9,0),\"\")","v":""},{"$f":"IFERROR(ROUND(AVERAGE(L77:M77)*$R$9,0),\"\")","v":""},{"$f":"IFERROR(ROUND(AVERAGE(N77:O77)*$R$9,0),\"\")","v":""},{"$f":"IFERROR(ROUND(AVERAGE(P77:Q77)*$R$9,0),\"\")","v":""},null,null,null,null,null,null,null,null,null,null,null,null,{"$f":"IFERROR(ROUND(AVERAGE(X77:Y77)*$AJ$9,0),\"\")","v":""},{"$f":"IFERROR(ROUND(AVERAGE(Z77:AA77)*$AJ$9,0),\"\")","v":""},{"$f":"IFERROR(ROUND(AVERAGE(AB77:AC77)*$AJ$9,0),\"\")","v":""},{"$f":"IFERROR(ROUND(AVERAGE(AD77:AE77)*$AJ$9,0),\"\")","v":""},{"$f":"IFERROR(ROUND(AVERAGE(AF77:AG77)*$AJ$9,0),\"\")","v":""},{"$f":"IFERROR(ROUND(AVERAGE(AH77:AI77)*$AJ$9,0),\"\")","v":""},"","","","","",""]
[null,67,null,null,{"$f":"SW!G76","v":0},null,null,null,null,null,null,null,null,null,null,null,null,"","","","","","",null,null,null,null,null,null,null,null,null,null,null,null,"","","","","","","","","","","",""]
[null,68,null,null,{"$f":"SW!G77","v":0},null,null,null,null,null,null,null,null,null,null,null,null,"","","","","","",null,null,null,null,null,null,null,null,null,null,null,null,"","","","","","","","","","","",""]
[null,69,null,null,{"$f":"SW!G78","v":0},null,null,null,null,null,null,null,null,null,null,null,null,"","","","","","",null,null,null,null,null,null,null,null,null,null,null,null,"","","","","","","","","","","",""]
[null,70,null,null,{"$f":"SW!G79","v":0},null,null,null,null,null,null,null,null,null,null,null,null,"","","","","","",null,null,null,null,null,null,null,null,null,null,null,null,"","","","","","","","","","","",""]
[null,71,null,null,{"$f":"SW!G80","v":0},null,null,null,null,null,null,null,null,null,null,null,null,"","","","","","",null,null,null,null,null,null,null,null,null,null,null,null,"","","","","","","","","","","",""]
[null,72,null,null,{"$f":"SW!G81","v":0},null,null,null,null,null,null,null,null,null,null,null,null,"","","","","","",null,null,null,null,null,null,null,null,null,null,null,null,"","","","","","","","","","","",""]
[null,73,null,null,{"$f":"SW!G82","v":0},null,null,null,null,null,null,null,null,null,null,null,null,"","","","","","",null,null,null,null,null,null,null,null,null,null,null,null,"","","","","","","","","","","",""]
[null,74,null,null,{"$f":"SW!G83","v":0},null,null,null,null,null,null,null,null,null,null,null,null,"","","","","","",null,null,null,null,null,null,null,null,null,null,null,null,"","","","","","","","","","","",""]
[null,75,null,null,{"$f":"SW!G84","v":0},null,null,null,null,null,null,null,null,null,null,null,null,"","","","","","",null,null,null,null,null,null,null,null,null,null,null,null,"","","","","","","","","","","",""]
[null,76,null,null,{"$f":"SW!G85","v":0},null,null,null,null,null,null,null,null,null,null,null,null,"","","","","","",null,null,null,null,null,null,null,null,null,null,null,null,"","","","","","","","","","","",""]
[null,77,null,null,{"$f":"SW!G86","v":0},null,null,null,null,null,null,null,null,null,null,null,null,"","","","","","",null,null,null,null,null,null,null,null,null,null,null,null,"","","","","","","","","","","",""]
[null,78,null,null,{"$f":"SW!G87","v":0},null,null,null,null,null,null,null,null,null,null,null,null,"","","","","","",null,null,null,null,null,null,null,null,null,null,null,null,"","","","","","","","","","","",""]
[null,79,null,null,{"$f":"SW!G88","v":0},null,null,null,null,null,null,null,null,null,null,null,null,"","","","","","",null,null,null,null,null,null,null,null,null,null,null,null,"","","","","","","","","","","",""]
[null,80,null,null,{"$f":"SW!G89","v":0},null,null,null,null,null,null,null,null,null,null,null,null,"","","","","","",null,null,null,null,null,null,null,null,null,null,null,null,"","","","","","","","","","","",""]
[null,81,null,null,{"$f":"SW!G90","v":0},null,null,null,null,null,null,null,null,null,null,null,null,"","","","","","",null,null,null,null,null,null,null,null,null,null,null,null,"","","","","","","","","","","",""]
[null,82,null,null,{"$f":"SW!G91","v":0},null,null,null,null,null,null,null,null,null,null,null,null,"","","","","","",null,null,null,null,null,null,null,null,null,null,null,null,"","","","","","","","","","","",""]
[null,83,null,null,{"$f":"SW!G92","v":0},null,null,null,null,null,null,null,null,null,null,null,null,"","","","","","",null,null,null,null,null,null,null,null,null,null,null,null,"","","","","","","","","","","",""]
[null,84,null,null,{"$f":"SW!G93","v":0},null,null,null,null,null,null,null,null,null,null,null,null,"","","","","","",null,null,null,null,null,null,null,null,null,null,null,null,"","","","","","","","","","","",""]
[null,85,null,null,{"$f":"SW!G94","v":0},null,null,null,null,null,null,null,null,null,null,null,null,"","","","","","",null,null,null,null,null,null,null,null,null,null,null,null,"","","","","","","","","","","",""]
[null,86,null,null,{"$f":"SW!G95","v":0},null,null,null,null,null,null,null,null,null,null,null,null,"","","","","","",null,null,null,null,null,null,null,null,null,null,null,null,"","","","","","","","","","","",""]
[null,87,null,null,{"$f":"SW!G96","v":0},null,null,null,null,null,null,null,null,null,null,null,null,"","","","","","",null,null,null,null,null,null,null,null,null,null,null,null,"","","","","","","","","","","",""]
[null,88,null,null,{"$f":"SW!G97","v":0},null,null,null,null,null,null,null,null,null,null,null,null,"","","","","","",null,null,null,null,null,null,null,null,null,null,null,null,"","","","","","","","","","","",""]
[null,89,null,null,{"$f":"SW!G98","v":0},null,null,null,null,null,null,null,null,null,null,null,null,"","","","","","",null,null,null,null,null,null,null,null,null,null,null,null,"","","","","","","","","","","",""]

{"sheet":"T5","index":4,"n_rows":100,"n_cols":47,"rows_kept":100,"cut":false,"hidden":false,"merged":[[8,35,9,40],[8,41,9,46],[9,5,9,6],[9,7,9,8],[9,9,9,10],[9,11,9,12],[9,13,9,14],[9,31,9,32],[9,33,9,34],[9,15,9,16],[9,23,9,24],[9,25,9,26],[9,27,9,28],[9,29,9,30],[8,1,10,1],[8,4,10,4],[8,5,8,16],[8,17,9,22],[8,23,8,34],[1,1,1,46],[3,6,3,18],[3,42,5,45],[4,6,4,18],[5,6,5,18],[4,20,5,21],[4,23,5,24],[4,26,5,27],[4,29,5,30],[4,32,5,33],[4,35,5,36],[4,38,5,40]]}
[]
[null,"D A F T A R   N I L A I"]
[]
[null,"MATA PELAJARAN",null,null,null,":",{"$f":"RTM!AJ5","v":"TEMA 5"},null,null,null,null,null,null,null,null,null,null,null,null,null,null,null,null,null,null,null,null,null,null,null,null,null,null,null,null,null,null,null,null,null,null,null,"۩MENU↗"]
[null,"KELAS",null,null,null,":",{"$f":"UPPER(MN!D22)","v":"VI B"},null,null,null,null,null,null,null,null,null,null,null,null,null,"TEMA 1",null,null,"TEMA 2",null,null,"TEMA 3",null,null,"TEMA 4",null,null,"TEMA 5",null,null,"TEMA 6",null,null,"REKAP"]
[null,"TAHUN PELAJARAN",null,null,null,":",{"$f":"MN!D18","v":"2019 - 2020"}]
[]
[]
[null,"No",null,null,"Nama Siswa","NILAI PG",null,null,null,null,null,null,null,null,null,null,null,0.6,null,null,null,null,null,"NILAI ESSAY",null,null,null,null,null,null,null,null,null,null,null,{"$f":"100%-R9","v":0.4},null,null,null,null,null,"JUMLAH"]
[null,null,"No. Induk","NISN",null,"BIN",null,"MTK",null,"IPA",null,"PPKn",null,"IPS",null,"SBDP",null,null,null,null,null,null,null,"BIN",null,"MTK",null,"IPA",null,"PPKn",null,"IPS",null,"SBDP"]
[null,null,null,null,null,"Naskah 1","Naskah 2","Naskah 1","Naskah 2","Naskah 1","Naskah 2","Naskah 1","Naskah 2","Naskah 1","Naskah 2","Naskah 1","Naskah 2","BIN","MTK","IPA","PPKn","IPS","SBDP","Naskah 1","Naskah 2","Naskah 1","Naskah 2","Naskah 1","Naskah 2","Naskah 1","Naskah 2","Naskah 1","Naskah 2","Naskah 1","Naskah 2","BIN","MTK","IPA","PPKn","IPS","SBDP","BIN","MTK","IPA","PPKn","IPS","SBDP"]
[null,1,null,null,{"$f":"SW!G10","v":"ACHID ATHIRIL ARDAN"},null,null,null,null,null,null,null,null,null,null,null,null,{"$f":"IFERROR(ROUND(AVERAGE(F12:G12)*$R$9,0),\"\")","v":""},{"$f":"IFERROR(ROUND(AVERAGE(H12:I12)*$R$9,0),\"\")","v":""},{"$f":"IFERROR(ROUND(AVERAGE(J12:K12)*$R$9,0),\"\")","v":""},{"$f":"IFERROR(ROUND(AVERAGE(L12:M12)*$R$9,0),\"\")","v":""},{"$f":"IFERROR(ROUND(AVERAGE(N12:O12)*$R$9,0),\"\")","v":""},{"$f":"IFERROR(ROUND(AVERAGE(P12:Q12)*$R$9,0),\"\")","v":""},null,null,null,null,null,null,null,null,null,null,null,null,{"$f":"IFERROR(ROUND(AVERAGE(X12:Y12)*$AJ$9,0),\"\")","v":""},{"$f":"IFERROR(ROUND(AVERAGE(Z12:AA12)*$AJ$9,0),\"\")","v":""},{"$f":"IFERROR(ROUND(AVERAGE(AB12:AC12)*$AJ$9,0),\"\")","v":""},{"$f":"IFERROR(ROUND(AVERAGE(AD12:AE12)*$AJ$9,0),\"\")","v":""},{"$f":"IFERROR(ROUND(AVERAGE(AF12:AG12)*$AJ$9,0),\"\")","v":""},{"$f":"IFERROR(ROUND(AVERAGE(AH12:AI12)*$AJ$9,0),\"\")","v":""},{"$f":"IFERROR(ROUND(AVERAGE(R12+AJ12),0),\"\")","v":""},"","","","",""]
[null,2,null,null,{"$f":"SW!G11","v":"ACHMAD SEPTIAN HAMDANI"},null,null,null,null,null,null,null,null,null,null,null,null,{"$f":"IFERROR(ROUND(AVERAGE(F13:G13)*$R$9,0),\"\")","v":""},{"$f":"IFERROR(ROUND(AVERAGE(H13:I13)*$R$9,0),\"\")","v":""},{"$f":"IFERROR(ROUND(AVERAGE(J13:K13)*$R$9,0),\"\")","v":""},{"$f":"IFERROR(ROUND(AVERAGE(L13:M13)*$R$9,0),\"\")","v":""},{"$f":"IFERROR(ROUND(AVERAGE(N13:O13)*$R$9,0),\"\")","v":""},{"$f":"IFERROR(ROUND(AVERAGE(P13:Q13)*$R$9,0),\"\")","v":""},null,null,null,null,null,null,null,null,null,null,null,null,{"$f":"IFERROR(ROUND(AVERAGE(X13:Y13)*$AJ$9,0),\"\")","v":""},"",{"$f":"IFERROR(ROUND(AVERAGE(AB13:AC13)*$AJ$9,0),\"\")","v":""},{"$f":"IFERROR(ROUND(AVERAGE(AD13:AE13)*$AJ$9,0),\"\")","v":""},{"$f":"IFERROR(ROUND(AVERAGE(AF13:AG13)*$AJ$9,0),\"\")","v":""},{"$f":"IFERROR(ROUND(AVERAGE(AH13:AI13)*$AJ$9,0),\"\")","v":""},"","","","","",""]
[null,3,null,null,{"$f":"SW!G12","v":"ACHMAD SULAIMAN"},null,null,null,null,null,null,null,null,null,null,null,null,"","","","","","",null,null,null,null,null,null,null,null,null,null,null,null,"","","","","","","","","","","",""]
[null,4,null,null,{"$f":"SW!G13","v":"AIRLANGGA DWIKA RIZQI"},null,null,null,null,null,null,null,null,null,null,null,null,"","","","","","",null,null,null,null,null,null,null,null,null,null,null,null,"","","","","","","","","","","",""]
[null,5,null,null,{"$f":"SW!G14","v":"AUFAN AZKAL ABRORI"},null,null,null,null,null,null,null,null,null,null,null,null,"","","","","","",null,null,null,null,null,null,null,null,null,null,null,null,"","","","","","","","","","","",""]
[null,6,null,null,{"$f":"SW!G15","v":"AZZA PRISHAL DWI PUTRA"},null,null,null,null,null,null,null,null,null,null,null,null,"","","","","","",null,null,null,null,null,null,null,null,null,null,null,null,"","","","","","","","","","","",""]
[null,7,null,null,{"$f":"SW!G16","v":"EKA AULIYA` PUTRI"},null,null,null,null,null,null,null,null,null,null,null,null,"","","","","","",null,null,null,null,null,null,null,null,null,null,null,null,"","","","","","","","","","","",""]
[null,8,null,null,{"$f":"SW!G17","v":"ERSA PUSPITA EKA ROSA LINDA"},null,null,null,null,null,null,null,null,null,null,null,null,"","","","","","",null,null,null,null,null,null,null,null,null,null,null,null,"","","","","","","","","","","",""]
[null,9,null,null,{"$f":"SW!G18","v":"FABIYAN TRI BAKTI OKTAFIAN"},null,null,null,null,null,null,null,null,null,null,null,null,"","","","","","",null,null,null,null,null,null,null,null,null,null,null,null,"","","","","","","","","","","",""]
[null,10,null,null,{"$f":"SW!G19","v":"FELISITA APRILIA NUR NIHAYA"},null,null,null,null,null,null,null,null,null,null,null,null,"","","","","","",null,null,null,null,null,null,null,null,null,null,null,null,"","","","","","","","","","","",""]
[null,11,null,null,{"$f":"SW!G20","v":"FIRDA DWI ANDRIANI"},null,null,null,null,null,null,null,null,null,null,null,null,"","","","","","",null,null,null,null,null,null,null,null,null,null,null,null,"","","","","","","","","","","",""]
[null,12,null,null,{"$f":"SW!G21","v":"GILANG AKBAR PRASETYO"},null,null,null,null,null,null,null,null,null,null,null,null,"","","","","","",null,null,null,null,null,null,null,null,null,null,null,null,"","","","","","","","","","","",""]
[null,13,null,null,{"$f":"SW!G22","v":"IFTAH IZZAH EMILIA  MAHMUD"},null,null,null,null,null,null,null,null,null,null,null,null,"","","","","","",null,null,null,null,null,null,null,null,null,null,null,null,"","","","","","","","","","","",""]
[null,14,null,null,{"$f":"SW!G23","v":"INES ARIFANI MAULINA"},null,null,null,null,null,null,null,null,null,null,null,null,"","","","","","",null,null,null,null,null,null,null,null,null,null,null,null,"","","","","","","","","","","",""]
[null,15,null,null,{"$f":"SW!G24","v":"IYAAD  AFLAKHA RAMZII"},null,null,null,null,null,null,null,null,null,null,null,null,"","","","","","",null,null,null,null,null,null,null,null,null,null,null,null,"","","","","","","","","","","",""]
[null,16,null,null,{"$f":"SW!G25","v":"JULI ANDRIYANTO"},null,null,null,null,null,null,null,null,null,null,null,null,"","","","","","",null,null,null,null,null,null,null,null,null,null,null,null,"","","","","","","","","","","",""]
[null,17,null,null,{"$f":"SW!G26","v":"LIYA FEBRIYANI"},null,null,null,null,null,null,null,null,null,null,null,null,"","","","","","",null,null,null,null,null,null,null,null,null,null,null,null,"","","","","","",{"$f":"IFERROR(ROUND(AVERAGE(R28+AJ28),0),\"\")","v":""},"","","","",""]
[null,18,null,null,{"$f":"SW!G27","v":"LIZATUL CHAIYUNI"},null,null,null,null,null,null,null,null,null,null,null,null,"","","","","","",null,null,null,null,null,null,null,null,null,null,null,null,"","","","","","","","","","","",""]
[null,19,null,null,{"$f":"SW!G28","v":"M.AL HAFIZ"},null,null,null,null,null,null,null,null,null,null,null,null,"","","","","","",null,null,null,null,null,null,null,null,null,null,null,null,"","","","","","","","","","","",""]
[null,20,null,null,{"$f":"SW!G29","v":"M. RIZKY RIDWAN"},null,null,null,null,null,null,null,null,null,null,null,null,"","","","","","",null,null,null,null,null,null,null,null,null,null,null,null,"","","","","","","","","","","",""]
[null,21,null,null,{"$f":"SW!G30","v":"MOCHAMAD RAFLI DIAN SAPUTRA"},null,null,null,null,null,null,null,null,null,null,null,null,"","","","","","",null,null,null,null,null,null,null,null,null,null,null,null,"","","","","","","","","","","",""]
[null,22,null,null,{"$f":"SW!G31","v":"MOCHAMMAD AFAREL PUTRA RAMDHANA"},null,null,null,null,null,null,null,null,null,null,null,null,"","","","","","",null,null,null,null,null,null,null,null,null,null,null,null,"","","","","","","","","","","",""]
[null,23,null,null,{"$f":"SW!G32","v":"MUHAMAD JEFRI MAULANA"},null,null,null,null,null,null,null,null,null,null,null,null,"","","","","","",null,null,null,null,null,null,null,null,null,null,null,null,"","","","","","","","","","","",""]
[null,24,null,null,{"$f":"SW!G33","v":"MUHAMMAD DWI WILDAN BAGUS KURNIAWAN"},null,null,null,null,null,null,null,null,null,null,null,null,"","","","","","",null,null,null,null,null,null,null,null,null,null,null,null,"","","","","","","","","","","",""]
[null,25,null,null,{"$f":"SW!G34","v":"MUHAMMAD FARIL FIRMANSYA"},null,null,null,null,null,null,null,null,null,null,null,null,"","","","","","",null,null,null,null,null,null,null,null,null,null,null,null,"","","","","","","","","","","",""]
[null,26,null,null,{"$f":"SW!G35","v":"MUHAMMAD FARIZ UBAIDILLA"},null,null,null,null,null,null,null,null,null,null,null,null,"","","","","","",null,null,null,null,null,null,null,null,null,null,null,null,"","","","","","","","","","","",""]
[null,27,null,null,{"$f":"SW!G36","v":"MUHAMMAD MAULANA ZIDANIL ILMI"},null,null,null,null,null,null,null,null,null,null,null,null,"","","","","","",null,null,null,null,null,null,null,null,null,null,null,null,"","","","","","","","","","","",""]
[null,28,null,null,{"$f":"SW!G37","v":"MUHAMMAD SUTRISNO ISMAIL"},null,null,null,null,null,null,null,null,null,null,null,null,"","","","","","",null,null,null,null,null,null,null,null,null,null,null,null,"","","","","","","","","","","",""]
[null,29,null,null,{"$f":"SW!G38","v":"NOVITA ERNIAWAN"},null,null,null,null,null,null,null,null,null,null,null,null,"","","","","","",null,null,null,null,null,null,null,null,null,null,null,null,"","","","","","","","","","","",""]
[null,30,null,null,{"$f":"SW!G39","v":"PUTRI AULIA DWI AGUSTIN"},null,null,null,null,null,null,null,null,null,null,null,null,"","","","","","",null,null,null,null,null,null,null,null,null,null,null,null,"","","","","","","","","","","",""]
[null,31,null,null,{"$f":"SW!G40","v":"STANY RAFIDAH RAHMANIA"},null,null,null,null,null,null,null,null,null,null,null,null,"","","","","","",null,null,null,null,null,null,null,null,null,null,null,null,"","","","","","","","","","","",""]
[null,32,null,null,{"$f":"SW!G41","v":"USWATUN KHASANAH"},null,null,null,null,null,null,null,null,null,null,null,null,"","","","","","",null,null,null,null,null,null,null,null,null,null,null,null,"","","","","","","","","","","",""]
[null,33,null,null,{"$f":"SW!G42","v":"VIKROUL KHAMILA"},null,null,null,null,null,null,null,null,null,null,null,null,"","","","","","",null,null,null,null,null,null,null,null,null,null,null,null,"","","","","","","","","","","",""]
[null,34,null,null,{"$f":"SW!G43","v":0},null,null,null,null,null,null,null,null,null,null,null,null,"","","","","","",null,null,null,null,null,null,null,null,null,null,null,null,"","","","","","","","","","","",""]
[null,35,null,null,{"$f":"SW!G44","v":0},null,null,null,null,null,null,null,null,null,null,null,null,"","","","","","",null,null,null,null,null,null,null,null,null,null,null,null,"","","","","","","","","","","",""]
[null,36,null,null,{"$f":"SW!G45","v":0},null,null,null,null,null,null,null,null,null,null,null,null,"","","","","","",null,null,null,null,null,null,null,null,null,null,null,null,"","","","","","","","","","","",""]
[null,37,null,null,{"$f":"SW!G46","v":0},null,null,null,null,null,null,null,null,null,null,null,null,"","","","","","",null,null,null,null,null,null,null,null,null,null,null,null,"","","","","","","","","","","",""]
[null,38,null,null,{"$f":"SW!G47","v":0},null,null,null,null,null,null,null,null,null,null,null,null,"","","","","","",null,null,null,null,null,null,null,null,null,null,null,null,"","","","","","","","","","","",""]
[null,39,null,null,{"$f":"SW!G48","v":0},null,null,null,null,null,null,null,null,null,null,null,null,"","","","","","",null,null,null,null,null,null,null,null,null,null,null,null,"","","","","","","","","","","",""]
[null,40,null,null,{"$f":"SW!G49","v":0},null,null,null,null,null,null,null,null,null,null,null,null,"","","","","","",null,null,null,null,null,null,null,null,null,null,null,null,"","","","","","","","","","","",""]
[null,41,null,null,{"$f":"SW!G50","v":0},null,null,null,null,null,null,null,null,null,null,null,null,"","","","","","",null,null,null,null,null,null,null,null,null,null,null,null,"","","","","","","","","","","",""]
[null,42,null,null,{"$f":"SW!G51","v":0},null,null,null,null,null,null,null,null,null,null,null,null,"","","","","","",null,null,null,null,null,null,null,null,null,null,null,null,"","","","","","","","","","","",""]
[null,43,null,null,{"$f":"SW!G52","v":0},null,null,null,null,null,null,null,null,null,null,null,null,"","","","","","",null,null,null,null,null,null,null,null,null,null,null,null,"","","","","","","","","","","",""]
[null,44,null,null,{"$f":"SW!G53","v":0},null,null,null,null,null,null,null,null,null,null,null,null,"","","","","","",null,null,null,null,null,null,null,null,null,null,null,null,"","","","","","","","","","","",""]
[null,45,null,null,{"$f":"SW!G54","v":0},null,null,null,null,null,null,null,null,null,null,null,null,"","","","","","",null,null,null,null,null,null,null,null,null,null,null,null,"","","","","","","","","","","",""]
[null,46,null,null,{"$f":"SW!G55","v":0},null,null,null,null,null,null,null,null,null,null,null,null,"","","","","","",null,null,null,null,null,null,null,null,null,null,null,null,"","","","","","","","","","","",""]
[null,47,null,null,{"$f":"SW!G56","v":0},null,null,null,null,null,null,null,null,null,null,null,null,"","","","","","",null,null,null,null,null,null,null,null,null,null,null,null,"","","","","","","","","","","",""]
[null,48,null,null,{"$f":"SW!G57","v":0},null,null,null,null,null,null,null,null,null,null,null,null,"","","","","","",null,null,null,null,null,null,null,null,null,null,null,null,"","","","","","","","","","","",""]
[null,49,null,null,{"$f":"SW!G58","v":0},null,null,null,null,null,null,null,null,null,null,null,null,"","","","","","",null,null,null,null,null,null,null,null,null,null,null,null,"","","","","","","","","","","",""]
[null,50,null,null,{"$f":"SW!G59","v":0},null,null,null,null,null,null,null,null,null,null,null,null,"","","","","","",null,null,null,null,null,null,null,null,null,null,null,null,"","","","","","","","","","","",""]
[null,51,null,null,{"$f":"SW!G60","v":0},null,null,null,null,null,null,null,null,null,null,null,null,"","","","","","",null,null,null,null,null,null,null,null,null,null,null,null,"","","","","","","","","","","",""]
[null,52,null,null,{"$f":"SW!G61","v":0},null,null,null,null,null,null,null,null,null,null,null,null,"","","","","","",null,null,null,null,null,null,null,null,null,null,null,null,"","","","","","","","","","","",""]
[null,53,null,null,{"$f":"SW!G62","v":0},null,null,null,null,null,null,null,null,null,null,null,null,"","","","","","",null,null,null,null,null,null,null,null,null,null,null,null,"","","","","","","","","","","",""]
[null,54,null,null,{"$f":"SW!G63","v":0},null,null,null,null,null,null,null,null,null,null,null,null,"","","","","","",null,null,null,null,null,null,null,null,null,null,null,null,"","","","","","","","","","","",""]
[null,55,null,null,{"$f":"SW!G64","v":0},null,null,null,null,null,null,null,null,null,null,null,null,"","","","","","",null,null,null,null,null,null,null,null,null,null,null,null,"","","","","","","","","","","",""]
[null,56,null,null,{"$f":"SW!G65","v":0},null,null,null,null,null,null,null,null,null,null,null,null,"","","","","","",null,null,null,null,null,null,null,null,null,null,null,null,"","","","","","","","","","","",""]
[null,57,null,null,{"$f":"SW!G66","v":0},null,null,null,null,null,null,null,null,null,null,null,null,"","","","","","",null,null,null,null,null,null,null,null,null,null,null,null,"","","","","","","","","","","",""]
[null,58,null,null,{"$f":"SW!G67","v":0},null,null,null,null,null,null,null,null,null,null,null,null,"","","","","","",null,null,null,null,null,null,null,null,null,null,null,null,"","","","","","","","","","","",""]
[null,59,null,null,{"$f":"SW!G68","v":0},null,null,null,null,null,null,null,null,null,null,null,null,"","","","","","",null,null,null,null,null,null,null,null,null,null,null,null,"","","","","","","","","",{"$f":"IFERROR(ROUND(AVERAGE(U70+AM70),0),\"\")","v":""},"",""]
[null,60,null,null,{"$f":"SW!G69","v":0},null,null,null,null,null,null,null,null,null,null,null,null,"","","","","","",null,null,null,null,null,null,null,null,null,null,null,null,"","","","","","",{"$f":"IFERROR(ROUND(AVERAGE(R71+AJ71),0),\"\")","v":""},"","","","",""]
[null,61,null,null,{"$f":"SW!G70","v":0},null,null,null,null,null,null,null,null,null,null,null,null,"","","","","","",null,null,null,null,null,null,null,null,null,null,null,null,"","","","","","","","","","","",""]
[null,62,null,null,{"$f":"SW!G71","v":0},null,null,null,null,null,null,null,null,null,null,null,null,"","","","","","",null,null,null,null,null,null,null,null,null,null,null,null,"","","","","","","","","","","",""]
[null,63,null,null,{"$f":"SW!G72","v":0},null,null,null,null,null,null,null,null,null,null,null,null,"","","","","","",null,null,null,null,null,null,null,null,null,null,null,null,"","","","","","","","","","","",""]
[null,64,null,null,{"$f":"SW!G73","v":0},null,null,null,null,null,null,null,null,null,null,null,null,"","","","","","",null,null,null,null,null,null,null,null,null,null,null,null,"","","","","","","","","","","",""]
[null,65,null,null,{"$f":"SW!G74","v":0},null,null,null,null,null,null,null,null,null,null,null,null,"","","","","","",null,null,null,null,null,null,null,null,null,null,null,null,"","","","","","","","","","","",""]
[null,66,null,null,{"$f":"SW!G75","v":0},null,null,null,null,null,null,null,null,null,null,null,null,{"$f":"IFERROR(ROUND(AVERAGE(F77:G77)*$R$9,0),\"\")","v":""},{"$f":"IFERROR(ROUND(AVERAGE(H77:I77)*$R$9,0),\"\")","v":""},{"$f":"IFERROR(ROUND(AVERAGE(J77:K77)*$R$9,0),\"\")","v":""},{"$f":"IFERROR(ROUND(AVERAGE(L77:M77)*$R$9,0),\"\")","v":""},{"$f":"IFERROR(ROUND(AVERAGE(N77:O77)*$R$9,0),\"\")","v":""},{"$f":"IFERROR(ROUND(AVERAGE(P77:Q77)*$R$9,0),\"\")","v":""},null,null,null,null,null,null,null,null,null,null,null,null,{"$f":"IFERROR(ROUND(AVERAGE(X77:Y77)*$AJ$9,0),\"\")","v":""},{"$f":"IFERROR(ROUND(AVERAGE(Z77:AA77)*$AJ$9,0),\"\")","v":""},{"$f":"IFERROR(ROUND(AVERAGE(AB77:AC77)*$AJ$9,0),\"\")","v":""},{"$f":"IFERROR(ROUND(AVERAGE(AD77:AE77)*$AJ$9,0),\"\")","v":""},{"$f":"IFERROR(ROUND(AVERAGE(AF77:AG77)*$AJ$9,0),\"\")","v":""},{"$f":"IFERROR(ROUND(AVERAGE(AH77:AI77)*$AJ$9,0),\"\")","v":""},"","","","","",""]
[null,67,null,null,{"$f":"SW!G76","v":0},null,null,null,null,null,null,null,null,null,null,null,null,"","","","","","",null,null,null,null,null,null,null,null,null,null,null,null,"","","","","","","","","","","",""]
[null,68,null,null,{"$f":"SW!G77","v":0},null,null,null,null,null,null,null,null,null,null,null,null,"","","","","","",null,null,null,null,null,null,null,null,null,null,null,null,"","","","","","","","","","","",""]
[null,69,null,null,{"$f":"SW!G78","v":0},null,null,null,null,null,null,null,null,null,null,null,null,"","","","","","",null,null,null,null,null,null,null,null,null,null,null,null,"","","","","","","","","","","",""]
[null,70,null,null,{"$f":"SW!G79","v":0},null,null,null,null,null,null,null,null,null,null,null,null,"","","","","","",null,null,null,null,null,null,null,null,null,null,null,null,"","","","","","","","","","","",""]
[null,71,null,null,{"$f":"SW!G80","v":0},null,null,null,null,null,null,null,null,null,null,null,null,"","","","","","",null,null,null,null,null,null,null,null,null,null,null,null,"","","","","","","","","","","",""]
[null,72,null,null,{"$f":"SW!G81","v":0},null,null,null,null,null,null,null,null,null,null,null,null,"","","","","","",null,null,null,null,null,null,null,null,null,null,null,null,"","","","","","","","","","","",""]
[null,73,null,null,{"$f":"SW!G82","v":0},null,null,null,null,null,null,null,null,null,null,null,null,"","","","","","",null,null,null,null,null,null,null,null,null,null,null,null,"","","","","","","","","","","",""]
[null,74,null,null,{"$f":"SW!G83","v":0},null,null,null,null,null,null,null,null,null,null,null,null,"","","","","","",null,null,null,null,null,null,null,null,null,null,null,null,"","","","","","","","","","","",""]
[null,75,null,null,{"$f":"SW!G84","v":0},null,null,null,null,null,null,null,null,null,null,null,null,"","","","","","",null,null,null,null,null,null,null,null,null,null,null,null,"","","","","","","","","","","",""]
[null,76,null,null,{"$f":"SW!G85","v":0},null,null,null,null,null,null,null,null,null,null,null,null,"","","","","","",null,null,null,null,null,null,null,null,null,null,null,null,"","","","","","","","","","","",""]
[null,77,null,null,{"$f":"SW!G86","v":0},null,null,null,null,null,null,null,null,null,null,null,null,"","","","","","",null,null,null,null,null,null,null,null,null,null,null,null,"","","","","","","","","","","",""]
[null,78,null,null,{"$f":"SW!G87","v":0},null,null,null,null,null,null,null,null,null,null,null,null,"","","","","","",null,null,null,null,null,null,null,null,null,null,null,null,"","","","","","","","","","","",""]
[null,79,null,null,{"$f":"SW!G88","v":0},null,null,null,null,null,null,null,null,null,null,null,null,"","","","","","",null,null,null,null,null,null,null,null,null,null,null,null,"","","","","","","","","","","",""]
[null,80,null,null,{"$f":"SW!G89","v":0},null,null,null,null,null,null,null,null,null,null,null,null,"","","","","","",null,null,null,null,null,null,null,null,null,null,null,null,"","","","","","","","","","","",""]
[null,81,null,null,{"$f":"SW!G90","v":0},null,null,null,null,null,null,null,null,null,null,null,null,"","","","","","",null,null,null,null,null,null,null,null,null,null,null,null,"","","","","","","","","","","",""]
[null,82,null,null,{"$f":"SW!G91","v":0},null,null,null,null,null,null,null,null,null,null,null,null,"","","","","","",null,null,null,null,null,null,null,null,null,null,null,null,"","","","","","","","","","","",""]
[null,83,null,null,{"$f":"SW!G92","v":0},null,null,null,null,null,null,null,null,null,null,null,null,"","","","","","",null,null,null,null,null,null,null,null,null,null,null,null,"","","","","","","","","","","",""]
[null,84,null,null,{"$f":"SW!G93","v":0},null,null,null,null,null,null,null,null,null,null,null,null,"","","","","","",null,null,null,null,null,null,null,null,null,null,null,null,"","","","","","","","","","","",""]
[null,85,null,null,{"$f":"SW!G94","v":0},null,null,null,null,null,null,null,null,null,null,null,null,"","","","","","",null,null,null,null,null,null,null,null,null,null,null,null,"","","","","","","","","","","",""]
[null,86,null,null,{"$f":"SW!G95","v":0},null,null,null,null,null,null,null,null,null,null,null,null,"","","","","","",null,null,null,null,null,null,null,null,null,null,null,null,"","","","","","","","","","","",""]
[null,87,null,null,{"$f":"SW!G96","v":0},null,null,null,null,null,null,null,null,null,null,null,null,"","","","","","",null,null,null,null,null,null,null,null,null,null,null,null,"","","","","","","","","","","",""]
[null,88,null,null,{"$f":"SW!G97","v":0},null,null,null,null,null,null,null,null,null,null,null,null,"","","","","","",null,null,null,null,null,null,null,null,null,null,null,null,"","","","","","","","","","","",""]
[null,89,null,null,{"$f":"SW!G98","v":0},null,null,null,null,null,null,null,null,null,null,null,null,"","","","","","",null,null,null,null,null,null,null,null,null,null,null,null,"","","","","","","","","","","",""]

{"sheet":"T6","index":5,"n_rows":100,"n_cols":47,"rows_kept":100,"cut":false,"hidden":false,"merged":[[8,35,9,40],[8,41,9,46],[9,5,9,6],[9,7,9,8],[9,9,9,10],[9,11,9,12],[9,13,9,14],[9,31,9,32],[9,33,9,34],[9,15,9,16],[9,23,9,24],[9,25,9,26],[9,27,9,28],[9,29,9,30],[8,1,10,1],[8,4,10,4],[8,5,8,16],[8,17,9,22],[8,23,8,34],[1,1,1,46],[3,6,3,18],[3,42,5,45],[4,6,4,18],[5,6,5,18],[4,20,5,21],[4,23,5,24],[4,26,5,27],[4,29,5,30],[4,32,5,33],[4,35,5,36],[4,38,5,40]]}
[]
[null,"D A F T A R   N I L A I"]
[]
[null,"MATA PELAJARAN",null,null,null,":",{"$f":"RTM!AM5","v":"TEMA 6"},null,null,null,null,null,null,null,null,null,null,null,null,null,null,null,null,null,null,null,null,null,null,null,null,null,null,null,null,null,null,null,null,null,null,null,"۩MENU↗"]
[null,"KELAS",null,null,null,":",{"$f":"UPPER(MN!D22)","v":"VI B"},null,null,null,null,null,null,null,null,null,null,null,null,null,"TEMA 1",null,null,"TEMA 2",null,null,"TEMA 3",null,null,"TEMA 4",null,null,"TEMA 5",null,null,"TEMA 6",null,null,"REKAP"]
[null,"TAHUN PELAJARAN",null,null,null,":",{"$f":"MN!D18","v":"2019 - 2020"}]
[]
[]
[null,"No",null,null,"Nama Siswa","NILAI PG",null,null,null,null,null,null,null,null,null,null,null,0.6,null,null,null,null,null,"NILAI ESSAY",null,null,null,null,null,null,null,null,null,null,null,{"$f":"100%-R9","v":0.4},null,null,null,null,null,"JUMLAH"]
[null,null,"No. Induk","NISN",null,"BIN",null,"MTK",null,"IPA",null,"PPKn",null,"IPS",null,"SBDP",null,null,null,null,null,null,null,"BIN",null,"MTK",null,"IPA",null,"PPKn",null,"IPS",null,"SBDP"]
[null,null,null,null,null,"Naskah 1","Naskah 2","Naskah 1","Naskah 2","Naskah 1","Naskah 2","Naskah 1","Naskah 2","Naskah 1","Naskah 2","Naskah 1","Naskah 2","BIN","MTK","IPA","PPKn","IPS","SBDP","Naskah 1","Naskah 2","Naskah 1","Naskah 2","Naskah 1","Naskah 2","Naskah 1","Naskah 2","Naskah 1","Naskah 2","Naskah 1","Naskah 2","BIN","MTK","IPA","PPKn","IPS","SBDP","BIN","MTK","IPA","PPKn","IPS","SBDP"]
[null,1,null,null,{"$f":"SW!G10","v":"ACHID ATHIRIL ARDAN"},null,null,null,null,null,null,null,null,null,null,null,null,{"$f":"IFERROR(ROUND(AVERAGE(F12:G12)*$R$9,0),\"\")","v":""},{"$f":"IFERROR(ROUND(AVERAGE(H12:I12)*$R$9,0),\"\")","v":""},{"$f":"IFERROR(ROUND(AVERAGE(J12:K12)*$R$9,0),\"\")","v":""},{"$f":"IFERROR(ROUND(AVERAGE(L12:M12)*$R$9,0),\"\")","v":""},{"$f":"IFERROR(ROUND(AVERAGE(N12:O12)*$R$9,0),\"\")","v":""},{"$f":"IFERROR(ROUND(AVERAGE(P12:Q12)*$R$9,0),\"\")","v":""},null,null,null,null,null,null,null,null,null,null,null,null,{"$f":"IFERROR(ROUND(AVERAGE(X12:Y12)*$AJ$9,0),\"\")","v":""},{"$f":"IFERROR(ROUND(AVERAGE(Z12:AA12)*$AJ$9,0),\"\")","v":""},{"$f":"IFERROR(ROUND(AVERAGE(AB12:AC12)*$AJ$9,0),\"\")","v":""},{"$f":"IFERROR(ROUND(AVERAGE(AD12:AE12)*$AJ$9,0),\"\")","v":""},{"$f":"IFERROR(ROUND(AVERAGE(AF12:AG12)*$AJ$9,0),\"\")","v":""},{"$f":"IFERROR(ROUND(AVERAGE(AH12:AI12)*$AJ$9,0),\"\")","v":""},{"$f":"IFERROR(ROUND(AVERAGE(R12+AJ12),0),\"\")","v":""},"","","","",""]
[null,2,null,null,{"$f":"SW!G11","v":"ACHMAD SEPTIAN HAMDANI"},null,null,null,null,null,null,null,null,null,null,null,null,{"$f":"IFERROR(ROUND(AVERAGE(F13:G13)*$R$9,0),\"\")","v":""},{"$f":"IFERROR(ROUND(AVERAGE(H13:I13)*$R$9,0),\"\")","v":""},{"$f":"IFERROR(ROUND(AVERAGE(J13:K13)*$R$9,0),\"\")","v":""},{"$f":"IFERROR(ROUND(AVERAGE(L13:M13)*$R$9,0),\"\")","v":""},{"$f":"IFERROR(ROUND(AVERAGE(N13:O13)*$R$9,0),\"\")","v":""},{"$f":"IFERROR(ROUND(AVERAGE(P13:Q13)*$R$9,0),\"\")","v":""},null,null,null,null,null,null,null,null,null,null,null,null,{"$f":"IFERROR(ROUND(AVERAGE(X13:Y13)*$AJ$9,0),\"\")","v":""},"",{"$f":"IFERROR(ROUND(AVERAGE(AB13:AC13)*$AJ$9,0),\"\")","v":""},{"$f":"IFERROR(ROUND(AVERAGE(AD13:AE13)*$AJ$9,0),\"\")","v":""},{"$f":"IFERROR(ROUND(AVERAGE(AF13:AG13)*$AJ$9,0),\"\")","v":""},{"$f":"IFERROR(ROUND(AVERAGE(AH13:AI13)*$AJ$9,0),\"\")","v":""},"","","","","",""]
[null,3,null,null,{"$f":"SW!G12","v":"ACHMAD SULAIMAN"},null,null,null,null,null,null,null,null,null,null,null,null,"","","","","","",null,null,null,null,null,null,null,null,null,null,null,null,"","","","","","","","","","","",""]
[null,4,null,null,{"$f":"SW!G13","v":"AIRLANGGA DWIKA RIZQI"},null,null,null,null,null,null,null,null,null,null,null,null,"","","","","","",null,null,null,null,null,null,null,null,null,null,null,null,"","","","","","","","","","","",""]
[null,5,null,null,{"$f":"SW!G14","v":"AUFAN AZKAL ABRORI"},null,null,null,null,null,null,null,null,null,null,null,null,"","","","","","",null,null,null,null,null,null,null,null,null,null,null,null,"","","","","","","","","","","",""]
[null,6,null,null,{"$f":"SW!G15","v":"AZZA PRISHAL DWI PUTRA"},null,null,null,null,null,null,null,null,null,null,null,null,"","","","","","",null,null,null,null,null,null,null,null,null,null,null,null,"","","","","","","","","","","",""]
[null,7,null,null,{"$f":"SW!G16","v":"EKA AULIYA` PUTRI"},null,null,null,null,null,null,null,null,null,null,null,null,"","","","","","",null,null,null,null,null,null,null,null,null,null,null,null,"","","","","","","","","","","",""]
[null,8,null,null,{"$f":"SW!G17","v":"ERSA PUSPITA EKA ROSA LINDA"},null,null,null,null,null,null,null,null,null,null,null,null,"","","","","","",null,null,null,null,null,null,null,null,null,null,null,null,"","","","","","","","","","","",""]
[null,9,null,null,{"$f":"SW!G18","v":"FABIYAN TRI BAKTI OKTAFIAN"},null,null,null,null,null,null,null,null,null,null,null,null,"","","","","","",null,null,null,null,null,null,null,null,null,null,null,null,"","","","","","","","","","","",""]
[null,10,null,null,{"$f":"SW!G19","v":"FELISITA APRILIA NUR NIHAYA"},null,null,null,null,null,null,null,null,null,null,null,null,"","","","","","",null,null,null,null,null,null,null,null,null,null,null,null,"","","","","","","","","","","",""]
[null,11,null,null,{"$f":"SW!G20","v":"FIRDA DWI ANDRIANI"},null,null,null,null,null,null,null,null,null,null,null,null,"","","","","","",null,null,null,null,null,null,null,null,null,null,null,null,"","","","","","","","","","","",""]
[null,12,null,null,{"$f":"SW!G21","v":"GILANG AKBAR PRASETYO"},null,null,null,null,null,null,null,null,null,null,null,null,"","","","","","",null,null,null,null,null,null,null,null,null,null,null,null,"","","","","","","","","","","",""]
[null,13,null,null,{"$f":"SW!G22","v":"IFTAH IZZAH EMILIA  MAHMUD"},null,null,null,null,null,null,null,null,null,null,null,null,"","","","","","",null,null,null,null,null,null,null,null,null,null,null,null,"","","","","","","","","","","",""]
[null,14,null,null,{"$f":"SW!G23","v":"INES ARIFANI MAULINA"},null,null,null,null,null,null,null,null,null,null,null,null,"","","","","","",null,null,null,null,null,null,null,null,null,null,null,null,"","","","","","","","","","","",""]
[null,15,null,null,{"$f":"SW!G24","v":"IYAAD  AFLAKHA RAMZII"},null,null,null,null,null,null,null,null,null,null,null,null,"","","","","","",null,null,null,null,null,null,null,null,null,null,null,null,"","","","","","","","","","","",""]
[null,16,null,null,{"$f":"SW!G25","v":"JULI ANDRIYANTO"},null,null,null,null,null,null,null,null,null,null,null,null,"","","","","","",null,null,null,null,null,null,null,null,null,null,null,null,"","","","","","","","","","","",""]
[null,17,null,null,{"$f":"SW!G26","v":"LIYA FEBRIYANI"},null,null,null,null,null,null,null,null,null,null,null,null,"","","","","","",null,null,null,null,null,null,null,null,null,null,null,null,"","","","","","",{"$f":"IFERROR(ROUND(AVERAGE(R28+AJ28),0),\"\")","v":""},"","","","",""]
[null,18,null,null,{"$f":"SW!G27","v":"LIZATUL CHAIYUNI"},null,null,null,null,null,null,null,null,null,null,null,null,"","","","","","",null,null,null,null,null,null,null,null,null,null,null,null,"","","","","","","","","","","",""]
[null,19,null,null,{"$f":"SW!G28","v":"M.AL HAFIZ"},null,null,null,null,null,null,null,null,null,null,null,null,"","","","","","",null,null,null,null,null,null,null,null,null,null,null,null,"","","","","","","","","","","",""]
[null,20,null,null,{"$f":"SW!G29","v":"M. RIZKY RIDWAN"},null,null,null,null,null,null,null,null,null,null,null,null,"","","","","","",null,null,null,null,null,null,null,null,null,null,null,null,"","","","","","","","","","","",""]
[null,21,null,null,{"$f":"SW!G30","v":"MOCHAMAD RAFLI DIAN SAPUTRA"},null,null,null,null,null,null,null,null,null,null,null,null,"","","","","","",null,null,null,null,null,null,null,null,null,null,null,null,"","","","","","","","","","","",""]
[null,22,null,null,{"$f":"SW!G31","v":"MOCHAMMAD AFAREL PUTRA RAMDHANA"},null,null,null,null,null,null,null,null,null,null,null,null,"","","","","","",null,null,null,null,null,null,null,null,null,null,null,null,"","","","","","","","","","","",""]
[null,23,null,null,{"$f":"SW!G32","v":"MUHAMAD JEFRI MAULANA"},null,null,null,null,null,null,null,null,null,null,null,null,"","","","","","",null,null,null,null,null,null,null,null,null,null,null,null,"","","","","","","","","","","",""]
[null,24,null,null,{"$f":"SW!G33","v":"MUHAMMAD DWI WILDAN BAGUS KURNIAWAN"},null,null,null,null,null,null,null,null,null,null,null,null,"","","","","","",null,null,null,null,null,null,null,null,null,null,null,null,"","","","","","","","","","","",""]
[null,25,null,null,{"$f":"SW!G34","v":"MUHAMMAD FARIL FIRMANSYA"},null,null,null,null,null,null,null,null,null,null,null,null,"","","","","","",null,null,null,null,null,null,null,null,null,null,null,null,"","","","","","","","","","","",""]
[null,26,null,null,{"$f":"SW!G35","v":"MUHAMMAD FARIZ UBAIDILLA"},null,null,null,null,null,null,null,null,null,null,null,null,"","","","","","",null,null,null,null,null,null,null,null,null,null,null,null,"","","","","","","","","","","",""]
[null,27,null,null,{"$f":"SW!G36","v":"MUHAMMAD MAULANA ZIDANIL ILMI"},null,null,null,null,null,null,null,null,null,null,null,null,"","","","","","",null,null,null,null,null,null,null,null,null,null,null,null,"","","","","","","","","","","",""]
[null,28,null,null,{"$f":"SW!G37","v":"MUHAMMAD SUTRISNO ISMAIL"},null,null,null,null,null,null,null,null,null,null,null,null,"","","","","","",null,null,null,null,null,null,null,null,null,null,null,null,"","","","","","","","","","","",""]
[null,29,null,null,{"$f":"SW!G38","v":"NOVITA ERNIAWAN"},null,null,null,null,null,null,null,null,null,null,null,null,"","","","","","",null,null,null,null,null,null,null,null,null,null,null,null,"","","","","","","","","","","",""]
[null,30,null,null,{"$f":"SW!G39","v":"PUTRI AULIA DWI AGUSTIN"},null,null,null,null,null,null,null,null,null,null,null,null,"","","","","","",null,null,null,null,null,null,null,null,null,null,null,null,"","","","","","","","","","","",""]
[null,31,null,null,{"$f":"SW!G40","v":"STANY RAFIDAH RAHMANIA"},null,null,null,null,null,null,null,null,null,null,null,null,"","","","","","",null,null,null,null,null,null,null,null,null,null,null,null,"","","","","","","","","","","",""]
[null,32,null,null,{"$f":"SW!G41","v":"USWATUN KHASANAH"},null,null,null,null,null,null,null,null,null,null,null,null,"","","","","","",null,null,null,null,null,null,null,null,null,null,null,null,"","","","","","","","","","","",""]
[null,33,null,null,{"$f":"SW!G42","v":"VIKROUL KHAMILA"},null,null,null,null,null,null,null,null,null,null,null,null,"","","","","","",null,null,null,null,null,null,null,null,null,null,null,null,"","","","","","","","","","","",""]
[null,34,null,null,{"$f":"SW!G43","v":0},null,null,null,null,null,null,null,null,null,null,null,null,"","","","","","",null,null,null,null,null,null,null,null,null,null,null,null,"","","","","","","","","","","",""]
[null,35,null,null,{"$f":"SW!G44","v":0},null,null,null,null,null,null,null,null,null,null,null,null,"","","","","","",null,null,null,null,null,null,null,null,null,null,null,null,"","","","","","","","","","","",""]
[null,36,null,null,{"$f":"SW!G45","v":0},null,null,null,null,null,null,null,null,null,null,null,null,"","","","","","",null,null,null,null,null,null,null,null,null,null,null,null,"","","","","","","","","","","",""]
[null,37,null,null,{"$f":"SW!G46","v":0},null,null,null,null,null,null,null,null,null,null,null,null,"","","","","","",null,null,null,null,null,null,null,null,null,null,null,null,"","","","","","","","","","","",""]
[null,38,null,null,{"$f":"SW!G47","v":0},null,null,null,null,null,null,null,null,null,null,null,null,"","","","","","",null,null,null,null,null,null,null,null,null,null,null,null,"","","","","","","","","","","",""]
[null,39,null,null,{"$f":"SW!G48","v":0},null,null,null,null,null,null,null,null,null,null,null,null,"","","","","","",null,null,null,null,null,null,null,null,null,null,null,null,"","","","","","","","","","","",""]
[null,40,null,null,{"$f":"SW!G49","v":0},null,null,null,null,null,null,null,null,null,null,null,null,"","","","","","",null,null,null,null,null,null,null,null,null,null,null,null,"","","","","","","","","","","",""]
[null,41,null,null,{"$f":"SW!G50","v":0},null,null,null,null,null,null,null,null,null,null,null,null,"","","","","","",null,null,null,null,null,null,null,null,null,null,null,null,"","","","","","","","","","","",""]
[null,42,null,null,{"$f":"SW!G51","v":0},null,null,null,null,null,null,null,null,null,null,null,null,"","","","","","",null,null,null,null,null,null,null,null,null,null,null,null,"","","","","","","","","","","",""]
[null,43,null,null,{"$f":"SW!G52","v":0},null,null,null,null,null,null,null,null,null,null,null,null,"","","","","","",null,null,null,null,null,null,null,null,null,null,null,null,"","","","","","","","","","","",""]
[null,44,null,null,{"$f":"SW!G53","v":0},null,null,null,null,null,null,null,null,null,null,null,null,"","","","","","",null,null,null,null,null,null,null,null,null,null,null,null,"","","","","","","","","","","",""]
[null,45,null,null,{"$f":"SW!G54","v":0},null,null,null,null,null,null,null,null,null,null,null,null,"","","","","","",null,null,null,null,null,null,null,null,null,null,null,null,"","","","","","","","","","","",""]
[null,46,null,null,{"$f":"SW!G55","v":0},null,null,null,null,null,null,null,null,null,null,null,null,"","","","","","",null,null,null,null,null,null,null,null,null,null,null,null,"","","","","","","","","","","",""]
[null,47,null,null,{"$f":"SW!G56","v":0},null,null,null,null,null,null,null,null,null,null,null,null,"","","","","","",null,null,null,null,null,null,null,null,null,null,null,null,"","","","","","","","","","","",""]
[null,48,null,null,{"$f":"SW!G57","v":0},null,null,null,null,null,null,null,null,null,null,null,null,"","","","","","",null,null,null,null,null,null,null,null,null,null,null,null,"","","","","","","","","","","",""]
[null,49,null,null,{"$f":"SW!G58","v":0},null,null,null,null,null,null,null,null,null,null,null,null,"","","","","","",null,null,null,null,null,null,null,null,null,null,null,null,"","","","","","","","","","","",""]
[null,50,null,null,{"$f":"SW!G59","v":0},null,null,null,null,null,null,null,null,null,null,null,null,"","","","","","",null,null,null,null,null,null,null,null,null,null,null,null,"","","","","","","","","","","",""]
[null,51,null,null,{"$f":"SW!G60","v":0},null,null,null,null,null,null,null,null,null,null,null,null,"","","","","","",null,null,null,null,null,null,null,null,null,null,null,null,"","","","","","","","","","","",""]
[null,52,null,null,{"$f":"SW!G61","v":0},null,null,null,null,null,null,null,null,null,null,null,null,"","","","","","",null,null,null,null,null,null,null,null,null,null,null,null,"","","","","","","","","","","",""]
[null,53,null,null,{"$f":"SW!G62","v":0},null,null,null,null,null,null,null,null,null,null,null,null,"","","","","","",null,null,null,null,null,null,null,null,null,null,null,null,"","","","","","","","","","","",""]
[null,54,null,null,{"$f":"SW!G63","v":0},null,null,null,null,null,null,null,null,null,null,null,null,"","","","","","",null,null,null,null,null,null,null,null,null,null,null,null,"","","","","","","","","","","",""]
[null,55,null,null,{"$f":"SW!G64","v":0},null,null,null,null,null,null,null,null,null,null,null,null,"","","","","","",null,null,null,null,null,null,null,null,null,null,null,null,"","","","","","","","","","","",""]
[null,56,null,null,{"$f":"SW!G65","v":0},null,null,null,null,null,null,null,null,null,null,null,null,"","","","","","",null,null,null,null,null,null,null,null,null,null,null,null,"","","","","","","","","","","",""]
[null,57,null,null,{"$f":"SW!G66","v":0},null,null,null,null,null,null,null,null,null,null,null,null,"","","","","","",null,null,null,null,null,null,null,null,null,null,null,null,"","","","","","","","","","","",""]
[null,58,null,null,{"$f":"SW!G67","v":0},null,null,null,null,null,null,null,null,null,null,null,null,"","","","","","",null,null,null,null,null,null,null,null,null,null,null,null,"","","","","","","","","","","",""]
[null,59,null,null,{"$f":"SW!G68","v":0},null,null,null,null,null,null,null,null,null,null,null,null,"","","","","","",null,null,null,null,null,null,null,null,null,null,null,null,"","","","","","","","","",{"$f":"IFERROR(ROUND(AVERAGE(U70+AM70),0),\"\")","v":""},"",""]
[null,60,null,null,{"$f":"SW!G69","v":0},null,null,null,null,null,null,null,null,null,null,null,null,"","","","","","",null,null,null,null,null,null,null,null,null,null,null,null,"","","","","","",{"$f":"IFERROR(ROUND(AVERAGE(R71+AJ71),0),\"\")","v":""},"","","","",""]
[null,61,null,null,{"$f":"SW!G70","v":0},null,null,null,null,null,null,null,null,null,null,null,null,"","","","","","",null,null,null,null,null,null,null,null,null,null,null,null,"","","","","","","","","","","",""]
[null,62,null,null,{"$f":"SW!G71","v":0},null,null,null,null,null,null,null,null,null,null,null,null,"","","","","","",null,null,null,null,null,null,null,null,null,null,null,null,"","","","","","","","","","","",""]
[null,63,null,null,{"$f":"SW!G72","v":0},null,null,null,null,null,null,null,null,null,null,null,null,"","","","","","",null,null,null,null,null,null,null,null,null,null,null,null,"","","","","","","","","","","",""]
[null,64,null,null,{"$f":"SW!G73","v":0},null,null,null,null,null,null,null,null,null,null,null,null,"","","","","","",null,null,null,null,null,null,null,null,null,null,null,null,"","","","","","","","","","","",""]
[null,65,null,null,{"$f":"SW!G74","v":0},null,null,null,null,null,null,null,null,null,null,null,null,"","","","","","",null,null,null,null,null,null,null,null,null,null,null,null,"","","","","","","","","","","",""]
[null,66,null,null,{"$f":"SW!G75","v":0},null,null,null,null,null,null,null,null,null,null,null,null,{"$f":"IFERROR(ROUND(AVERAGE(F77:G77)*$R$9,0),\"\")","v":""},{"$f":"IFERROR(ROUND(AVERAGE(H77:I77)*$R$9,0),\"\")","v":""},{"$f":"IFERROR(ROUND(AVERAGE(J77:K77)*$R$9,0),\"\")","v":""},{"$f":"IFERROR(ROUND(AVERAGE(L77:M77)*$R$9,0),\"\")","v":""},{"$f":"IFERROR(ROUND(AVERAGE(N77:O77)*$R$9,0),\"\")","v":""},{"$f":"IFERROR(ROUND(AVERAGE(P77:Q77)*$R$9,0),\"\")","v":""},null,null,null,null,null,null,null,null,null,null,null,null,{"$f":"IFERROR(ROUND(AVERAGE(X77:Y77)*$AJ$9,0),\"\")","v":""},{"$f":"IFERROR(ROUND(AVERAGE(Z77:AA77)*$AJ$9,0),\"\")","v":""},{"$f":"IFERROR(ROUND(AVERAGE(AB77:AC77)*$AJ$9,0),\"\")","v":""},{"$f":"IFERROR(ROUND(AVERAGE(AD77:AE77)*$AJ$9,0),\"\")","v":""},{"$f":"IFERROR(ROUND(AVERAGE(AF77:AG77)*$AJ$9,0),\"\")","v":""},{"$f":"IFERROR(ROUND(AVERAGE(AH77:AI77)*$AJ$9,0),\"\")","v":""},"","","","","",""]
[null,67,null,null,{"$f":"SW!G76","v":0},null,null,null,null,null,null,null,null,null,null,null,null,"","","","","","",null,null,null,null,null,null,null,null,null,null,null,null,"","","","","","","","","","","",""]
[null,68,null,null,{"$f":"SW!G77","v":0},null,null,null,null,null,null,null,null,null,null,null,null,"","","","","","",null,null,null,null,null,null,null,null,null,null,null,null,"","","","","","","","","","","",""]
[null,69,null,null,{"$f":"SW!G78","v":0},null,null,null,null,null,null,null,null,null,null,null,null,"","","","","","",null,null,null,null,null,null,null,null,null,null,null,null,"","","","","","","","","","","",""]
[null,70,null,null,{"$f":"SW!G79","v":0},null,null,null,null,null,null,null,null,null,null,null,null,"","","","","","",null,null,null,null,null,null,null,null,null,null,null,null,"","","","","","","","","","","",""]
[null,71,null,null,{"$f":"SW!G80","v":0},null,null,null,null,null,null,null,null,null,null,null,null,"","","","","","",null,null,null,null,null,null,null,null,null,null,null,null,"","","","","","","","","","","",""]
[null,72,null,null,{"$f":"SW!G81","v":0},null,null,null,null,null,null,null,null,null,null,null,null,"","","","","","",null,null,null,null,null,null,null,null,null,null,null,null,"","","","","","","","","","","",""]
[null,73,null,null,{"$f":"SW!G82","v":0},null,null,null,null,null,null,null,null,null,null,null,null,"","","","","","",null,null,null,null,null,null,null,null,null,null,null,null,"","","","","","","","","","","",""]
[null,74,null,null,{"$f":"SW!G83","v":0},null,null,null,null,null,null,null,null,null,null,null,null,"","","","","","",null,null,null,null,null,null,null,null,null,null,null,null,"","","","","","","","","","","",""]
[null,75,null,null,{"$f":"SW!G84","v":0},null,null,null,null,null,null,null,null,null,null,null,null,"","","","","","",null,null,null,null,null,null,null,null,null,null,null,null,"","","","","","","","","","","",""]
[null,76,null,null,{"$f":"SW!G85","v":0},null,null,null,null,null,null,null,null,null,null,null,null,"","","","","","",null,null,null,null,null,null,null,null,null,null,null,null,"","","","","","","","","","","",""]
[null,77,null,null,{"$f":"SW!G86","v":0},null,null,null,null,null,null,null,null,null,null,null,null,"","","","","","",null,null,null,null,null,null,null,null,null,null,null,null,"","","","","","","","","","","",""]
[null,78,null,null,{"$f":"SW!G87","v":0},null,null,null,null,null,null,null,null,null,null,null,null,"","","","","","",null,null,null,null,null,null,null,null,null,null,null,null,"","","","","","","","","","","",""]
[null,79,null,null,{"$f":"SW!G88","v":0},null,null,null,null,null,null,null,null,null,null,null,null,"","","","","","",null,null,null,null,null,null,null,null,null,null,null,null,"","","","","","","","","","","",""]
[null,80,null,null,{"$f":"SW!G89","v":0},null,null,null,null,null,null,null,null,null,null,null,null,"","","","","","",null,null,null,null,null,null,null,null,null,null,null,null,"","","","","","","","","","","",""]
[null,81,null,null,{"$f":"SW!G90","v":0},null,null,null,null,null,null,null,null,null,null,null,null,"","","","","","",null,null,null,null,null,null,null,null,null,null,null,null,"","","","","","","","","","","",""]
[null,82,null,null,{"$f":"SW!G91","v":0},null,null,null,null,null,null,null,null,null,null,null,null,"","","","","","",null,null,null,null,null,null,null,null,null,null,null,null,"","","","","","","","","","","",""]
[null,83,null,null,{"$f":"SW!G92","v":0},null,null,null,null,null,null,null,null,null,null,null,null,"","","","","","",null,null,null,null,null,null,null,null,null,null,null,null,"","","","","","","","","","","",""]
[null,84,null,null,{"$f":"SW!G93","v":0},null,null,null,null,null,null,null,null,null,null,null,null,"","","","","","",null,null,null,null,null,null,null,null,null,null,null,null,"","","","","","","","","","","",""]
[null,85,null,null,{"$f":"SW!G94","v":0},null,null,null,null,null,null,null,null,null,null,null,null,"","","","","","",null,null,null,null,null,null,null,null,null,null,null,null,"","","","","","","","","","","",""]
[null,86,null,null,{"$f":"SW!G95","v":0},null,null,null,null,null,null,null,null,null,null,null,null,"","","","","","",null,null,null,null,null,null,null,null,null,null,null,null,"","","","","","","","","","","",""]
[null,87,null,null,{"$f":"SW!G96","v":0},null,null,null,null,null,null,null,null,null,null,null,null,"","","","","","",null,null,null,null,null,null,null,null,null,null,null,null,"","","","","","","","","","","",""]
[null,88,null,null,{"$f":"SW!G97","v":0},null,null,null,null,null,null,null,null,null,null,null,null,"","","","","","",null,null,null,null,null,null,null,null,null,null,null,null,"","","","","","","","","","","",""]
[null,89,null,null,{"$f":"SW!G98","v":0},null,null,null,null,null,null,null,null,null,null,null,null,"","","","","","",null,null,null,null,null,null,null,null,null,null,null,null,"","","","","","","","","","","",""]

{"sheet":"RTM","index":6,"n_rows":99,"n_cols":47,"rows_kept":99,"cut":false,"hidden":false,"merged":[[4,38,5,39],[3,6,3,21],[4,6,4,21],[5,6,5,21],[8,41,8,46],[1,1,1,46],[8,1,9,1],[8,4,9,4],[8,5,8,10],[8,11,8,16],[8,17,8,22],[8,23,8,28],[8,29,8,34],[8,35,8,40],[3,42,5,45],[4,23,5,24],[4,26,5,27],[4,29,5,30],[4,32,5,33],[4,35,5,36]]}
[]
[null,"R E K A P I T U L A S I   D A F T A R   N I L A I"]
[]
[null,"MATA PELAJARAN",null,null,null,":",{"$f":"MN!H10","v":"TEMA"},null,null,null,null,null,null,null,null,null,null,null,null,null,null,null,null,null,null,null,null,null,null,null,null,null,null,null,null,null,null,null,null,null,null,null,"۩MENU↗"]
[null,"KELAS",null,null,null,":",{"$f":"UPPER(MN!D22)","v":"VI B"},null,null,null,null,null,null,null,null,null,null,null,null,null,null,null,null,"TEMA 1",null,null,"TEMA 2",null,null,"TEMA 3",null,null,"TEMA 4",null,null,"TEMA 5",null,null,"TEMA 6"]
[null,"TAHUN PELAJARAN",null,null,null,":",{"$f":"MN!D18","v":"2019 - 2020"}]
[]
[]
[null,"No","No. Induk","NISN","Nama Siswa","BIN",null,null,null,null,null,"MTK",null,null,null,null,null,"IPA",null,null,null,null,null,"PPKn",null,null,null,null,null,"IPS",null,null,null,null,null,"SBDP",null,null,null,null,null,"RATA RATA"]
[null,null,null,null,null,"TEMA 1","TEMA 2","TEMA 3","TEMA 4","TEMA 5","TEMA 6","TEMA 1","TEMA 2","TEMA 3","TEMA 4","TEMA 5","TEMA 6","TEMA 1","TEMA 2","TEMA 3","TEMA 4","TEMA 5","TEMA 6","TEMA 1","TEMA 2","TEMA 3","TEMA 4","TEMA 5","TEMA 6","TEMA 1","TEMA 2","TEMA 3","TEMA 4","TEMA 5","TEMA 6","TEMA 1","TEMA 2","TEMA 3","TEMA 4","TEMA 5","TEMA 6","BIN","MTK","IPA","PPKn","IPS","SBDP"]
[null,1,null,null,{"$f":"SW!G10","v":"ACHID ATHIRIL ARDAN"},{"$f":"'T1'!AP12","v":72},{"$f":"'T2'!AP12","v":50},{"$f":"'T3'!AP12","v":53},{"$f":"'T4'!AP12","v":""},{"$f":"'T5'!AP12","v":""},{"$f":"'T6'!AP12","v":""},{"$f":"'T1'!AQ12","v":43},{"$f":"'T2'!AQ12","v":""},{"$f":"'T3'!AQ12","v":""},{"$f":"'T4'!AQ12","v":""},{"$f":"'T5'!AQ12","v":""},{"$f":"'T6'!AQ12","v":""},{"$f":"'T1'!AR12","v":72},{"$f":"'T2'!AR12","v":50},{"$f":"'T3'!AR12","v":53},{"$f":"'T4'!AR12","v":""},{"$f":"'T5'!AR12","v":""},{"$f":"'T6'!AR12","v":""},{"$f":"'T1'!AS12","v":72},{"$f":"'T2'!AS12","v":50},{"$f":"'T3'!AS12","v":53},{"$f":"'T4'!AS12","v":""},{"$f":"'T5'!AS12","v":""},{"$f":"'T6'!AS12","v":""},{"$f":"'T1'!AT12","v":58},{"$f":"'T2'!AT12","v":40},{"$f":"'T3'!AT12","v":50},{"$f":"'T4'!AT12","v":""},{"$f":"'T5'!AT12","v":""},{"$f":"'T6'!AT12","v":""},{"$f":"'T1'!AU12","v":58},{"$f":"'T2'!AU12","v":40},{"$f":"'T3'!AU12","v":50},{"$f":"'T4'!AU12","v":""},{"$f":"'T5'!AU12","v":""},{"$f":"'T6'!AU12","v":""},{"$f":"IFERROR(ROUND(AVERAGE(F11:K11),0),\"\")","v":58},{"$f":"IFERROR(ROUND(AVERAGE(L11:Q11),0),\"\")","v":43},{"$f":"IFERROR(ROUND(AVERAGE(R11:W11),0),\"\")","v":58},{"$f":"IFERROR(ROUND(AVERAGE(X11:AC11),0),\"\")","v":58},{"$f":"IFERROR(ROUND(AVERAGE(AD11:AI11),0),\"\")","v":49},{"$f":"IFERROR(ROUND(AVERAGE(AJ11:AO11),0),\"\")","v":49}]
[null,2,null,null,{"$f":"SW!G11","v":"ACHMAD SEPTIAN HAMDANI"},{"$f":"'T1'!AP13","v":52},{"$f":"'T2'!AP13","v":84},{"$f":"'T3'!AP13","v":69},{"$f":"'T4'!AP13","v":""},{"$f":"'T5'!AP13","v":""},{"$f":"'T6'!AP13","v":""},{"$f":"'T1'!AQ13","v":38},{"$f":"'T2'!AQ13","v":""},{"$f":"'T3'!AQ13","v":""},{"$f":"'T4'!AQ13","v":""},{"$f":"'T5'!AQ13","v":""},{"$f":"'T6'!AQ13","v":""},{"$f":"'T1'!AR13","v":52},{"$f":"'T2'!AR13","v":84},{"$f":"'T3'!AR13","v":69},{"$f":"'T4'!AR13","v":""},{"$f":"'T5'!AR13","v":""},{"$f":"'T6'!AR13","v":""},{"$f":"'T1'!AS13","v":52},{"$f":"'T2'!AS13","v":84},{"$f":"'T3'!AS13","v":69},{"$f":"'T4'!AS13","v":""},{"$f":"'T5'!AS13","v":""},{"$f":"'T6'!AS13","v":""},{"$f":"'T1'!AT13","v":63},{"$f":"'T2'!AT13","v":53},{"$f":"'T3'!AT13","v":58},{"$f":"'T4'!AT13","v":""},{"$f":"'T5'!AT13","v":""},{"$f":"'T6'!AT13","v":""},{"$f":"'T1'!AU13","v":63},{"$f":"'T2'!AU13","v":53},{"$f":"'T3'!AU13","v":58},{"$f":"'T4'!AU13","v":""},{"$f":"'T5'!AU13","v":""},{"$f":"'T6'!AU13","v":""},{"$f":"IFERROR(ROUND(AVERAGE(F12:K12),0),\"\")","v":68},{"$f":"IFERROR(ROUND(AVERAGE(L12:Q12),0),\"\")","v":38},{"$f":"IFERROR(ROUND(AVERAGE(R12:W12),0),\"\")","v":68},{"$f":"IFERROR(ROUND(AVERAGE(X12:AC12),0),\"\")","v":68},{"$f":"IFERROR(ROUND(AVERAGE(AD12:AI12),0),\"\")","v":58},{"$f":"IFERROR(ROUND(AVERAGE(AJ12:AO12),0),\"\")","v":58}]
[null,3,null,null,{"$f":"SW!G12","v":"ACHMAD SULAIMAN"},{"$f":"'T1'!AP14","v":25},{"$f":"'T2'!AP14","v":37},{"$f":"'T3'!AP14","v":27},{"$f":"'T4'!AP14","v":""},{"$f":"'T5'!AP14","v":""},{"$f":"'T6'!AP14","v":""},{"$f":"'T1'!AQ14","v":15},{"$f":"'T2'!AQ14","v":""},{"$f":"'T3'!AQ14","v":""},{"$f":"'T4'!AQ14","v":""},{"$f":"'T5'!AQ14","v":""},{"$f":"'T6'!AQ14","v":""},{"$f":"'T1'!AR14","v":25},{"$f":"'T2'!AR14","v":37},{"$f":"'T3'!AR14","v":27},{"$f":"'T4'!AR14","v":""},{"$f":"'T5'!AR14","v":""},{"$f":"'T6'!AR14","v":""},{"$f":"'T1'!AS14","v":25},{"$f":"'T2'!AS14","v":37},{"$f":"'T3'!AS14","v":27},{"$f":"'T4'!AS14","v":""},{"$f":"'T5'!AS14","v":""},{"$f":"'T6'!AS14","v":""},{"$f":"'T1'!AT14","v":45},{"$f":"'T2'!AT14","v":40},{"$f":"'T3'!AT14","v":23},{"$f":"'T4'!AT14","v":""},{"$f":"'T5'!AT14","v":""},{"$f":"'T6'!AT14","v":""},{"$f":"'T1'!AU14","v":45},{"$f":"'T2'!AU14","v":40},{"$f":"'T3'!AU14","v":23},{"$f":"'T4'!AU14","v":""},{"$f":"'T5'!AU14","v":""},{"$f":"'T6'!AU14","v":""},30,15,30,30,36,36]
[null,4,null,null,{"$f":"SW!G13","v":"AIRLANGGA DWIKA RIZQI"},{"$f":"'T1'!AP15","v":49},{"$f":"'T2'!AP15","v":50},{"$f":"'T3'!AP15","v":58},{"$f":"'T4'!AP15","v":""},{"$f":"'T5'!AP15","v":""},{"$f":"'T6'!AP15","v":""},{"$f":"'T1'!AQ15","v":38},{"$f":"'T2'!AQ15","v":""},{"$f":"'T3'!AQ15","v":""},{"$f":"'T4'!AQ15","v":""},{"$f":"'T5'!AQ15","v":""},{"$f":"'T6'!AQ15","v":""},{"$f":"'T1'!AR15","v":49},{"$f":"'T2'!AR15","v":50},{"$f":"'T3'!AR15","v":58},{"$f":"'T4'!AR15","v":""},{"$f":"'T5'!AR15","v":""},{"$f":"'T6'!AR15","v":""},{"$f":"'T1'!AS15","v":49},{"$f":"'T2'!AS15","v":50},{"$f":"'T3'!AS15","v":58},{"$f":"'T4'!AS15","v":""},{"$f":"'T5'!AS15","v":""},{"$f":"'T6'!AS15","v":""},{"$f":"'T1'!AT15","v":38},{"$f":"'T2'!AT15","v":45},{"$f":"'T3'!AT15","v":51},{"$f":"'T4'!AT15","v":""},{"$f":"'T5'!AT15","v":""},{"$f":"'T6'!AT15","v":""},{"$f":"'T1'!AU15","v":38},{"$f":"'T2'!AU15","v":45},{"$f":"'T3'!AU15","v":51},{"$f":"'T4'!AU15","v":""},{"$f":"'T5'!AU15","v":""},{"$f":"'T6'!AU15","v":""},52,38,52,52,45,45]
[null,5,null,null,{"$f":"SW!G14","v":"AUFAN AZKAL ABRORI"},{"$f":"'T1'!AP16","v":54},{"$f":"'T2'!AP16","v":45},{"$f":"'T3'!AP16","v":49},{"$f":"'T4'!AP16","v":""},{"$f":"'T5'!AP16","v":""},{"$f":"'T6'!AP16","v":""},{"$f":"'T1'!AQ16","v":47},{"$f":"'T2'!AQ16","v":""},{"$f":"'T3'!AQ16","v":""},{"$f":"'T4'!AQ16","v":""},{"$f":"'T5'!AQ16","v":""},{"$f":"'T6'!AQ16","v":""},{"$f":"'T1'!AR16","v":54},{"$f":"'T2'!AR16","v":45},{"$f":"'T3'!AR16","v":49},{"$f":"'T4'!AR16","v":""},{"$f":"'T5'!AR16","v":""},{"$f":"'T6'!AR16","v":""},{"$f":"'T1'!AS16","v":54},{"$f":"'T2'!AS16","v":45},{"$f":"'T3'!AS16","v":49},{"$f":"'T4'!AS16","v":""},{"$f":"'T5'!AS16","v":""},{"$f":"'T6'!AS16","v":""},{"$f":"'T1'!AT16","v":30},{"$f":"'T2'!AT16","v":63},{"$f":"'T3'!AT16","v":60},{"$f":"'T4'!AT16","v":""},{"$f":"'T5'!AT16","v":""},{"$f":"'T6'!AT16","v":""},{"$f":"'T1'!AU16","v":30},{"$f":"'T2'!AU16","v":63},{"$f":"'T3'!AU16","v":60},{"$f":"'T4'!AU16","v":""},{"$f":"'T5'!AU16","v":""},{"$f":"'T6'!AU16","v":""},49,47,49,49,51,51]
[null,6,null,null,{"$f":"SW!G15","v":"AZZA PRISHAL DWI PUTRA"},{"$f":"'T1'!AP17","v":49},{"$f":"'T2'!AP17","v":54},{"$f":"'T3'!AP17","v":43},{"$f":"'T4'!AP17","v":""},{"$f":"'T5'!AP17","v":""},{"$f":"'T6'!AP17","v":""},{"$f":"'T1'!AQ17","v":59},{"$f":"'T2'!AQ17","v":""},{"$f":"'T3'!AQ17","v":""},{"$f":"'T4'!AQ17","v":""},{"$f":"'T5'!AQ17","v":""},{"$f":"'T6'!AQ17","v":""},{"$f":"'T1'!AR17","v":49},{"$f":"'T2'!AR17","v":54},{"$f":"'T3'!AR17","v":43},{"$f":"'T4'!AR17","v":""},{"$f":"'T5'!AR17","v":""},{"$f":"'T6'!AR17","v":""},{"$f":"'T1'!AS17","v":49},{"$f":"'T2'!AS17","v":54},{"$f":"'T3'!AS17","v":43},{"$f":"'T4'!AS17","v":""},{"$f":"'T5'!AS17","v":""},{"$f":"'T6'!AS17","v":""},{"$f":"'T1'!AT17","v":53},{"$f":"'T2'!AT17","v":43},{"$f":"'T3'!AT17","v":40},{"$f":"'T4'!AT17","v":""},{"$f":"'T5'!AT17","v":""},{"$f":"'T6'!AT17","v":""},{"$f":"'T1'!AU17","v":53},{"$f":"'T2'!AU17","v":43},{"$f":"'T3'!AU17","v":40},{"$f":"'T4'!AU17","v":""},{"$f":"'T5'!AU17","v":""},{"$f":"'T6'!AU17","v":""},49,59,49,49,45,45]
[null,7,null,null,{"$f":"SW!G16","v":"EKA AULIYA` PUTRI"},{"$f":"'T1'!AP18","v":79},{"$f":"'T2'!AP18","v":77},{"$f":"'T3'!AP18","v":89},{"$f":"'T4'!AP18","v":""},{"$f":"'T5'!AP18","v":""},{"$f":"'T6'!AP18","v":""},{"$f":"'T1'!AQ18","v":34},{"$f":"'T2'!AQ18","v":""},{"$f":"'T3'!AQ18","v":""},{"$f":"'T4'!AQ18","v":""},{"$f":"'T5'!AQ18","v":""},{"$f":"'T6'!AQ18","v":""},{"$f":"'T1'!AR18","v":79},{"$f":"'T2'!AR18","v":77},{"$f":"'T3'!AR18","v":89},{"$f":"'T4'!AR18","v":""},{"$f":"'T5'!AR18","v":""},{"$f":"'T6'!AR18","v":""},{"$f":"'T1'!AS18","v":79},{"$f":"'T2'!AS18","v":77},{"$f":"'T3'!AS18","v":89},{"$f":"'T4'!AS18","v":""},{"$f":"'T5'!AS18","v":""},{"$f":"'T6'!AS18","v":""},{"$f":"'T1'!AT18","v":73},{"$f":"'T2'!AT18","v":48},{"$f":"'T3'!AT18","v":63},{"$f":"'T4'!AT18","v":""},{"$f":"'T5'!AT18","v":""},{"$f":"'T6'!AT18","v":""},{"$f":"'T1'!AU18","v":73},{"$f":"'T2'!AU18","v":48},{"$f":"'T3'!AU18","v":63},{"$f":"'T4'!AU18","v":""},{"$f":"'T5'!AU18","v":""},{"$f":"'T6'!AU18","v":""},82,34,82,82,61,61]
[null,8,null,null,{"$f":"SW!G17","v":"ERSA PUSPITA EKA ROSA LINDA"},{"$f":"'T1'!AP19","v":60},{"$f":"'T2'!AP19","v":65},{"$f":"'T3'!AP19","v":66},{"$f":"'T4'!AP19","v":""},{"$f":"'T5'!AP19","v":""},{"$f":"'T6'!AP19","v":""},{"$f":"'T1'!AQ19","v":34},{"$f":"'T2'!AQ19","v":""},{"$f":"'T3'!AQ19","v":""},{"$f":"'T4'!AQ19","v":""},{"$f":"'T5'!AQ19","v":""},{"$f":"'T6'!AQ19","v":""},{"$f":"'T1'!AR19","v":60},{"$f":"'T2'!AR19","v":65},{"$f":"'T3'!AR19","v":66},{"$f":"'T4'!AR19","v":""},{"$f":"'T5'!AR19","v":""},{"$f":"'T6'!AR19","v":""},{"$f":"'T1'!AS19","v":60},{"$f":"'T2'!AS19","v":65},{"$f":"'T3'!AS19","v":66},{"$f":"'T4'!AS19","v":""},{"$f":"'T5'!AS19","v":""},{"$f":"'T6'!AS19","v":""},{"$f":"'T1'!AT19","v":40},{"$f":"'T2'!AT19","v":53},{"$f":"'T3'!AT19","v":58},{"$f":"'T4'!AT19","v":""},{"$f":"'T5'!AT19","v":""},{"$f":"'T6'!AT19","v":""},{"$f":"'T1'!AU19","v":40},{"$f":"'T2'!AU19","v":53},{"$f":"'T3'!AU19","v":58},{"$f":"'T4'!AU19","v":""},{"$f":"'T5'!AU19","v":""},{"$f":"'T6'!AU19","v":""},64,34,64,64,50,50]
[null,9,null,null,{"$f":"SW!G18","v":"FABIYAN TRI BAKTI OKTAFIAN"},{"$f":"'T1'!AP20","v":59},{"$f":"'T2'!AP20","v":60},{"$f":"'T3'!AP20","v":66},{"$f":"'T4'!AP20","v":""},{"$f":"'T5'!AP20","v":""},{"$f":"'T6'!AP20","v":""},{"$f":"'T1'!AQ20","v":56},{"$f":"'T2'!AQ20","v":""},{"$f":"'T3'!AQ20","v":""},{"$f":"'T4'!AQ20","v":""},{"$f":"'T5'!AQ20","v":""},{"$f":"'T6'!AQ20","v":""},{"$f":"'T1'!AR20","v":59},{"$f":"'T2'!AR20","v":60},{"$f":"'T3'!AR20","v":66},{"$f":"'T4'!AR20","v":""},{"$f":"'T5'!AR20","v":""},{"$f":"'T6'!AR20","v":""},{"$f":"'T1'!AS20","v":59},{"$f":"'T2'!AS20","v":60},{"$f":"'T3'!AS20","v":66},{"$f":"'T4'!AS20","v":""},{"$f":"'T5'!AS20","v":""},{"$f":"'T6'!AS20","v":""},{"$f":"'T1'!AT20","v":50},{"$f":"'T2'!AT20","v":55},{"$f":"'T3'!AT20","v":68},{"$f":"'T4'!AT20","v":""},{"$f":"'T5'!AT20","v":""},{"$f":"'T6'!AT20","v":""},{"$f":"'T1'!AU20","v":50},{"$f":"'T2'!AU20","v":55},{"$f":"'T3'!AU20","v":68},{"$f":"'T4'!AU20","v":""},{"$f":"'T5'!AU20","v":""},{"$f":"'T6'!AU20","v":""},62,56,62,62,58,58]
[null,10,null,null,{"$f":"SW!G19","v":"FELISITA APRILIA NUR NIHAYA"},{"$f":"'T1'!AP21","v":64},{"$f":"'T2'!AP21","v":75},{"$f":"'T3'!AP21","v":55},{"$f":"'T4'!AP21","v":""},{"$f":"'T5'!AP21","v":""},{"$f":"'T6'!AP21","v":""},{"$f":"'T1'!AQ21","v":29},{"$f":"'T2'!AQ21","v":""},{"$f":"'T3'!AQ21","v":""},{"$f":"'T4'!AQ21","v":""},{"$f":"'T5'!AQ21","v":""},{"$f":"'T6'!AQ21","v":""},{"$f":"'T1'!AR21","v":64},{"$f":"'T2'!AR21","v":75},{"$f":"'T3'!AR21","v":55},{"$f":"'T4'!AR21","v":""},{"$f":"'T5'!AR21","v":""},{"$f":"'T6'!AR21","v":""},{"$f":"'T1'!AS21","v":64},{"$f":"'T2'!AS21","v":75},{"$f":"'T3'!AS21","v":55},{"$f":"'T4'!AS21","v":""},{"$f":"'T5'!AS21","v":""},{"$f":"'T6'!AS21","v":""},{"$f":"'T1'!AT21","v":30},{"$f":"'T2'!AT21","v":45},{"$f":"'T3'!AT21","v":60},{"$f":"'T4'!AT21","v":""},{"$f":"'T5'!AT21","v":""},{"$f":"'T6'!AT21","v":""},{"$f":"'T1'!AU21","v":30},{"$f":"'T2'!AU21","v":45},{"$f":"'T3'!AU21","v":60},{"$f":"'T4'!AU21","v":""},{"$f":"'T5'!AU21","v":""},{"$f":"'T6'!AU21","v":""},65,29,65,65,45,45]
[null,11,null,null,{"$f":"SW!G20","v":"FIRDA DWI ANDRIANI"},{"$f":"'T1'!AP22","v":54},{"$f":"'T2'!AP22","v":67},{"$f":"'T3'!AP22","v":50},{"$f":"'T4'!AP22","v":""},{"$f":"'T5'!AP22","v":""},{"$f":"'T6'!AP22","v":""},{"$f":"'T1'!AQ22","v":59},{"$f":"'T2'!AQ22","v":""},{"$f":"'T3'!AQ22","v":""},{"$f":"'T4'!AQ22","v":""},{"$f":"'T5'!AQ22","v":""},{"$f":"'T6'!AQ22","v":""},{"$f":"'T1'!AR22","v":54},{"$f":"'T2'!AR22","v":67},{"$f":"'T3'!AR22","v":50},{"$f":"'T4'!AR22","v":""},{"$f":"'T5'!AR22","v":""},{"$f":"'T6'!AR22","v":""},{"$f":"'T1'!AS22","v":54},{"$f":"'T2'!AS22","v":67},{"$f":"'T3'!AS22","v":50},{"$f":"'T4'!AS22","v":""},{"$f":"'T5'!AS22","v":""},{"$f":"'T6'!AS22","v":""},{"$f":"'T1'!AT22","v":38},{"$f":"'T2'!AT22","v":50},{"$f":"'T3'!AT22","v":60},{"$f":"'T4'!AT22","v":""},{"$f":"'T5'!AT22","v":""},{"$f":"'T6'!AT22","v":""},{"$f":"'T1'!AU22","v":38},{"$f":"'T2'!AU22","v":50},{"$f":"'T3'!AU22","v":60},{"$f":"'T4'!AU22","v":""},{"$f":"'T5'!AU22","v":""},{"$f":"'T6'!AU22","v":""},57,59,57,57,49,49]
[null,12,null,null,{"$f":"SW!G21","v":"GILANG AKBAR PRASETYO"},{"$f":"'T1'!AP23","v":59},{"$f":"'T2'!AP23","v":50},{"$f":"'T3'!AP23","v":57},{"$f":"'T4'!AP23","v":""},{"$f":"'T5'!AP23","v":""},{"$f":"'T6'!AP23","v":""},{"$f":"'T1'!AQ23","v":29},{"$f":"'T2'!AQ23","v":""},{"$f":"'T3'!AQ23","v":""},{"$f":"'T4'!AQ23","v":""},{"$f":"'T5'!AQ23","v":""},{"$f":"'T6'!AQ23","v":""},{"$f":"'T1'!AR23","v":59},{"$f":"'T2'!AR23","v":50},{"$f":"'T3'!AR23","v":57},{"$f":"'T4'!AR23","v":""},{"$f":"'T5'!AR23","v":""},{"$f":"'T6'!AR23","v":""},{"$f":"'T1'!AS23","v":59},{"$f":"'T2'!AS23","v":50},{"$f":"'T3'!AS23","v":57},{"$f":"'T4'!AS23","v":""},{"$f":"'T5'!AS23","v":""},{"$f":"'T6'!AS23","v":""},{"$f":"'T1'!AT23","v":45},{"$f":"'T2'!AT23","v":38},{"$f":"'T3'!AT23","v":68},{"$f":"'T4'!AT23","v":""},{"$f":"'T5'!AT23","v":""},{"$f":"'T6'!AT23","v":""},{"$f":"'T1'!AU23","v":45},{"$f":"'T2'!AU23","v":38},{"$f":"'T3'!AU23","v":68},{"$f":"'T4'!AU23","v":""},{"$f":"'T5'!AU23","v":""},{"$f":"'T6'!AU23","v":""},55,29,55,55,50,50]
[null,13,null,null,{"$f":"SW!G22","v":"IFTAH IZZAH EMILIA  MAHMUD"},{"$f":"'T1'!AP24","v":54},{"$f":"'T2'!AP24","v":69},{"$f":"'T3'!AP24","v":63},{"$f":"'T4'!AP24","v":""},{"$f":"'T5'!AP24","v":""},{"$f":"'T6'!AP24","v":""},{"$f":"'T1'!AQ24","v":51},{"$f":"'T2'!AQ24","v":""},{"$f":"'T3'!AQ24","v":""},{"$f":"'T4'!AQ24","v":""},{"$f":"'T5'!AQ24","v":""},{"$f":"'T6'!AQ24","v":""},{"$f":"'T1'!AR24","v":54},{"$f":"'T2'!AR24","v":69},{"$f":"'T3'!AR24","v":63},{"$f":"'T4'!AR24","v":""},{"$f":"'T5'!AR24","v":""},{"$f":"'T6'!AR24","v":""},{"$f":"'T1'!AS24","v":54},{"$f":"'T2'!AS24","v":69},{"$f":"'T3'!AS24","v":63},{"$f":"'T4'!AS24","v":""},{"$f":"'T5'!AS24","v":""},{"$f":"'T6'!AS24","v":""},{"$f":"'T1'!AT24","v":53},{"$f":"'T2'!AT24","v":60},{"$f":"'T3'!AT24","v":68},{"$f":"'T4'!AT24","v":""},{"$f":"'T5'!AT24","v":""},{"$f":"'T6'!AT24","v":""},{"$f":"'T1'!AU24","v":53},{"$f":"'T2'!AU24","v":60},{"$f":"'T3'!AU24","v":68},{"$f":"'T4'!AU24","v":""},{"$f":"'T5'!AU24","v":""},{"$f":"'T6'!AU24","v":""},62,51,62,62,60,60]
[null,14,null,null,{"$f":"SW!G23","v":"INES ARIFANI MAULINA"},{"$f":"'T1'!AP25","v":57},{"$f":"'T2'!AP25","v":70},{"$f":"'T3'!AP25","v":79},{"$f":"'T4'!AP25","v":""},{"$f":"'T5'!AP25","v":""},{"$f":"'T6'!AP25","v":""},{"$f":"'T1'!AQ25","v":47},{"$f":"'T2'!AQ25","v":""},{"$f":"'T3'!AQ25","v":""},{"$f":"'T4'!AQ25","v":""},{"$f":"'T5'!AQ25","v":""},{"$f":"'T6'!AQ25","v":""},{"$f":"'T1'!AR25","v":57},{"$f":"'T2'!AR25","v":70},{"$f":"'T3'!AR25","v":79},{"$f":"'T4'!AR25","v":""},{"$f":"'T5'!AR25","v":""},{"$f":"'T6'!AR25","v":""},{"$f":"'T1'!AS25","v":57},{"$f":"'T2'!AS25","v":70},{"$f":"'T3'!AS25","v":79},{"$f":"'T4'!AS25","v":""},{"$f":"'T5'!AS25","v":""},{"$f":"'T6'!AS25","v":""},{"$f":"'T1'!AT25","v":60},{"$f":"'T2'!AT25","v":63},{"$f":"'T3'!AT25","v":53},{"$f":"'T4'!AT25","v":""},{"$f":"'T5'!AT25","v":""},{"$f":"'T6'!AT25","v":""},{"$f":"'T1'!AU25","v":60},{"$f":"'T2'!AU25","v":63},{"$f":"'T3'!AU25","v":53},{"$f":"'T4'!AU25","v":""},{"$f":"'T5'!AU25","v":""},{"$f":"'T6'!AU25","v":""},69,47,69,69,59,59]
[null,15,null,null,{"$f":"SW!G24","v":"IYAAD  AFLAKHA RAMZII"},{"$f":"'T1'!AP26","v":60},{"$f":"'T2'!AP26","v":72},{"$f":"'T3'!AP26","v":60},{"$f":"'T4'!AP26","v":""},{"$f":"'T5'!AP26","v":""},{"$f":"'T6'!AP26","v":""},{"$f":"'T1'!AQ26","v":34},{"$f":"'T2'!AQ26","v":""},{"$f":"'T3'!AQ26","v":""},{"$f":"'T4'!AQ26","v":""},{"$f":"'T5'!AQ26","v":""},{"$f":"'T6'!AQ26","v":""},{"$f":"'T1'!AR26","v":60},{"$f":"'T2'!AR26","v":72},{"$f":"'T3'!AR26","v":60},{"$f":"'T4'!AR26","v":""},{"$f":"'T5'!AR26","v":""},{"$f":"'T6'!AR26","v":""},{"$f":"'T1'!AS26","v":60},{"$f":"'T2'!AS26","v":72},{"$f":"'T3'!AS26","v":60},{"$f":"'T4'!AS26","v":""},{"$f":"'T5'!AS26","v":""},{"$f":"'T6'!AS26","v":""},{"$f":"'T1'!AT26","v":70},{"$f":"'T2'!AT26","v":63},{"$f":"'T3'!AT26","v":28},{"$f":"'T4'!AT26","v":""},{"$f":"'T5'!AT26","v":""},{"$f":"'T6'!AT26","v":""},{"$f":"'T1'!AU26","v":70},{"$f":"'T2'!AU26","v":63},{"$f":"'T3'!AU26","v":28},{"$f":"'T4'!AU26","v":""},{"$f":"'T5'!AU26","v":""},{"$f":"'T6'!AU26","v":""},64,34,64,64,54,54]
[null,16,null,null,{"$f":"SW!G25","v":"JULI ANDRIYANTO"},{"$f":"'T1'!AP27","v":47},{"$f":"'T2'!AP27","v":44},{"$f":"'T3'!AP27","v":51},{"$f":"'T4'!AP27","v":""},{"$f":"'T5'!AP27","v":""},{"$f":"'T6'!AP27","v":""},{"$f":"'T1'!AQ27","v":41},{"$f":"'T2'!AQ27","v":""},{"$f":"'T3'!AQ27","v":""},{"$f":"'T4'!AQ27","v":""},{"$f":"'T5'!AQ27","v":""},{"$f":"'T6'!AQ27","v":""},{"$f":"'T1'!AR27","v":47},{"$f":"'T2'!AR27","v":44},{"$f":"'T3'!AR27","v":51},{"$f":"'T4'!AR27","v":""},{"$f":"'T5'!AR27","v":""},{"$f":"'T6'!AR27","v":""},{"$f":"'T1'!AS27","v":47},{"$f":"'T2'!AS27","v":44},{"$f":"'T3'!AS27","v":51},{"$f":"'T4'!AS27","v":""},{"$f":"'T5'!AS27","v":""},{"$f":"'T6'!AS27","v":""},{"$f":"'T1'!AT27","v":38},{"$f":"'T2'!AT27","v":25},{"$f":"'T3'!AT27","v":60},{"$f":"'T4'!AT27","v":""},{"$f":"'T5'!AT27","v":""},{"$f":"'T6'!AT27","v":""},{"$f":"'T1'!AU27","v":38},{"$f":"'T2'!AU27","v":25},{"$f":"'T3'!AU27","v":60},{"$f":"'T4'!AU27","v":""},{"$f":"'T5'!AU27","v":""},{"$f":"'T6'!AU27","v":""},47,41,47,47,41,41]
[null,17,null,null,{"$f":"SW!G26","v":"LIYA FEBRIYANI"},{"$f":"'T1'!AP28","v":84},{"$f":"'T2'!AP28","v":70},{"$f":"'T3'!AP28","v":86},{"$f":"'T4'!AP28","v":""},{"$f":"'T5'!AP28","v":""},{"$f":"'T6'!AP28","v":""},{"$f":"'T1'!AQ28","v":66},{"$f":"'T2'!AQ28","v":""},{"$f":"'T3'!AQ28","v":""},{"$f":"'T4'!AQ28","v":""},{"$f":"'T5'!AQ28","v":""},{"$f":"'T6'!AQ28","v":""},{"$f":"'T1'!AR28","v":84},{"$f":"'T2'!AR28","v":70},{"$f":"'T3'!AR28","v":86},{"$f":"'T4'!AR28","v":""},{"$f":"'T5'!AR28","v":""},{"$f":"'T6'!AR28","v":""},{"$f":"'T1'!AS28","v":84},{"$f":"'T2'!AS28","v":70},{"$f":"'T3'!AS28","v":86},{"$f":"'T4'!AS28","v":""},{"$f":"'T5'!AS28","v":""},{"$f":"'T6'!AS28","v":""},{"$f":"'T1'!AT28","v":60},{"$f":"'T2'!AT28","v":48},{"$f":"'T3'!AT28","v":65},{"$f":"'T4'!AT28","v":""},{"$f":"'T5'!AT28","v":""},{"$f":"'T6'!AT28","v":""},{"$f":"'T1'!AU28","v":60},{"$f":"'T2'!AU28","v":48},{"$f":"'T3'!AU28","v":65},{"$f":"'T4'!AU28","v":""},{"$f":"'T5'!AU28","v":""},{"$f":"'T6'!AU28","v":""},80,66,80,80,58,58]
[null,18,null,null,{"$f":"SW!G27","v":"LIZATUL CHAIYUNI"},{"$f":"'T1'!AP29","v":72},{"$f":"'T2'!AP29","v":55},{"$f":"'T3'!AP29","v":82},{"$f":"'T4'!AP29","v":""},{"$f":"'T5'!AP29","v":""},{"$f":"'T6'!AP29","v":""},{"$f":"'T1'!AQ29","v":50},{"$f":"'T2'!AQ29","v":""},{"$f":"'T3'!AQ29","v":""},{"$f":"'T4'!AQ29","v":""},{"$f":"'T5'!AQ29","v":""},{"$f":"'T6'!AQ29","v":""},{"$f":"'T1'!AR29","v":72},{"$f":"'T2'!AR29","v":55},{"$f":"'T3'!AR29","v":82},{"$f":"'T4'!AR29","v":""},{"$f":"'T5'!AR29","v":""},{"$f":"'T6'!AR29","v":""},{"$f":"'T1'!AS29","v":72},{"$f":"'T2'!AS29","v":55},{"$f":"'T3'!AS29","v":82},{"$f":"'T4'!AS29","v":""},{"$f":"'T5'!AS29","v":""},{"$f":"'T6'!AS29","v":""},{"$f":"'T1'!AT29","v":50},{"$f":"'T2'!AT29","v":43},{"$f":"'T3'!AT29","v":45},{"$f":"'T4'!AT29","v":""},{"$f":"'T5'!AT29","v":""},{"$f":"'T6'!AT29","v":""},{"$f":"'T1'!AU29","v":50},{"$f":"'T2'!AU29","v":43},{"$f":"'T3'!AU29","v":45},{"$f":"'T4'!AU29","v":""},{"$f":"'T5'!AU29","v":""},{"$f":"'T6'!AU29","v":""},70,50,70,70,46,46]
[null,19,null,null,{"$f":"SW!G28","v":"M.AL HAFIZ"},{"$f":"'T1'!AP30","v":82},{"$f":"'T2'!AP30","v":62},{"$f":"'T3'!AP30","v":65},{"$f":"'T4'!AP30","v":""},{"$f":"'T5'!AP30","v":""},{"$f":"'T6'!AP30","v":""},{"$f":"'T1'!AQ30","v":19},{"$f":"'T2'!AQ30","v":""},{"$f":"'T3'!AQ30","v":""},{"$f":"'T4'!AQ30","v":""},{"$f":"'T5'!AQ30","v":""},{"$f":"'T6'!AQ30","v":""},{"$f":"'T1'!AR30","v":82},{"$f":"'T2'!AR30","v":62},{"$f":"'T3'!AR30","v":65},{"$f":"'T4'!AR30","v":""},{"$f":"'T5'!AR30","v":""},{"$f":"'T6'!AR30","v":""},{"$f":"'T1'!AS30","v":82},{"$f":"'T2'!AS30","v":62},{"$f":"'T3'!AS30","v":65},{"$f":"'T4'!AS30","v":""},{"$f":"'T5'!AS30","v":""},{"$f":"'T6'!AS30","v":""},{"$f":"'T1'!AT30","v":68},{"$f":"'T2'!AT30","v":35},{"$f":"'T3'!AT30","v":53},{"$f":"'T4'!AT30","v":""},{"$f":"'T5'!AT30","v":""},{"$f":"'T6'!AT30","v":""},{"$f":"'T1'!AU30","v":68},{"$f":"'T2'!AU30","v":35},{"$f":"'T3'!AU30","v":53},{"$f":"'T4'!AU30","v":""},{"$f":"'T5'!AU30","v":""},{"$f":"'T6'!AU30","v":""},70,19,70,70,52,52]
[null,20,null,null,{"$f":"SW!G29","v":"M. RIZKY RIDWAN"},{"$f":"'T1'!AP31","v":47},{"$f":"'T2'!AP31","v":54},{"$f":"'T3'!AP31","v":48},{"$f":"'T4'!AP31","v":""},{"$f":"'T5'!AP31","v":""},{"$f":"'T6'!AP31","v":""},{"$f":"'T1'!AQ31","v":41},{"$f":"'T2'!AQ31","v":""},{"$f":"'T3'!AQ31","v":""},{"$f":"'T4'!AQ31","v":""},{"$f":"'T5'!AQ31","v":""},{"$f":"'T6'!AQ31","v":""},{"$f":"'T1'!AR31","v":47},{"$f":"'T2'!AR31","v":54},{"$f":"'T3'!AR31","v":48},{"$f":"'T4'!AR31","v":""},{"$f":"'T5'!AR31","v":""},{"$f":"'T6'!AR31","v":""},{"$f":"'T1'!AS31","v":47},{"$f":"'T2'!AS31","v":54},{"$f":"'T3'!AS31","v":48},{"$f":"'T4'!AS31","v":""},{"$f":"'T5'!AS31","v":""},{"$f":"'T6'!AS31","v":""},{"$f":"'T1'!AT31","v":63},{"$f":"'T2'!AT31","v":33},{"$f":"'T3'!AT31","v":33},{"$f":"'T4'!AT31","v":""},{"$f":"'T5'!AT31","v":""},{"$f":"'T6'!AT31","v":""},{"$f":"'T1'!AU31","v":63},{"$f":"'T2'!AU31","v":33},{"$f":"'T3'!AU31","v":33},{"$f":"'T4'!AU31","v":""},{"$f":"'T5'!AU31","v":""},{"$f":"'T6'!AU31","v":""},50,41,50,50,43,43]
[null,21,null,null,{"$f":"SW!G30","v":"MOCHAMAD RAFLI DIAN SAPUTRA"},{"$f":"'T1'!AP32","v":54},{"$f":"'T2'!AP32","v":69},{"$f":"'T3'!AP32","v":63},{"$f":"'T4'!AP32","v":""},{"$f":"'T5'!AP32","v":""},{"$f":"'T6'!AP32","v":""},{"$f":"'T1'!AQ32","v":46},{"$f":"'T2'!AQ32","v":""},{"$f":"'T3'!AQ32","v":""},{"$f":"'T4'!AQ32","v":""},{"$f":"'T5'!AQ32","v":""},{"$f":"'T6'!AQ32","v":""},{"$f":"'T1'!AR32","v":54},{"$f":"'T2'!AR32","v":69},{"$f":"'T3'!AR32","v":63},{"$f":"'T4'!AR32","v":""},{"$f":"'T5'!AR32","v":""},{"$f":"'T6'!AR32","v":""},{"$f":"'T1'!AS32","v":54},{"$f":"'T2'!AS32","v":69},{"$f":"'T3'!AS32","v":63},{"$f":"'T4'!AS32","v":""},{"$f":"'T5'!AS32","v":""},{"$f":"'T6'!AS32","v":""},{"$f":"'T1'!AT32","v":55},{"$f":"'T2'!AT32","v":58},{"$f":"'T3'!AT32","v":45},{"$f":"'T4'!AT32","v":""},{"$f":"'T5'!AT32","v":""},{"$f":"'T6'!AT32","v":""},{"$f":"'T1'!AU32","v":55},{"$f":"'T2'!AU32","v":58},{"$f":"'T3'!AU32","v":45},{"$f":"'T4'!AU32","v":""},{"$f":"'T5'!AU32","v":""},{"$f":"'T6'!AU32","v":""},62,46,62,62,53,53]
[null,22,null,null,{"$f":"SW!G31","v":"MOCHAMMAD AFAREL PUTRA RAMDHANA"},{"$f":"'T1'!AP33","v":92},{"$f":"'T2'!AP33","v":84},{"$f":"'T3'!AP33","v":77},{"$f":"'T4'!AP33","v":""},{"$f":"'T5'!AP33","v":""},{"$f":"'T6'!AP33","v":""},{"$f":"'T1'!AQ33","v":75},{"$f":"'T2'!AQ33","v":""},{"$f":"'T3'!AQ33","v":""},{"$f":"'T4'!AQ33","v":""},{"$f":"'T5'!AQ33","v":""},{"$f":"'T6'!AQ33","v":""},{"$f":"'T1'!AR33","v":92},{"$f":"'T2'!AR33","v":84},{"$f":"'T3'!AR33","v":77},{"$f":"'T4'!AR33","v":""},{"$f":"'T5'!AR33","v":""},{"$f":"'T6'!AR33","v":""},{"$f":"'T1'!AS33","v":92},{"$f":"'T2'!AS33","v":84},{"$f":"'T3'!AS33","v":77},{"$f":"'T4'!AS33","v":""},{"$f":"'T5'!AS33","v":""},{"$f":"'T6'!AS33","v":""},{"$f":"'T1'!AT33","v":73},{"$f":"'T2'!AT33","v":38},{"$f":"'T3'!AT33","v":65},{"$f":"'T4'!AT33","v":""},{"$f":"'T5'!AT33","v":""},{"$f":"'T6'!AT33","v":""},{"$f":"'T1'!AU33","v":73},{"$f":"'T2'!AU33","v":38},{"$f":"'T3'!AU33","v":65},{"$f":"'T4'!AU33","v":""},{"$f":"'T5'!AU33","v":""},{"$f":"'T6'!AU33","v":""},84,75,84,84,59,59]
[null,23,null,null,{"$f":"SW!G32","v":"MUHAMAD JEFRI MAULANA"},{"$f":"'T1'!AP34","v":57},{"$f":"'T2'!AP34","v":70},{"$f":"'T3'!AP34","v":67},{"$f":"'T4'!AP34","v":""},{"$f":"'T5'!AP34","v":""},{"$f":"'T6'!AP34","v":""},{"$f":"'T1'!AQ34","v":59},{"$f":"'T2'!AQ34","v":""},{"$f":"'T3'!AQ34","v":""},{"$f":"'T4'!AQ34","v":""},{"$f":"'T5'!AQ34","v":""},{"$f":"'T6'!AQ34","v":""},{"$f":"'T1'!AR34","v":57},{"$f":"'T2'!AR34","v":70},{"$f":"'T3'!AR34","v":67},{"$f":"'T4'!AR34","v":""},{"$f":"'T5'!AR34","v":""},{"$f":"'T6'!AR34","v":""},{"$f":"'T1'!AS34","v":57},{"$f":"'T2'!AS34","v":70},{"$f":"'T3'!AS34","v":67},{"$f":"'T4'!AS34","v":""},{"$f":"'T5'!AS34","v":""},{"$f":"'T6'!AS34","v":""},{"$f":"'T1'!AT34","v":35},{"$f":"'T2'!AT34","v":70},{"$f":"'T3'!AT34","v":60},{"$f":"'T4'!AT34","v":""},{"$f":"'T5'!AT34","v":""},{"$f":"'T6'!AT34","v":""},{"$f":"'T1'!AU34","v":35},{"$f":"'T2'!AU34","v":70},{"$f":"'T3'!AU34","v":60},{"$f":"'T4'!AU34","v":""},{"$f":"'T5'!AU34","v":""},{"$f":"'T6'!AU34","v":""},65,59,65,65,55,55]
[null,24,null,null,{"$f":"SW!G33","v":"MUHAMMAD DWI WILDAN BAGUS KURNIAWAN"},{"$f":"'T1'!AP35","v":49},{"$f":"'T2'!AP35","v":44},{"$f":"'T3'!AP35","v":43},{"$f":"'T4'!AP35","v":""},{"$f":"'T5'!AP35","v":""},{"$f":"'T6'!AP35","v":""},{"$f":"'T1'!AQ35","v":22},{"$f":"'T2'!AQ35","v":""},{"$f":"'T3'!AQ35","v":""},{"$f":"'T4'!AQ35","v":""},{"$f":"'T5'!AQ35","v":""},{"$f":"'T6'!AQ35","v":""},{"$f":"'T1'!AR35","v":49},{"$f":"'T2'!AR35","v":44},{"$f":"'T3'!AR35","v":43},{"$f":"'T4'!AR35","v":""},{"$f":"'T5'!AR35","v":""},{"$f":"'T6'!AR35","v":""},{"$f":"'T1'!AS35","v":49},{"$f":"'T2'!AS35","v":44},{"$f":"'T3'!AS35","v":43},{"$f":"'T4'!AS35","v":""},{"$f":"'T5'!AS35","v":""},{"$f":"'T6'!AS35","v":""},{"$f":"'T1'!AT35","v":55},{"$f":"'T2'!AT35","v":35},{"$f":"'T3'!AT35","v":40},{"$f":"'T4'!AT35","v":""},{"$f":"'T5'!AT35","v":""},{"$f":"'T6'!AT35","v":""},{"$f":"'T1'!AU35","v":55},{"$f":"'T2'!AU35","v":35},{"$f":"'T3'!AU35","v":40},{"$f":"'T4'!AU35","v":""},{"$f":"'T5'!AU35","v":""},{"$f":"'T6'!AU35","v":""},45,22,45,45,43,43]
[null,25,null,null,{"$f":"SW!G34","v":"MUHAMMAD FARIL FIRMANSYA"},{"$f":"'T1'!AP36","v":45},{"$f":"'T2'!AP36","v":55},{"$f":"'T3'!AP36","v":48},{"$f":"'T4'!AP36","v":""},{"$f":"'T5'!AP36","v":""},{"$f":"'T6'!AP36","v":""},{"$f":"'T1'!AQ36","v":28},{"$f":"'T2'!AQ36","v":""},{"$f":"'T3'!AQ36","v":""},{"$f":"'T4'!AQ36","v":""},{"$f":"'T5'!AQ36","v":""},{"$f":"'T6'!AQ36","v":""},{"$f":"'T1'!AR36","v":45},{"$f":"'T2'!AR36","v":55},{"$f":"'T3'!AR36","v":48},{"$f":"'T4'!AR36","v":""},{"$f":"'T5'!AR36","v":""},{"$f":"'T6'!AR36","v":""},{"$f":"'T1'!AS36","v":45},{"$f":"'T2'!AS36","v":55},{"$f":"'T3'!AS36","v":48},{"$f":"'T4'!AS36","v":""},{"$f":"'T5'!AS36","v":""},{"$f":"'T6'!AS36","v":""},{"$f":"'T1'!AT36","v":43},{"$f":"'T2'!AT36","v":60},{"$f":"'T3'!AT36","v":48},{"$f":"'T4'!AT36","v":""},{"$f":"'T5'!AT36","v":""},{"$f":"'T6'!AT36","v":""},{"$f":"'T1'!AU36","v":43},{"$f":"'T2'!AU36","v":60},{"$f":"'T3'!AU36","v":48},{"$f":"'T4'!AU36","v":""},{"$f":"'T5'!AU36","v":""},{"$f":"'T6'!AU36","v":""},49,28,49,49,50,50]
[null,26,null,null,{"$f":"SW!G35","v":"MUHAMMAD FARIZ UBAIDILLA"},{"$f":"'T1'!AP37","v":57},{"$f":"'T2'!AP37","v":77},{"$f":"'T3'!AP37","v":62},{"$f":"'T4'!AP37","v":""},{"$f":"'T5'!AP37","v":""},{"$f":"'T6'!AP37","v":""},{"$f":"'T1'!AQ37","v":69},{"$f":"'T2'!AQ37","v":""},{"$f":"'T3'!AQ37","v":""},{"$f":"'T4'!AQ37","v":""},{"$f":"'T5'!AQ37","v":""},{"$f":"'T6'!AQ37","v":""},{"$f":"'T1'!AR37","v":57},{"$f":"'T2'!AR37","v":77},{"$f":"'T3'!AR37","v":62},{"$f":"'T4'!AR37","v":""},{"$f":"'T5'!AR37","v":""},{"$f":"'T6'!AR37","v":""},{"$f":"'T1'!AS37","v":57},{"$f":"'T2'!AS37","v":77},{"$f":"'T3'!AS37","v":62},{"$f":"'T4'!AS37","v":""},{"$f":"'T5'!AS37","v":""},{"$f":"'T6'!AS37","v":""},{"$f":"'T1'!AT37","v":60},{"$f":"'T2'!AT37","v":58},{"$f":"'T3'!AT37","v":68},{"$f":"'T4'!AT37","v":""},{"$f":"'T5'!AT37","v":""},{"$f":"'T6'!AT37","v":""},{"$f":"'T1'!AU37","v":60},{"$f":"'T2'!AU37","v":58},{"$f":"'T3'!AU37","v":68},{"$f":"'T4'!AU37","v":""},{"$f":"'T5'!AU37","v":""},{"$f":"'T6'!AU37","v":""},65,69,65,65,62,62]
[null,27,null,null,{"$f":"SW!G36","v":"MUHAMMAD MAULANA ZIDANIL ILMI"},{"$f":"'T1'!AP38","v":82},{"$f":"'T2'!AP38","v":74},{"$f":"'T3'!AP38","v":87},{"$f":"'T4'!AP38","v":""},{"$f":"'T5'!AP38","v":""},{"$f":"'T6'!AP38","v":""},{"$f":"'T1'!AQ38","v":47},{"$f":"'T2'!AQ38","v":""},{"$f":"'T3'!AQ38","v":""},{"$f":"'T4'!AQ38","v":""},{"$f":"'T5'!AQ38","v":""},{"$f":"'T6'!AQ38","v":""},{"$f":"'T1'!AR38","v":82},{"$f":"'T2'!AR38","v":74},{"$f":"'T3'!AR38","v":87},{"$f":"'T4'!AR38","v":""},{"$f":"'T5'!AR38","v":""},{"$f":"'T6'!AR38","v":""},{"$f":"'T1'!AS38","v":82},{"$f":"'T2'!AS38","v":74},{"$f":"'T3'!AS38","v":87},{"$f":"'T4'!AS38","v":""},{"$f":"'T5'!AS38","v":""},{"$f":"'T6'!AS38","v":""},{"$f":"'T1'!AT38","v":43},{"$f":"'T2'!AT38","v":50},{"$f":"'T3'!AT38","v":73},{"$f":"'T4'!AT38","v":""},{"$f":"'T5'!AT38","v":""},{"$f":"'T6'!AT38","v":""},{"$f":"'T1'!AU38","v":43},{"$f":"'T2'!AU38","v":50},{"$f":"'T3'!AU38","v":73},{"$f":"'T4'!AU38","v":""},{"$f":"'T5'!AU38","v":""},{"$f":"'T6'!AU38","v":""},81,47,81,81,55,55]
[null,28,null,null,{"$f":"SW!G37","v":"MUHAMMAD SUTRISNO ISMAIL"},{"$f":"'T1'!AP39","v":39},{"$f":"'T2'!AP39","v":54},{"$f":"'T3'!AP39","v":31},{"$f":"'T4'!AP39","v":""},{"$f":"'T5'!AP39","v":""},{"$f":"'T6'!AP39","v":""},{"$f":"'T1'!AQ39","v":30},{"$f":"'T2'!AQ39","v":""},{"$f":"'T3'!AQ39","v":""},{"$f":"'T4'!AQ39","v":""},{"$f":"'T5'!AQ39","v":""},{"$f":"'T6'!AQ39","v":""},{"$f":"'T1'!AR39","v":39},{"$f":"'T2'!AR39","v":54},{"$f":"'T3'!AR39","v":31},{"$f":"'T4'!AR39","v":""},{"$f":"'T5'!AR39","v":""},{"$f":"'T6'!AR39","v":""},{"$f":"'T1'!AS39","v":39},{"$f":"'T2'!AS39","v":54},{"$f":"'T3'!AS39","v":31},{"$f":"'T4'!AS39","v":""},{"$f":"'T5'!AS39","v":""},{"$f":"'T6'!AS39","v":""},{"$f":"'T1'!AT39","v":48},{"$f":"'T2'!AT39","v":58},{"$f":"'T3'!AT39","v":35},{"$f":"'T4'!AT39","v":""},{"$f":"'T5'!AT39","v":""},{"$f":"'T6'!AT39","v":""},{"$f":"'T1'!AU39","v":48},{"$f":"'T2'!AU39","v":58},{"$f":"'T3'!AU39","v":35},{"$f":"'T4'!AU39","v":""},{"$f":"'T5'!AU39","v":""},{"$f":"'T6'!AU39","v":""},41,30,41,41,47,47]
[null,29,null,null,{"$f":"SW!G38","v":"NOVITA ERNIAWAN"},{"$f":"'T1'!AP40","v":79},{"$f":"'T2'!AP40","v":72},{"$f":"'T3'!AP40","v":67},{"$f":"'T4'!AP40","v":""},{"$f":"'T5'!AP40","v":""},{"$f":"'T6'!AP40","v":""},{"$f":"'T1'!AQ40","v":62},{"$f":"'T2'!AQ40","v":""},{"$f":"'T3'!AQ40","v":""},{"$f":"'T4'!AQ40","v":""},{"$f":"'T5'!AQ40","v":""},{"$f":"'T6'!AQ40","v":""},{"$f":"'T1'!AR40","v":79},{"$f":"'T2'!AR40","v":72},{"$f":"'T3'!AR40","v":67},{"$f":"'T4'!AR40","v":""},{"$f":"'T5'!AR40","v":""},{"$f":"'T6'!AR40","v":""},{"$f":"'T1'!AS40","v":79},{"$f":"'T2'!AS40","v":72},{"$f":"'T3'!AS40","v":67},{"$f":"'T4'!AS40","v":""},{"$f":"'T5'!AS40","v":""},{"$f":"'T6'!AS40","v":""},{"$f":"'T1'!AT40","v":55},{"$f":"'T2'!AT40","v":68},{"$f":"'T3'!AT40","v":75},{"$f":"'T4'!AT40","v":""},{"$f":"'T5'!AT40","v":""},{"$f":"'T6'!AT40","v":""},{"$f":"'T1'!AU40","v":55},{"$f":"'T2'!AU40","v":68},{"$f":"'T3'!AU40","v":75},{"$f":"'T4'!AU40","v":""},{"$f":"'T5'!AU40","v":""},{"$f":"'T6'!AU40","v":""},73,62,73,73,66,66]
[null,30,null,null,{"$f":"SW!G39","v":"PUTRI AULIA DWI AGUSTIN"},{"$f":"'T1'!AP41","v":89},{"$f":"'T2'!AP41","v":67},{"$f":"'T3'!AP41","v":70},{"$f":"'T4'!AP41","v":""},{"$f":"'T5'!AP41","v":""},{"$f":"'T6'!AP41","v":""},{"$f":"'T1'!AQ41","v":33},{"$f":"'T2'!AQ41","v":""},{"$f":"'T3'!AQ41","v":""},{"$f":"'T4'!AQ41","v":""},{"$f":"'T5'!AQ41","v":""},{"$f":"'T6'!AQ41","v":""},{"$f":"'T1'!AR41","v":89},{"$f":"'T2'!AR41","v":67},{"$f":"'T3'!AR41","v":70},{"$f":"'T4'!AR41","v":""},{"$f":"'T5'!AR41","v":""},{"$f":"'T6'!AR41","v":""},{"$f":"'T1'!AS41","v":89},{"$f":"'T2'!AS41","v":67},{"$f":"'T3'!AS41","v":70},{"$f":"'T4'!AS41","v":""},{"$f":"'T5'!AS41","v":""},{"$f":"'T6'!AS41","v":""},{"$f":"'T1'!AT41","v":68},{"$f":"'T2'!AT41","v":65},{"$f":"'T3'!AT41","v":38},{"$f":"'T4'!AT41","v":""},{"$f":"'T5'!AT41","v":""},{"$f":"'T6'!AT41","v":""},{"$f":"'T1'!AU41","v":68},{"$f":"'T2'!AU41","v":65},{"$f":"'T3'!AU41","v":38},{"$f":"'T4'!AU41","v":""},{"$f":"'T5'!AU41","v":""},{"$f":"'T6'!AU41","v":""},75,33,75,75,57,57]
[null,31,null,null,{"$f":"SW!G40","v":"STANY RAFIDAH RAHMANIA"},{"$f":"'T1'!AP42","v":35},{"$f":"'T2'!AP42","v":50},{"$f":"'T3'!AP42","v":46},{"$f":"'T4'!AP42","v":""},{"$f":"'T5'!AP42","v":""},{"$f":"'T6'!AP42","v":""},{"$f":"'T1'!AQ42","v":34},{"$f":"'T2'!AQ42","v":""},{"$f":"'T3'!AQ42","v":""},{"$f":"'T4'!AQ42","v":""},{"$f":"'T5'!AQ42","v":""},{"$f":"'T6'!AQ42","v":""},{"$f":"'T1'!AR42","v":35},{"$f":"'T2'!AR42","v":50},{"$f":"'T3'!AR42","v":46},{"$f":"'T4'!AR42","v":""},{"$f":"'T5'!AR42","v":""},{"$f":"'T6'!AR42","v":""},{"$f":"'T1'!AS42","v":35},{"$f":"'T2'!AS42","v":50},{"$f":"'T3'!AS42","v":46},{"$f":"'T4'!AS42","v":""},{"$f":"'T5'!AS42","v":""},{"$f":"'T6'!AS42","v":""},{"$f":"'T1'!AT42","v":33},{"$f":"'T2'!AT42","v":50},{"$f":"'T3'!AT42","v":45},{"$f":"'T4'!AT42","v":""},{"$f":"'T5'!AT42","v":""},{"$f":"'T6'!AT42","v":""},{"$f":"'T1'!AU42","v":33},{"$f":"'T2'!AU42","v":50},{"$f":"'T3'!AU42","v":45},{"$f":"'T4'!AU42","v":""},{"$f":"'T5'!AU42","v":""},{"$f":"'T6'!AU42","v":""},44,34,44,44,43,43]
[null,32,null,null,{"$f":"SW!G41","v":"USWATUN KHASANAH"},{"$f":"'T1'!AP43","v":75},{"$f":"'T2'!AP43","v":65},{"$f":"'T3'!AP43","v":56},{"$f":"'T4'!AP43","v":""},{"$f":"'T5'!AP43","v":""},{"$f":"'T6'!AP43","v":""},{"$f":"'T1'!AQ43","v":25},{"$f":"'T2'!AQ43","v":""},{"$f":"'T3'!AQ43","v":""},{"$f":"'T4'!AQ43","v":""},{"$f":"'T5'!AQ43","v":""},{"$f":"'T6'!AQ43","v":""},{"$f":"'T1'!AR43","v":75},{"$f":"'T2'!AR43","v":65},{"$f":"'T3'!AR43","v":56},{"$f":"'T4'!AR43","v":""},{"$f":"'T5'!AR43","v":""},{"$f":"'T6'!AR43","v":""},{"$f":"'T1'!AS43","v":75},{"$f":"'T2'!AS43","v":65},{"$f":"'T3'!AS43","v":56},{"$f":"'T4'!AS43","v":""},{"$f":"'T5'!AS43","v":""},{"$f":"'T6'!AS43","v":""},{"$f":"'T1'!AT43","v":60},{"$f":"'T2'!AT43","v":53},{"$f":"'T3'!AT43","v":44},{"$f":"'T4'!AT43","v":""},{"$f":"'T5'!AT43","v":""},{"$f":"'T6'!AT43","v":""},{"$f":"'T1'!AU43","v":60},{"$f":"'T2'!AU43","v":53},{"$f":"'T3'!AU43","v":44},{"$f":"'T4'!AU43","v":""},{"$f":"'T5'!AU43","v":""},{"$f":"'T6'!AU43","v":""},65,25,65,65,52,52]
[null,33,null,null,{"$f":"SW!G42","v":"VIKROUL KHAMILA"},{"$f":"'T1'!AP44","v":77},{"$f":"'T2'!AP44","v":74},{"$f":"'T3'!AP44","v":66},{"$f":"'T4'!AP44","v":""},{"$f":"'T5'!AP44","v":""},{"$f":"'T6'!AP44","v":""},{"$f":"'T1'!AQ44","v":77},{"$f":"'T2'!AQ44","v":""},{"$f":"'T3'!AQ44","v":""},{"$f":"'T4'!AQ44","v":""},{"$f":"'T5'!AQ44","v":""},{"$f":"'T6'!AQ44","v":""},{"$f":"'T1'!AR44","v":77},{"$f":"'T2'!AR44","v":74},{"$f":"'T3'!AR44","v":66},{"$f":"'T4'!AR44","v":""},{"$f":"'T5'!AR44","v":""},{"$f":"'T6'!AR44","v":""},{"$f":"'T1'!AS44","v":77},{"$f":"'T2'!AS44","v":74},{"$f":"'T3'!AS44","v":66},{"$f":"'T4'!AS44","v":""},{"$f":"'T5'!AS44","v":""},{"$f":"'T6'!AS44","v":""},{"$f":"'T1'!AT44","v":63},{"$f":"'T2'!AT44","v":53},{"$f":"'T3'!AT44","v":53},{"$f":"'T4'!AT44","v":""},{"$f":"'T5'!AT44","v":""},{"$f":"'T6'!AT44","v":""},{"$f":"'T1'!AU44","v":63},{"$f":"'T2'!AU44","v":53},{"$f":"'T3'!AU44","v":53},{"$f":"'T4'!AU44","v":""},{"$f":"'T5'!AU44","v":""},{"$f":"'T6'!AU44","v":""},72,77,72,72,56,56]
[null,34,null,null,{"$f":"SW!G43","v":0},{"$f":"'T1'!AP45","v":""},{"$f":"'T2'!AP45","v":""},{"$f":"'T3'!AP45","v":""},{"$f":"'T4'!AP45","v":""},{"$f":"'T5'!AP45","v":""},{"$f":"'T6'!AP45","v":""},{"$f":"'T1'!AQ45","v":""},{"$f":"'T2'!AQ45","v":""},{"$f":"'T3'!AQ45","v":""},{"$f":"'T4'!AQ45","v":""},{"$f":"'T5'!AQ45","v":""},{"$f":"'T6'!AQ45","v":""},{"$f":"'T1'!AR45","v":""},{"$f":"'T2'!AR45","v":""},{"$f":"'T3'!AR45","v":""},{"$f":"'T4'!AR45","v":""},{"$f":"'T5'!AR45","v":""},{"$f":"'T6'!AR45","v":""},{"$f":"'T1'!AS45","v":""},{"$f":"'T2'!AS45","v":""},{"$f":"'T3'!AS45","v":""},{"$f":"'T4'!AS45","v":""},{"$f":"'T5'!AS45","v":""},{"$f":"'T6'!AS45","v":""},{"$f":"'T1'!AT45","v":""},{"$f":"'T2'!AT45","v":""},{"$f":"'T3'!AT45","v":""},{"$f":"'T4'!AT45","v":""},{"$f":"'T5'!AT45","v":""},{"$f":"'T6'!AT45","v":""},{"$f":"'T1'!AU45","v":""},{"$f":"'T2'!AU45","v":""},{"$f":"'T3'!AU45","v":""},{"$f":"'T4'!AU45","v":""},{"$f":"'T5'!AU45","v":""},{"$f":"'T6'!AU45","v":""},"","","","","",""]
[null,35,null,null,{"$f":"SW!G44","v":0},{"$f":"'T1'!AP46","v":""},{"$f":"'T2'!AP46","v":""},{"$f":"'T3'!AP46","v":""},{"$f":"'T4'!AP46","v":""},{"$f":"'T5'!AP46","v":""},{"$f":"'T6'!AP46","v":""},{"$f":"'T1'!AQ46","v":""},{"$f":"'T2'!AQ46","v":""},{"$f":"'T3'!AQ46","v":""},{"$f":"'T4'!AQ46","v":""},{"$f":"'T5'!AQ46","v":""},{"$f":"'T6'!AQ46","v":""},{"$f":"'T1'!AR46","v":""},{"$f":"'T2'!AR46","v":""},{"$f":"'T3'!AR46","v":""},{"$f":"'T4'!AR46","v":""},{"$f":"'T5'!AR46","v":""},{"$f":"'T6'!AR46","v":""},{"$f":"'T1'!AS46","v":""},{"$f":"'T2'!AS46","v":""},{"$f":"'T3'!AS46","v":""},{"$f":"'T4'!AS46","v":""},{"$f":"'T5'!AS46","v":""},{"$f":"'T6'!AS46","v":""},{"$f":"'T1'!AT46","v":""},{"$f":"'T2'!AT46","v":""},{"$f":"'T3'!AT46","v":""},{"$f":"'T4'!AT46","v":""},{"$f":"'T5'!AT46","v":""},{"$f":"'T6'!AT46","v":""},{"$f":"'T1'!AU46","v":""},{"$f":"'T2'!AU46","v":""},{"$f":"'T3'!AU46","v":""},{"$f":"'T4'!AU46","v":""},{"$f":"'T5'!AU46","v":""},{"$f":"'T6'!AU46","v":""},"","","","","",""]
[null,36,null,null,{"$f":"SW!G45","v":0},{"$f":"'T1'!AP47","v":""},{"$f":"'T2'!AP47","v":""},{"$f":"'T3'!AP47","v":""},{"$f":"'T4'!AP47","v":""},{"$f":"'T5'!AP47","v":""},{"$f":"'T6'!AP47","v":""},{"$f":"'T1'!AQ47","v":""},{"$f":"'T2'!AQ47","v":""},{"$f":"'T3'!AQ47","v":""},{"$f":"'T4'!AQ47","v":""},{"$f":"'T5'!AQ47","v":""},{"$f":"'T6'!AQ47","v":""},{"$f":"'T1'!AR47","v":""},{"$f":"'T2'!AR47","v":""},{"$f":"'T3'!AR47","v":""},{"$f":"'T4'!AR47","v":""},{"$f":"'T5'!AR47","v":""},{"$f":"'T6'!AR47","v":""},{"$f":"'T1'!AS47","v":""},{"$f":"'T2'!AS47","v":""},{"$f":"'T3'!AS47","v":""},{"$f":"'T4'!AS47","v":""},{"$f":"'T5'!AS47","v":""},{"$f":"'T6'!AS47","v":""},{"$f":"'T1'!AT47","v":""},{"$f":"'T2'!AT47","v":""},{"$f":"'T3'!AT47","v":""},{"$f":"'T4'!AT47","v":""},{"$f":"'T5'!AT47","v":""},{"$f":"'T6'!AT47","v":""},{"$f":"'T1'!AU47","v":""},{"$f":"'T2'!AU47","v":""},{"$f":"'T3'!AU47","v":""},{"$f":"'T4'!AU47","v":""},{"$f":"'T5'!AU47","v":""},{"$f":"'T6'!AU47","v":""},"","","","","",""]
[null,37,null,null,{"$f":"SW!G46","v":0},{"$f":"'T1'!AP48","v":""},{"$f":"'T2'!AP48","v":""},{"$f":"'T3'!AP48","v":""},{"$f":"'T4'!AP48","v":""},{"$f":"'T5'!AP48","v":""},{"$f":"'T6'!AP48","v":""},{"$f":"'T1'!AQ48","v":""},{"$f":"'T2'!AQ48","v":""},{"$f":"'T3'!AQ48","v":""},{"$f":"'T4'!AQ48","v":""},{"$f":"'T5'!AQ48","v":""},{"$f":"'T6'!AQ48","v":""},{"$f":"'T1'!AR48","v":""},{"$f":"'T2'!AR48","v":""},{"$f":"'T3'!AR48","v":""},{"$f":"'T4'!AR48","v":""},{"$f":"'T5'!AR48","v":""},{"$f":"'T6'!AR48","v":""},{"$f":"'T1'!AS48","v":""},{"$f":"'T2'!AS48","v":""},{"$f":"'T3'!AS48","v":""},{"$f":"'T4'!AS48","v":""},{"$f":"'T5'!AS48","v":""},{"$f":"'T6'!AS48","v":""},{"$f":"'T1'!AT48","v":""},{"$f":"'T2'!AT48","v":""},{"$f":"'T3'!AT48","v":""},{"$f":"'T4'!AT48","v":""},{"$f":"'T5'!AT48","v":""},{"$f":"'T6'!AT48","v":""},{"$f":"'T1'!AU48","v":""},{"$f":"'T2'!AU48","v":""},{"$f":"'T3'!AU48","v":""},{"$f":"'T4'!AU48","v":""},{"$f":"'T5'!AU48","v":""},{"$f":"'T6'!AU48","v":""},"","","","","",""]
[null,38,null,null,{"$f":"SW!G47","v":0},{"$f":"'T1'!AP49","v":""},{"$f":"'T2'!AP49","v":""},{"$f":"'T3'!AP49","v":""},{"$f":"'T4'!AP49","v":""},{"$f":"'T5'!AP49","v":""},{"$f":"'T6'!AP49","v":""},{"$f":"'T1'!AQ49","v":""},{"$f":"'T2'!AQ49","v":""},{"$f":"'T3'!AQ49","v":""},{"$f":"'T4'!AQ49","v":""},{"$f":"'T5'!AQ49","v":""},{"$f":"'T6'!AQ49","v":""},{"$f":"'T1'!AR49","v":""},{"$f":"'T2'!AR49","v":""},{"$f":"'T3'!AR49","v":""},{"$f":"'T4'!AR49","v":""},{"$f":"'T5'!AR49","v":""},{"$f":"'T6'!AR49","v":""},{"$f":"'T1'!AS49","v":""},{"$f":"'T2'!AS49","v":""},{"$f":"'T3'!AS49","v":""},{"$f":"'T4'!AS49","v":""},{"$f":"'T5'!AS49","v":""},{"$f":"'T6'!AS49","v":""},{"$f":"'T1'!AT49","v":""},{"$f":"'T2'!AT49","v":""},{"$f":"'T3'!AT49","v":""},{"$f":"'T4'!AT49","v":""},{"$f":"'T5'!AT49","v":""},{"$f":"'T6'!AT49","v":""},{"$f":"'T1'!AU49","v":""},{"$f":"'T2'!AU49","v":""},{"$f":"'T3'!AU49","v":""},{"$f":"'T4'!AU49","v":""},{"$f":"'T5'!AU49","v":""},{"$f":"'T6'!AU49","v":""},"","","","","",""]
[null,39,null,null,{"$f":"SW!G48","v":0},{"$f":"'T1'!AP50","v":""},{"$f":"'T2'!AP50","v":""},{"$f":"'T3'!AP50","v":""},{"$f":"'T4'!AP50","v":""},{"$f":"'T5'!AP50","v":""},{"$f":"'T6'!AP50","v":""},{"$f":"'T1'!AQ50","v":""},{"$f":"'T2'!AQ50","v":""},{"$f":"'T3'!AQ50","v":""},{"$f":"'T4'!AQ50","v":""},{"$f":"'T5'!AQ50","v":""},{"$f":"'T6'!AQ50","v":""},{"$f":"'T1'!AR50","v":""},{"$f":"'T2'!AR50","v":""},{"$f":"'T3'!AR50","v":""},{"$f":"'T4'!AR50","v":""},{"$f":"'T5'!AR50","v":""},{"$f":"'T6'!AR50","v":""},{"$f":"'T1'!AS50","v":""},{"$f":"'T2'!AS50","v":""},{"$f":"'T3'!AS50","v":""},{"$f":"'T4'!AS50","v":""},{"$f":"'T5'!AS50","v":""},{"$f":"'T6'!AS50","v":""},{"$f":"'T1'!AT50","v":""},{"$f":"'T2'!AT50","v":""},{"$f":"'T3'!AT50","v":""},{"$f":"'T4'!AT50","v":""},{"$f":"'T5'!AT50","v":""},{"$f":"'T6'!AT50","v":""},{"$f":"'T1'!AU50","v":""},{"$f":"'T2'!AU50","v":""},{"$f":"'T3'!AU50","v":""},{"$f":"'T4'!AU50","v":""},{"$f":"'T5'!AU50","v":""},{"$f":"'T6'!AU50","v":""},"","","","","",""]
[null,40,null,null,{"$f":"SW!G49","v":0},{"$f":"'T1'!AP51","v":""},{"$f":"'T2'!AP51","v":""},{"$f":"'T3'!AP51","v":""},{"$f":"'T4'!AP51","v":""},{"$f":"'T5'!AP51","v":""},{"$f":"'T6'!AP51","v":""},{"$f":"'T1'!AQ51","v":""},{"$f":"'T2'!AQ51","v":""},{"$f":"'T3'!AQ51","v":""},{"$f":"'T4'!AQ51","v":""},{"$f":"'T5'!AQ51","v":""},{"$f":"'T6'!AQ51","v":""},{"$f":"'T1'!AR51","v":""},{"$f":"'T2'!AR51","v":""},{"$f":"'T3'!AR51","v":""},{"$f":"'T4'!AR51","v":""},{"$f":"'T5'!AR51","v":""},{"$f":"'T6'!AR51","v":""},{"$f":"'T1'!AS51","v":""},{"$f":"'T2'!AS51","v":""},{"$f":"'T3'!AS51","v":""},{"$f":"'T4'!AS51","v":""},{"$f":"'T5'!AS51","v":""},{"$f":"'T6'!AS51","v":""},{"$f":"'T1'!AT51","v":""},{"$f":"'T2'!AT51","v":""},{"$f":"'T3'!AT51","v":""},{"$f":"'T4'!AT51","v":""},{"$f":"'T5'!AT51","v":""},{"$f":"'T6'!AT51","v":""},{"$f":"'T1'!AU51","v":""},{"$f":"'T2'!AU51","v":""},{"$f":"'T3'!AU51","v":""},{"$f":"'T4'!AU51","v":""},{"$f":"'T5'!AU51","v":""},{"$f":"'T6'!AU51","v":""},"","","","","",""]
[null,41,null,null,{"$f":"SW!G50","v":0},{"$f":"'T1'!AP52","v":""},{"$f":"'T2'!AP52","v":""},{"$f":"'T3'!AP52","v":""},{"$f":"'T4'!AP52","v":""},{"$f":"'T5'!AP52","v":""},{"$f":"'T6'!AP52","v":""},{"$f":"'T1'!AQ52","v":""},{"$f":"'T2'!AQ52","v":""},{"$f":"'T3'!AQ52","v":""},{"$f":"'T4'!AQ52","v":""},{"$f":"'T5'!AQ52","v":""},{"$f":"'T6'!AQ52","v":""},{"$f":"'T1'!AR52","v":""},{"$f":"'T2'!AR52","v":""},{"$f":"'T3'!AR52","v":""},{"$f":"'T4'!AR52","v":""},{"$f":"'T5'!AR52","v":""},{"$f":"'T6'!AR52","v":""},{"$f":"'T1'!AS52","v":""},{"$f":"'T2'!AS52","v":""},{"$f":"'T3'!AS52","v":""},{"$f":"'T4'!AS52","v":""},{"$f":"'T5'!AS52","v":""},{"$f":"'T6'!AS52","v":""},{"$f":"'T1'!AT52","v":""},{"$f":"'T2'!AT52","v":""},{"$f":"'T3'!AT52","v":""},{"$f":"'T4'!AT52","v":""},{"$f":"'T5'!AT52","v":""},{"$f":"'T6'!AT52","v":""},{"$f":"'T1'!AU52","v":""},{"$f":"'T2'!AU52","v":""},{"$f":"'T3'!AU52","v":""},{"$f":"'T4'!AU52","v":""},{"$f":"'T5'!AU52","v":""},{"$f":"'T6'!AU52","v":""},"","","","","",""]
[null,42,null,null,{"$f":"SW!G51","v":0},{"$f":"'T1'!AP53","v":""},{"$f":"'T2'!AP53","v":""},{"$f":"'T3'!AP53","v":""},{"$f":"'T4'!AP53","v":""},{"$f":"'T5'!AP53","v":""},{"$f":"'T6'!AP53","v":""},{"$f":"'T1'!AQ53","v":""},{"$f":"'T2'!AQ53","v":""},{"$f":"'T3'!AQ53","v":""},{"$f":"'T4'!AQ53","v":""},{"$f":"'T5'!AQ53","v":""},{"$f":"'T6'!AQ53","v":""},{"$f":"'T1'!AR53","v":""},{"$f":"'T2'!AR53","v":""},{"$f":"'T3'!AR53","v":""},{"$f":"'T4'!AR53","v":""},{"$f":"'T5'!AR53","v":""},{"$f":"'T6'!AR53","v":""},{"$f":"'T1'!AS53","v":""},{"$f":"'T2'!AS53","v":""},{"$f":"'T3'!AS53","v":""},{"$f":"'T4'!AS53","v":""},{"$f":"'T5'!AS53","v":""},{"$f":"'T6'!AS53","v":""},{"$f":"'T1'!AT53","v":""},{"$f":"'T2'!AT53","v":""},{"$f":"'T3'!AT53","v":""},{"$f":"'T4'!AT53","v":""},{"$f":"'T5'!AT53","v":""},{"$f":"'T6'!AT53","v":""},{"$f":"'T1'!AU53","v":""},{"$f":"'T2'!AU53","v":""},{"$f":"'T3'!AU53","v":""},{"$f":"'T4'!AU53","v":""},{"$f":"'T5'!AU53","v":""},{"$f":"'T6'!AU53","v":""},"","","","","",""]
[null,43,null,null,{"$f":"SW!G52","v":0},{"$f":"'T1'!AP54","v":""},{"$f":"'T2'!AP54","v":""},{"$f":"'T3'!AP54","v":""},{"$f":"'T4'!AP54","v":""},{"$f":"'T5'!AP54","v":""},{"$f":"'T6'!AP54","v":""},{"$f":"'T1'!AQ54","v":""},{"$f":"'T2'!AQ54","v":""},{"$f":"'T3'!AQ54","v":""},{"$f":"'T4'!AQ54","v":""},{"$f":"'T5'!AQ54","v":""},{"$f":"'T6'!AQ54","v":""},{"$f":"'T1'!AR54","v":""},{"$f":"'T2'!AR54","v":""},{"$f":"'T3'!AR54","v":""},{"$f":"'T4'!AR54","v":""},{"$f":"'T5'!AR54","v":""},{"$f":"'T6'!AR54","v":""},{"$f":"'T1'!AS54","v":""},{"$f":"'T2'!AS54","v":""},{"$f":"'T3'!AS54","v":""},{"$f":"'T4'!AS54","v":""},{"$f":"'T5'!AS54","v":""},{"$f":"'T6'!AS54","v":""},{"$f":"'T1'!AT54","v":""},{"$f":"'T2'!AT54","v":""},{"$f":"'T3'!AT54","v":""},{"$f":"'T4'!AT54","v":""},{"$f":"'T5'!AT54","v":""},{"$f":"'T6'!AT54","v":""},{"$f":"'T1'!AU54","v":""},{"$f":"'T2'!AU54","v":""},{"$f":"'T3'!AU54","v":""},{"$f":"'T4'!AU54","v":""},{"$f":"'T5'!AU54","v":""},{"$f":"'T6'!AU54","v":""},"","","","","",""]
[null,44,null,null,{"$f":"SW!G53","v":0},{"$f":"'T1'!AP55","v":""},{"$f":"'T2'!AP55","v":""},{"$f":"'T3'!AP55","v":""},{"$f":"'T4'!AP55","v":""},{"$f":"'T5'!AP55","v":""},{"$f":"'T6'!AP55","v":""},{"$f":"'T1'!AQ55","v":""},{"$f":"'T2'!AQ55","v":""},{"$f":"'T3'!AQ55","v":""},{"$f":"'T4'!AQ55","v":""},{"$f":"'T5'!AQ55","v":""},{"$f":"'T6'!AQ55","v":""},{"$f":"'T1'!AR55","v":""},{"$f":"'T2'!AR55","v":""},{"$f":"'T3'!AR55","v":""},{"$f":"'T4'!AR55","v":""},{"$f":"'T5'!AR55","v":""},{"$f":"'T6'!AR55","v":""},{"$f":"'T1'!AS55","v":""},{"$f":"'T2'!AS55","v":""},{"$f":"'T3'!AS55","v":""},{"$f":"'T4'!AS55","v":""},{"$f":"'T5'!AS55","v":""},{"$f":"'T6'!AS55","v":""},{"$f":"'T1'!AT55","v":""},{"$f":"'T2'!AT55","v":""},{"$f":"'T3'!AT55","v":""},{"$f":"'T4'!AT55","v":""},{"$f":"'T5'!AT55","v":""},{"$f":"'T6'!AT55","v":""},{"$f":"'T1'!AU55","v":""},{"$f":"'T2'!AU55","v":""},{"$f":"'T3'!AU55","v":""},{"$f":"'T4'!AU55","v":""},{"$f":"'T5'!AU55","v":""},{"$f":"'T6'!AU55","v":""},"","","","","",""]
[null,45,null,null,{"$f":"SW!G54","v":0},{"$f":"'T1'!AP56","v":""},{"$f":"'T2'!AP56","v":""},{"$f":"'T3'!AP56","v":""},{"$f":"'T4'!AP56","v":""},{"$f":"'T5'!AP56","v":""},{"$f":"'T6'!AP56","v":""},{"$f":"'T1'!AQ56","v":""},{"$f":"'T2'!AQ56","v":""},{"$f":"'T3'!AQ56","v":""},{"$f":"'T4'!AQ56","v":""},{"$f":"'T5'!AQ56","v":""},{"$f":"'T6'!AQ56","v":""},{"$f":"'T1'!AR56","v":""},{"$f":"'T2'!AR56","v":""},{"$f":"'T3'!AR56","v":""},{"$f":"'T4'!AR56","v":""},{"$f":"'T5'!AR56","v":""},{"$f":"'T6'!AR56","v":""},{"$f":"'T1'!AS56","v":""},{"$f":"'T2'!AS56","v":""},{"$f":"'T3'!AS56","v":""},{"$f":"'T4'!AS56","v":""},{"$f":"'T5'!AS56","v":""},{"$f":"'T6'!AS56","v":""},{"$f":"'T1'!AT56","v":""},{"$f":"'T2'!AT56","v":""},{"$f":"'T3'!AT56","v":""},{"$f":"'T4'!AT56","v":""},{"$f":"'T5'!AT56","v":""},{"$f":"'T6'!AT56","v":""},{"$f":"'T1'!AU56","v":""},{"$f":"'T2'!AU56","v":""},{"$f":"'T3'!AU56","v":""},{"$f":"'T4'!AU56","v":""},{"$f":"'T5'!AU56","v":""},{"$f":"'T6'!AU56","v":""},"","","","","",""]
[null,46,null,null,{"$f":"SW!G55","v":0},{"$f":"'T1'!AP57","v":""},{"$f":"'T2'!AP57","v":""},{"$f":"'T3'!AP57","v":""},{"$f":"'T4'!AP57","v":""},{"$f":"'T5'!AP57","v":""},{"$f":"'T6'!AP57","v":""},{"$f":"'T1'!AQ57","v":""},{"$f":"'T2'!AQ57","v":""},{"$f":"'T3'!AQ57","v":""},{"$f":"'T4'!AQ57","v":""},{"$f":"'T5'!AQ57","v":""},{"$f":"'T6'!AQ57","v":""},{"$f":"'T1'!AR57","v":""},{"$f":"'T2'!AR57","v":""},{"$f":"'T3'!AR57","v":""},{"$f":"'T4'!AR57","v":""},{"$f":"'T5'!AR57","v":""},{"$f":"'T6'!AR57","v":""},{"$f":"'T1'!AS57","v":""},{"$f":"'T2'!AS57","v":""},{"$f":"'T3'!AS57","v":""},{"$f":"'T4'!AS57","v":""},{"$f":"'T5'!AS57","v":""},{"$f":"'T6'!AS57","v":""},{"$f":"'T1'!AT57","v":""},{"$f":"'T2'!AT57","v":""},{"$f":"'T3'!AT57","v":""},{"$f":"'T4'!AT57","v":""},{"$f":"'T5'!AT57","v":""},{"$f":"'T6'!AT57","v":""},{"$f":"'T1'!AU57","v":""},{"$f":"'T2'!AU57","v":""},{"$f":"'T3'!AU57","v":""},{"$f":"'T4'!AU57","v":""},{"$f":"'T5'!AU57","v":""},{"$f":"'T6'!AU57","v":""},"","","","","",""]
[null,47,null,null,{"$f":"SW!G56","v":0},{"$f":"'T1'!AP58","v":""},{"$f":"'T2'!AP58","v":""},{"$f":"'T3'!AP58","v":""},{"$f":"'T4'!AP58","v":""},{"$f":"'T5'!AP58","v":""},{"$f":"'T6'!AP58","v":""},{"$f":"'T1'!AQ58","v":""},{"$f":"'T2'!AQ58","v":""},{"$f":"'T3'!AQ58","v":""},{"$f":"'T4'!AQ58","v":""},{"$f":"'T5'!AQ58","v":""},{"$f":"'T6'!AQ58","v":""},{"$f":"'T1'!AR58","v":""},{"$f":"'T2'!AR58","v":""},{"$f":"'T3'!AR58","v":""},{"$f":"'T4'!AR58","v":""},{"$f":"'T5'!AR58","v":""},{"$f":"'T6'!AR58","v":""},{"$f":"'T1'!AS58","v":""},{"$f":"'T2'!AS58","v":""},{"$f":"'T3'!AS58","v":""},{"$f":"'T4'!AS58","v":""},{"$f":"'T5'!AS58","v":""},{"$f":"'T6'!AS58","v":""},{"$f":"'T1'!AT58","v":""},{"$f":"'T2'!AT58","v":""},{"$f":"'T3'!AT58","v":""},{"$f":"'T4'!AT58","v":""},{"$f":"'T5'!AT58","v":""},{"$f":"'T6'!AT58","v":""},{"$f":"'T1'!AU58","v":""},{"$f":"'T2'!AU58","v":""},{"$f":"'T3'!AU58","v":""},{"$f":"'T4'!AU58","v":""},{"$f":"'T5'!AU58","v":""},{"$f":"'T6'!AU58","v":""},"","","","","",""]
[null,48,null,null,{"$f":"SW!G57","v":0},{"$f":"'T1'!AP59","v":""},{"$f":"'T2'!AP59","v":""},{"$f":"'T3'!AP59","v":""},{"$f":"'T4'!AP59","v":""},{"$f":"'T5'!AP59","v":""},{"$f":"'T6'!AP59","v":""},{"$f":"'T1'!AQ59","v":""},{"$f":"'T2'!AQ59","v":""},{"$f":"'T3'!AQ59","v":""},{"$f":"'T4'!AQ59","v":""},{"$f":"'T5'!AQ59","v":""},{"$f":"'T6'!AQ59","v":""},{"$f":"'T1'!AR59","v":""},{"$f":"'T2'!AR59","v":""},{"$f":"'T3'!AR59","v":""},{"$f":"'T4'!AR59","v":""},{"$f":"'T5'!AR59","v":""},{"$f":"'T6'!AR59","v":""},{"$f":"'T1'!AS59","v":""},{"$f":"'T2'!AS59","v":""},{"$f":"'T3'!AS59","v":""},{"$f":"'T4'!AS59","v":""},{"$f":"'T5'!AS59","v":""},{"$f":"'T6'!AS59","v":""},{"$f":"'T1'!AT59","v":""},{"$f":"'T2'!AT59","v":""},{"$f":"'T3'!AT59","v":""},{"$f":"'T4'!AT59","v":""},{"$f":"'T5'!AT59","v":""},{"$f":"'T6'!AT59","v":""},{"$f":"'T1'!AU59","v":""},{"$f":"'T2'!AU59","v":""},{"$f":"'T3'!AU59","v":""},{"$f":"'T4'!AU59","v":""},{"$f":"'T5'!AU59","v":""},{"$f":"'T6'!AU59","v":""},"","","","","",""]
[null,49,null,null,{"$f":"SW!G58","v":0},{"$f":"'T1'!AP60","v":""},{"$f":"'T2'!AP60","v":""},{"$f":"'T3'!AP60","v":""},{"$f":"'T4'!AP60","v":""},{"$f":"'T5'!AP60","v":""},{"$f":"'T6'!AP60","v":""},{"$f":"'T1'!AQ60","v":""},{"$f":"'T2'!AQ60","v":""},{"$f":"'T3'!AQ60","v":""},{"$f":"'T4'!AQ60","v":""},{"$f":"'T5'!AQ60","v":""},{"$f":"'T6'!AQ60","v":""},{"$f":"'T1'!AR60","v":""},{"$f":"'T2'!AR60","v":""},{"$f":"'T3'!AR60","v":""},{"$f":"'T4'!AR60","v":""},{"$f":"'T5'!AR60","v":""},{"$f":"'T6'!AR60","v":""},{"$f":"'T1'!AS60","v":""},{"$f":"'T2'!AS60","v":""},{"$f":"'T3'!AS60","v":""},{"$f":"'T4'!AS60","v":""},{"$f":"'T5'!AS60","v":""},{"$f":"'T6'!AS60","v":""},{"$f":"'T1'!AT60","v":""},{"$f":"'T2'!AT60","v":""},{"$f":"'T3'!AT60","v":""},{"$f":"'T4'!AT60","v":""},{"$f":"'T5'!AT60","v":""},{"$f":"'T6'!AT60","v":""},{"$f":"'T1'!AU60","v":""},{"$f":"'T2'!AU60","v":""},{"$f":"'T3'!AU60","v":""},{"$f":"'T4'!AU60","v":""},{"$f":"'T5'!AU60","v":""},{"$f":"'T6'!AU60","v":""},"","","","","",""]
[null,50,null,null,{"$f":"SW!G59","v":0},{"$f":"'T1'!AP61","v":""},{"$f":"'T2'!AP61","v":""},{"$f":"'T3'!AP61","v":""},{"$f":"'T4'!AP61","v":""},{"$f":"'T5'!AP61","v":""},{"$f":"'T6'!AP61","v":""},{"$f":"'T1'!AQ61","v":""},{"$f":"'T2'!AQ61","v":""},{"$f":"'T3'!AQ61","v":""},{"$f":"'T4'!AQ61","v":""},{"$f":"'T5'!AQ61","v":""},{"$f":"'T6'!AQ61","v":""},{"$f":"'T1'!AR61","v":""},{"$f":"'T2'!AR61","v":""},{"$f":"'T3'!AR61","v":""},{"$f":"'T4'!AR61","v":""},{"$f":"'T5'!AR61","v":""},{"$f":"'T6'!AR61","v":""},{"$f":"'T1'!AS61","v":""},{"$f":"'T2'!AS61","v":""},{"$f":"'T3'!AS61","v":""},{"$f":"'T4'!AS61","v":""},{"$f":"'T5'!AS61","v":""},{"$f":"'T6'!AS61","v":""},{"$f":"'T1'!AT61","v":""},{"$f":"'T2'!AT61","v":""},{"$f":"'T3'!AT61","v":""},{"$f":"'T4'!AT61","v":""},{"$f":"'T5'!AT61","v":""},{"$f":"'T6'!AT61","v":""},{"$f":"'T1'!AU61","v":""},{"$f":"'T2'!AU61","v":""},{"$f":"'T3'!AU61","v":""},{"$f":"'T4'!AU61","v":""},{"$f":"'T5'!AU61","v":""},{"$f":"'T6'!AU61","v":""},"","","","","",""]
[null,51,null,null,{"$f":"SW!G60","v":0},{"$f":"'T1'!AP62","v":""},{"$f":"'T2'!AP62","v":""},{"$f":"'T3'!AP62","v":""},{"$f":"'T4'!AP62","v":""},{"$f":"'T5'!AP62","v":""},{"$f":"'T6'!AP62","v":""},{"$f":"'T1'!AQ62","v":""},{"$f":"'T2'!AQ62","v":""},{"$f":"'T3'!AQ62","v":""},{"$f":"'T4'!AQ62","v":""},{"$f":"'T5'!AQ62","v":""},{"$f":"'T6'!AQ62","v":""},{"$f":"'T1'!AR62","v":""},{"$f":"'T2'!AR62","v":""},{"$f":"'T3'!AR62","v":""},{"$f":"'T4'!AR62","v":""},{"$f":"'T5'!AR62","v":""},{"$f":"'T6'!AR62","v":""},{"$f":"'T1'!AS62","v":""},{"$f":"'T2'!AS62","v":""},{"$f":"'T3'!AS62","v":""},{"$f":"'T4'!AS62","v":""},{"$f":"'T5'!AS62","v":""},{"$f":"'T6'!AS62","v":""},{"$f":"'T1'!AT62","v":""},{"$f":"'T2'!AT62","v":""},{"$f":"'T3'!AT62","v":""},{"$f":"'T4'!AT62","v":""},{"$f":"'T5'!AT62","v":""},{"$f":"'T6'!AT62","v":""},{"$f":"'T1'!AU62","v":""},{"$f":"'T2'!AU62","v":""},{"$f":"'T3'!AU62","v":""},{"$f":"'T4'!AU62","v":""},{"$f":"'T5'!AU62","v":""},{"$f":"'T6'!AU62","v":""},"","","","","",""]
[null,52,null,null,{"$f":"SW!G61","v":0},{"$f":"'T1'!AP63","v":""},{"$f":"'T2'!AP63","v":""},{"$f":"'T3'!AP63","v":""},{"$f":"'T4'!AP63","v":""},{"$f":"'T5'!AP63","v":""},{"$f":"'T6'!AP63","v":""},{"$f":"'T1'!AQ63","v":""},{"$f":"'T2'!AQ63","v":""},{"$f":"'T3'!AQ63","v":""},{"$f":"'T4'!AQ63","v":""},{"$f":"'T5'!AQ63","v":""},{"$f":"'T6'!AQ63","v":""},{"$f":"'T1'!AR63","v":""},{"$f":"'T2'!AR63","v":""},{"$f":"'T3'!AR63","v":""},{"$f":"'T4'!AR63","v":""},{"$f":"'T5'!AR63","v":""},{"$f":"'T6'!AR63","v":""},{"$f":"'T1'!AS63","v":""},{"$f":"'T2'!AS63","v":""},{"$f":"'T3'!AS63","v":""},{"$f":"'T4'!AS63","v":""},{"$f":"'T5'!AS63","v":""},{"$f":"'T6'!AS63","v":""},{"$f":"'T1'!AT63","v":""},{"$f":"'T2'!AT63","v":""},{"$f":"'T3'!AT63","v":""},{"$f":"'T4'!AT63","v":""},{"$f":"'T5'!AT63","v":""},{"$f":"'T6'!AT63","v":""},{"$f":"'T1'!AU63","v":""},{"$f":"'T2'!AU63","v":""},{"$f":"'T3'!AU63","v":""},{"$f":"'T4'!AU63","v":""},{"$f":"'T5'!AU63","v":""},{"$f":"'T6'!AU63","v":""},"","","","","",""]
[null,53,null,null,{"$f":"SW!G62","v":0},{"$f":"'T1'!AP64","v":""},{"$f":"'T2'!AP64","v":""},{"$f":"'T3'!AP64","v":""},{"$f":"'T4'!AP64","v":""},{"$f":"'T5'!AP64","v":""},{"$f":"'T6'!AP64","v":""},{"$f":"'T1'!AQ64","v":""},{"$f":"'T2'!AQ64","v":""},{"$f":"'T3'!AQ64","v":""},{"$f":"'T4'!AQ64","v":""},{"$f":"'T5'!AQ64","v":""},{"$f":"'T6'!AQ64","v":""},{"$f":"'T1'!AR64","v":""},{"$f":"'T2'!AR64","v":""},{"$f":"'T3'!AR64","v":""},{"$f":"'T4'!AR64","v":""},{"$f":"'T5'!AR64","v":""},{"$f":"'T6'!AR64","v":""},{"$f":"'T1'!AS64","v":""},{"$f":"'T2'!AS64","v":""},{"$f":"'T3'!AS64","v":""},{"$f":"'T4'!AS64","v":""},{"$f":"'T5'!AS64","v":""},{"$f":"'T6'!AS64","v":""},{"$f":"'T1'!AT64","v":""},{"$f":"'T2'!AT64","v":""},{"$f":"'T3'!AT64","v":""},{"$f":"'T4'!AT64","v":""},{"$f":"'T5'!AT64","v":""},{"$f":"'T6'!AT64","v":""},{"$f":"'T1'!AU64","v":""},{"$f":"'T2'!AU64","v":""},{"$f":"'T3'!AU64","v":""},{"$f":"'T4'!AU64","v":""},{"$f":"'T5'!AU64","v":""},{"$f":"'T6'!AU64","v":""},"","","","","",""]
[null,54,null,null,{"$f":"SW!G63","v":0},{"$f":"'T1'!AP65","v":""},{"$f":"'T2'!AP65","v":""},{"$f":"'T3'!AP65","v":""},{"$f":"'T4'!AP65","v":""},{"$f":"'T5'!AP65","v":""},{"$f":"'T6'!AP65","v":""},{"$f":"'T1'!AQ65","v":""},{"$f":"'T2'!AQ65","v":""},{"$f":"'T3'!AQ65","v":""},{"$f":"'T4'!AQ65","v":""},{"$f":"'T5'!AQ65","v":""},{"$f":"'T6'!AQ65","v":""},{"$f":"'T1'!AR65","v":""},{"$f":"'T2'!AR65","v":""},{"$f":"'T3'!AR65","v":""},{"$f":"'T4'!AR65","v":""},{"$f":"'T5'!AR65","v":""},{"$f":"'T6'!AR65","v":""},{"$f":"'T1'!AS65","v":""},{"$f":"'T2'!AS65","v":""},{"$f":"'T3'!AS65","v":""},{"$f":"'T4'!AS65","v":""},{"$f":"'T5'!AS65","v":""},{"$f":"'T6'!AS65","v":""},{"$f":"'T1'!AT65","v":""},{"$f":"'T2'!AT65","v":""},{"$f":"'T3'!AT65","v":""},{"$f":"'T4'!AT65","v":""},{"$f":"'T5'!AT65","v":""},{"$f":"'T6'!AT65","v":""},{"$f":"'T1'!AU65","v":""},{"$f":"'T2'!AU65","v":""},{"$f":"'T3'!AU65","v":""},{"$f":"'T4'!AU65","v":""},{"$f":"'T5'!AU65","v":""},{"$f":"'T6'!AU65","v":""},"","","","","",""]
[null,55,null,null,{"$f":"SW!G64","v":0},{"$f":"'T1'!AP66","v":""},{"$f":"'T2'!AP66","v":""},{"$f":"'T3'!AP66","v":""},{"$f":"'T4'!AP66","v":""},{"$f":"'T5'!AP66","v":""},{"$f":"'T6'!AP66","v":""},{"$f":"'T1'!AQ66","v":""},{"$f":"'T2'!AQ66","v":""},{"$f":"'T3'!AQ66","v":""},{"$f":"'T4'!AQ66","v":""},{"$f":"'T5'!AQ66","v":""},{"$f":"'T6'!AQ66","v":""},{"$f":"'T1'!AR66","v":""},{"$f":"'T2'!AR66","v":""},{"$f":"'T3'!AR66","v":""},{"$f":"'T4'!AR66","v":""},{"$f":"'T5'!AR66","v":""},{"$f":"'T6'!AR66","v":""},{"$f":"'T1'!AS66","v":""},{"$f":"'T2'!AS66","v":""},{"$f":"'T3'!AS66","v":""},{"$f":"'T4'!AS66","v":""},{"$f":"'T5'!AS66","v":""},{"$f":"'T6'!AS66","v":""},{"$f":"'T1'!AT66","v":""},{"$f":"'T2'!AT66","v":""},{"$f":"'T3'!AT66","v":""},{"$f":"'T4'!AT66","v":""},{"$f":"'T5'!AT66","v":""},{"$f":"'T6'!AT66","v":""},{"$f":"'T1'!AU66","v":""},{"$f":"'T2'!AU66","v":""},{"$f":"'T3'!AU66","v":""},{"$f":"'T4'!AU66","v":""},{"$f":"'T5'!AU66","v":""},{"$f":"'T6'!AU66","v":""},"","","","","",""]
[null,56,null,null,{"$f":"SW!G65","v":0},{"$f":"'T1'!AP67","v":""},{"$f":"'T2'!AP67","v":""},{"$f":"'T3'!AP67","v":""},{"$f":"'T4'!AP67","v":""},{"$f":"'T5'!AP67","v":""},{"$f":"'T6'!AP67","v":""},{"$f":"'T1'!AQ67","v":""},{"$f":"'T2'!AQ67","v":""},{"$f":"'T3'!AQ67","v":""},{"$f":"'T4'!AQ67","v":""},{"$f":"'T5'!AQ67","v":""},{"$f":"'T6'!AQ67","v":""},{"$f":"'T1'!AR67","v":""},{"$f":"'T2'!AR67","v":""},{"$f":"'T3'!AR67","v":""},{"$f":"'T4'!AR67","v":""},{"$f":"'T5'!AR67","v":""},{"$f":"'T6'!AR67","v":""},{"$f":"'T1'!AS67","v":""},{"$f":"'T2'!AS67","v":""},{"$f":"'T3'!AS67","v":""},{"$f":"'T4'!AS67","v":""},{"$f":"'T5'!AS67","v":""},{"$f":"'T6'!AS67","v":""},{"$f":"'T1'!AT67","v":""},{"$f":"'T2'!AT67","v":""},{"$f":"'T3'!AT67","v":""},{"$f":"'T4'!AT67","v":""},{"$f":"'T5'!AT67","v":""},{"$f":"'T6'!AT67","v":""},{"$f":"'T1'!AU67","v":""},{"$f":"'T2'!AU67","v":""},{"$f":"'T3'!AU67","v":""},{"$f":"'T4'!AU67","v":""},{"$f":"'T5'!AU67","v":""},{"$f":"'T6'!AU67","v":""},"","","","","",""]
[null,57,null,null,{"$f":"SW!G66","v":0},{"$f":"'T1'!AP68","v":""},{"$f":"'T2'!AP68","v":""},{"$f":"'T3'!AP68","v":""},{"$f":"'T4'!AP68","v":""},{"$f":"'T5'!AP68","v":""},{"$f":"'T6'!AP68","v":""},{"$f":"'T1'!AQ68","v":""},{"$f":"'T2'!AQ68","v":""},{"$f":"'T3'!AQ68","v":""},{"$f":"'T4'!AQ68","v":""},{"$f":"'T5'!AQ68","v":""},{"$f":"'T6'!AQ68","v":""},{"$f":"'T1'!AR68","v":""},{"$f":"'T2'!AR68","v":""},{"$f":"'T3'!AR68","v":""},{"$f":"'T4'!AR68","v":""},{"$f":"'T5'!AR68","v":""},{"$f":"'T6'!AR68","v":""},{"$f":"'T1'!AS68","v":""},{"$f":"'T2'!AS68","v":""},{"$f":"'T3'!AS68","v":""},{"$f":"'T4'!AS68","v":""},{"$f":"'T5'!AS68","v":""},{"$f":"'T6'!AS68","v":""},{"$f":"'T1'!AT68","v":""},{"$f":"'T2'!AT68","v":""},{"$f":"'T3'!AT68","v":""},{"$f":"'T4'!AT68","v":""},{"$f":"'T5'!AT68","v":""},{"$f":"'T6'!AT68","v":""},{"$f":"'T1'!AU68","v":""},{"$f":"'T2'!AU68","v":""},{"$f":"'T3'!AU68","v":""},{"$f":"'T4'!AU68","v":""},{"$f":"'T5'!AU68","v":""},{"$f":"'T6'!AU68","v":""},"","","","","",""]
[null,58,null,null,{"$f":"SW!G67","v":0},{"$f":"'T1'!AP69","v":""},{"$f":"'T2'!AP69","v":""},{"$f":"'T3'!AP69","v":""},{"$f":"'T4'!AP69","v":""},{"$f":"'T5'!AP69","v":""},{"$f":"'T6'!AP69","v":""},{"$f":"'T1'!AQ69","v":""},{"$f":"'T2'!AQ69","v":""},{"$f":"'T3'!AQ69","v":""},{"$f":"'T4'!AQ69","v":""},{"$f":"'T5'!AQ69","v":""},{"$f":"'T6'!AQ69","v":""},{"$f":"'T1'!AR69","v":""},{"$f":"'T2'!AR69","v":""},{"$f":"'T3'!AR69","v":""},{"$f":"'T4'!AR69","v":""},{"$f":"'T5'!AR69","v":""},{"$f":"'T6'!AR69","v":""},{"$f":"'T1'!AS69","v":""},{"$f":"'T2'!AS69","v":""},{"$f":"'T3'!AS69","v":""},{"$f":"'T4'!AS69","v":""},{"$f":"'T5'!AS69","v":""},{"$f":"'T6'!AS69","v":""},{"$f":"'T1'!AT69","v":""},{"$f":"'T2'!AT69","v":""},{"$f":"'T3'!AT69","v":""},{"$f":"'T4'!AT69","v":""},{"$f":"'T5'!AT69","v":""},{"$f":"'T6'!AT69","v":""},{"$f":"'T1'!AU69","v":""},{"$f":"'T2'!AU69","v":""},{"$f":"'T3'!AU69","v":""},{"$f":"'T4'!AU69","v":""},{"$f":"'T5'!AU69","v":""},{"$f":"'T6'!AU69","v":""},"","","","","",""]
[null,59,null,null,{"$f":"SW!G68","v":0},{"$f":"'T1'!AP70","v":""},{"$f":"'T2'!AP70","v":""},{"$f":"'T3'!AP70","v":""},{"$f":"'T4'!AP70","v":""},{"$f":"'T5'!AP70","v":""},{"$f":"'T6'!AP70","v":""},{"$f":"'T1'!AQ70","v":""},{"$f":"'T2'!AQ70","v":""},{"$f":"'T3'!AQ70","v":""},{"$f":"'T4'!AQ70","v":""},{"$f":"'T5'!AQ70","v":""},{"$f":"'T6'!AQ70","v":""},{"$f":"'T1'!AR70","v":""},{"$f":"'T2'!AR70","v":""},{"$f":"'T3'!AR70","v":""},{"$f":"'T4'!AR70","v":""},{"$f":"'T5'!AR70","v":""},{"$f":"'T6'!AR70","v":""},{"$f":"'T1'!AS70","v":""},{"$f":"'T2'!AS70","v":""},{"$f":"'T3'!AS70","v":""},{"$f":"'T4'!AS70","v":""},{"$f":"'T5'!AS70","v":""},{"$f":"'T6'!AS70","v":""},{"$f":"'T1'!AT70","v":""},{"$f":"'T2'!AT70","v":""},{"$f":"'T3'!AT70","v":""},{"$f":"'T4'!AT70","v":""},{"$f":"'T5'!AT70","v":""},{"$f":"'T6'!AT70","v":""},{"$f":"'T1'!AU70","v":""},{"$f":"'T2'!AU70","v":""},{"$f":"'T3'!AU70","v":""},{"$f":"'T4'!AU70","v":""},{"$f":"'T5'!AU70","v":""},{"$f":"'T6'!AU70","v":""},"","","","","",""]
[null,60,null,null,{"$f":"SW!G69","v":0},{"$f":"'T1'!AP71","v":""},{"$f":"'T2'!AP71","v":""},{"$f":"'T3'!AP71","v":""},{"$f":"'T4'!AP71","v":""},{"$f":"'T5'!AP71","v":""},{"$f":"'T6'!AP71","v":""},{"$f":"'T1'!AQ71","v":""},{"$f":"'T2'!AQ71","v":""},{"$f":"'T3'!AQ71","v":""},{"$f":"'T4'!AQ71","v":""},{"$f":"'T5'!AQ71","v":""},{"$f":"'T6'!AQ71","v":""},{"$f":"'T1'!AR71","v":""},{"$f":"'T2'!AR71","v":""},{"$f":"'T3'!AR71","v":""},{"$f":"'T4'!AR71","v":""},{"$f":"'T5'!AR71","v":""},{"$f":"'T6'!AR71","v":""},{"$f":"'T1'!AS71","v":""},{"$f":"'T2'!AS71","v":""},{"$f":"'T3'!AS71","v":""},{"$f":"'T4'!AS71","v":""},{"$f":"'T5'!AS71","v":""},{"$f":"'T6'!AS71","v":""},{"$f":"'T1'!AT71","v":""},{"$f":"'T2'!AT71","v":""},{"$f":"'T3'!AT71","v":""},{"$f":"'T4'!AT71","v":""},{"$f":"'T5'!AT71","v":""},{"$f":"'T6'!AT71","v":""},{"$f":"'T1'!AU71","v":""},{"$f":"'T2'!AU71","v":""},{"$f":"'T3'!AU71","v":""},{"$f":"'T4'!AU71","v":""},{"$f":"'T5'!AU71","v":""},{"$f":"'T6'!AU71","v":""},"","","","","",""]
[null,61,null,null,{"$f":"SW!G70","v":0},{"$f":"'T1'!AP72","v":""},{"$f":"'T2'!AP72","v":""},{"$f":"'T3'!AP72","v":""},{"$f":"'T4'!AP72","v":""},{"$f":"'T5'!AP72","v":""},{"$f":"'T6'!AP72","v":""},{"$f":"'T1'!AQ72","v":""},{"$f":"'T2'!AQ72","v":""},{"$f":"'T3'!AQ72","v":""},{"$f":"'T4'!AQ72","v":""},{"$f":"'T5'!AQ72","v":""},{"$f":"'T6'!AQ72","v":""},{"$f":"'T1'!AR72","v":""},{"$f":"'T2'!AR72","v":""},{"$f":"'T3'!AR72","v":""},{"$f":"'T4'!AR72","v":""},{"$f":"'T5'!AR72","v":""},{"$f":"'T6'!AR72","v":""},{"$f":"'T1'!AS72","v":""},{"$f":"'T2'!AS72","v":""},{"$f":"'T3'!AS72","v":""},{"$f":"'T4'!AS72","v":""},{"$f":"'T5'!AS72","v":""},{"$f":"'T6'!AS72","v":""},{"$f":"'T1'!AT72","v":""},{"$f":"'T2'!AT72","v":""},{"$f":"'T3'!AT72","v":""},{"$f":"'T4'!AT72","v":""},{"$f":"'T5'!AT72","v":""},{"$f":"'T6'!AT72","v":""},{"$f":"'T1'!AU72","v":""},{"$f":"'T2'!AU72","v":""},{"$f":"'T3'!AU72","v":""},{"$f":"'T4'!AU72","v":""},{"$f":"'T5'!AU72","v":""},{"$f":"'T6'!AU72","v":""},"","","","","",""]
[null,62,null,null,{"$f":"SW!G71","v":0},{"$f":"'T1'!AP73","v":""},{"$f":"'T2'!AP73","v":""},{"$f":"'T3'!AP73","v":""},{"$f":"'T4'!AP73","v":""},{"$f":"'T5'!AP73","v":""},{"$f":"'T6'!AP73","v":""},{"$f":"'T1'!AQ73","v":""},{"$f":"'T2'!AQ73","v":""},{"$f":"'T3'!AQ73","v":""},{"$f":"'T4'!AQ73","v":""},{"$f":"'T5'!AQ73","v":""},{"$f":"'T6'!AQ73","v":""},{"$f":"'T1'!AR73","v":""},{"$f":"'T2'!AR73","v":""},{"$f":"'T3'!AR73","v":""},{"$f":"'T4'!AR73","v":""},{"$f":"'T5'!AR73","v":""},{"$f":"'T6'!AR73","v":""},{"$f":"'T1'!AS73","v":""},{"$f":"'T2'!AS73","v":""},{"$f":"'T3'!AS73","v":""},{"$f":"'T4'!AS73","v":""},{"$f":"'T5'!AS73","v":""},{"$f":"'T6'!AS73","v":""},{"$f":"'T1'!AT73","v":""},{"$f":"'T2'!AT73","v":""},{"$f":"'T3'!AT73","v":""},{"$f":"'T4'!AT73","v":""},{"$f":"'T5'!AT73","v":""},{"$f":"'T6'!AT73","v":""},{"$f":"'T1'!AU73","v":""},{"$f":"'T2'!AU73","v":""},{"$f":"'T3'!AU73","v":""},{"$f":"'T4'!AU73","v":""},{"$f":"'T5'!AU73","v":""},{"$f":"'T6'!AU73","v":""},"","","","","",""]
[null,63,null,null,{"$f":"SW!G72","v":0},{"$f":"'T1'!AP74","v":""},{"$f":"'T2'!AP74","v":""},{"$f":"'T3'!AP74","v":""},{"$f":"'T4'!AP74","v":""},{"$f":"'T5'!AP74","v":""},{"$f":"'T6'!AP74","v":""},{"$f":"'T1'!AQ74","v":""},{"$f":"'T2'!AQ74","v":""},{"$f":"'T3'!AQ74","v":""},{"$f":"'T4'!AQ74","v":""},{"$f":"'T5'!AQ74","v":""},{"$f":"'T6'!AQ74","v":""},{"$f":"'T1'!AR74","v":""},{"$f":"'T2'!AR74","v":""},{"$f":"'T3'!AR74","v":""},{"$f":"'T4'!AR74","v":""},{"$f":"'T5'!AR74","v":""},{"$f":"'T6'!AR74","v":""},{"$f":"'T1'!AS74","v":""},{"$f":"'T2'!AS74","v":""},{"$f":"'T3'!AS74","v":""},{"$f":"'T4'!AS74","v":""},{"$f":"'T5'!AS74","v":""},{"$f":"'T6'!AS74","v":""},{"$f":"'T1'!AT74","v":""},{"$f":"'T2'!AT74","v":""},{"$f":"'T3'!AT74","v":""},{"$f":"'T4'!AT74","v":""},{"$f":"'T5'!AT74","v":""},{"$f":"'T6'!AT74","v":""},{"$f":"'T1'!AU74","v":""},{"$f":"'T2'!AU74","v":""},{"$f":"'T3'!AU74","v":""},{"$f":"'T4'!AU74","v":""},{"$f":"'T5'!AU74","v":""},{"$f":"'T6'!AU74","v":""},"","","","","",""]
[null,64,null,null,{"$f":"SW!G73","v":0},{"$f":"'T1'!AP75","v":""},{"$f":"'T2'!AP75","v":""},{"$f":"'T3'!AP75","v":""},{"$f":"'T4'!AP75","v":""},{"$f":"'T5'!AP75","v":""},{"$f":"'T6'!AP75","v":""},{"$f":"'T1'!AQ75","v":""},{"$f":"'T2'!AQ75","v":""},{"$f":"'T3'!AQ75","v":""},{"$f":"'T4'!AQ75","v":""},{"$f":"'T5'!AQ75","v":""},{"$f":"'T6'!AQ75","v":""},{"$f":"'T1'!AR75","v":""},{"$f":"'T2'!AR75","v":""},{"$f":"'T3'!AR75","v":""},{"$f":"'T4'!AR75","v":""},{"$f":"'T5'!AR75","v":""},{"$f":"'T6'!AR75","v":""},{"$f":"'T1'!AS75","v":""},{"$f":"'T2'!AS75","v":""},{"$f":"'T3'!AS75","v":""},{"$f":"'T4'!AS75","v":""},{"$f":"'T5'!AS75","v":""},{"$f":"'T6'!AS75","v":""},{"$f":"'T1'!AT75","v":""},{"$f":"'T2'!AT75","v":""},{"$f":"'T3'!AT75","v":""},{"$f":"'T4'!AT75","v":""},{"$f":"'T5'!AT75","v":""},{"$f":"'T6'!AT75","v":""},{"$f":"'T1'!AU75","v":""},{"$f":"'T2'!AU75","v":""},{"$f":"'T3'!AU75","v":""},{"$f":"'T4'!AU75","v":""},{"$f":"'T5'!AU75","v":""},{"$f":"'T6'!AU75","v":""},"","","","","",""]
[null,65,null,null,{"$f":"SW!G74","v":0},{"$f":"'T1'!AP76","v":""},{"$f":"'T2'!AP76","v":""},{"$f":"'T3'!AP76","v":""},{"$f":"'T4'!AP76","v":""},{"$f":"'T5'!AP76","v":""},{"$f":"'T6'!AP76","v":""},{"$f":"'T1'!AQ76","v":""},{"$f":"'T2'!AQ76","v":""},{"$f":"'T3'!AQ76","v":""},{"$f":"'T4'!AQ76","v":""},{"$f":"'T5'!AQ76","v":""},{"$f":"'T6'!AQ76","v":""},{"$f":"'T1'!AR76","v":""},{"$f":"'T2'!AR76","v":""},{"$f":"'T3'!AR76","v":""},{"$f":"'T4'!AR76","v":""},{"$f":"'T5'!AR76","v":""},{"$f":"'T6'!AR76","v":""},{"$f":"'T1'!AS76","v":""},{"$f":"'T2'!AS76","v":""},{"$f":"'T3'!AS76","v":""},{"$f":"'T4'!AS76","v":""},{"$f":"'T5'!AS76","v":""},{"$f":"'T6'!AS76","v":""},{"$f":"'T1'!AT76","v":""},{"$f":"'T2'!AT76","v":""},{"$f":"'T3'!AT76","v":""},{"$f":"'T4'!AT76","v":""},{"$f":"'T5'!AT76","v":""},{"$f":"'T6'!AT76","v":""},{"$f":"'T1'!AU76","v":""},{"$f":"'T2'!AU76","v":""},{"$f":"'T3'!AU76","v":""},{"$f":"'T4'!AU76","v":""},{"$f":"'T5'!AU76","v":""},{"$f":"'T6'!AU76","v":""},"","","","","",""]
[null,66,null,null,{"$f":"SW!G75","v":0},{"$f":"'T1'!AP77","v":""},{"$f":"'T2'!AP77","v":""},{"$f":"'T3'!AP77","v":""},{"$f":"'T4'!AP77","v":""},{"$f":"'T5'!AP77","v":""},{"$f":"'T6'!AP77","v":""},{"$f":"'T1'!AQ77","v":""},{"$f":"'T2'!AQ77","v":""},{"$f":"'T3'!AQ77","v":""},{"$f":"'T4'!AQ77","v":""},{"$f":"'T5'!AQ77","v":""},{"$f":"'T6'!AQ77","v":""},{"$f":"'T1'!AR77","v":""},{"$f":"'T2'!AR77","v":""},{"$f":"'T3'!AR77","v":""},{"$f":"'T4'!AR77","v":""},{"$f":"'T5'!AR77","v":""},{"$f":"'T6'!AR77","v":""},{"$f":"'T1'!AS77","v":""},{"$f":"'T2'!AS77","v":""},{"$f":"'T3'!AS77","v":""},{"$f":"'T4'!AS77","v":""},{"$f":"'T5'!AS77","v":""},{"$f":"'T6'!AS77","v":""},{"$f":"'T1'!AT77","v":""},{"$f":"'T2'!AT77","v":""},{"$f":"'T3'!AT77","v":""},{"$f":"'T4'!AT77","v":""},{"$f":"'T5'!AT77","v":""},{"$f":"'T6'!AT77","v":""},{"$f":"'T1'!AU77","v":""},{"$f":"'T2'!AU77","v":""},{"$f":"'T3'!AU77","v":""},{"$f":"'T4'!AU77","v":""},{"$f":"'T5'!AU77","v":""},{"$f":"'T6'!AU77","v":""},{"$f":"IFERROR(ROUND(AVERAGE(F76:K76),0),\"\")","v":""},{"$f":"IFERROR(ROUND(AVERAGE(L76:Q76),0),\"\")","v":""},{"$f":"IFERROR(ROUND(AVERAGE(R76:W76),0),\"\")","v":""},{"$f":"IFERROR(ROUND(AVERAGE(X76:AC76),0),\"\")","v":""},{"$f":"IFERROR(ROUND(AVERAGE(AD76:AI76),0),\"\")","v":""},{"$f":"IFERROR(ROUND(AVERAGE(AJ76:AO76),0),\"\")","v":""}]
[null,67,null,null,{"$f":"SW!G76","v":0},{"$f":"'T1'!AP78","v":""},{"$f":"'T2'!AP78","v":""},{"$f":"'T3'!AP78","v":""},{"$f":"'T4'!AP78","v":""},{"$f":"'T5'!AP78","v":""},{"$f":"'T6'!AP78","v":""},{"$f":"'T1'!AQ78","v":""},{"$f":"'T2'!AQ78","v":""},{"$f":"'T3'!AQ78","v":""},{"$f":"'T4'!AQ78","v":""},{"$f":"'T5'!AQ78","v":""},{"$f":"'T6'!AQ78","v":""},{"$f":"'T1'!AR78","v":""},{"$f":"'T2'!AR78","v":""},{"$f":"'T3'!AR78","v":""},{"$f":"'T4'!AR78","v":""},{"$f":"'T5'!AR78","v":""},{"$f":"'T6'!AR78","v":""},{"$f":"'T1'!AS78","v":""},{"$f":"'T2'!AS78","v":""},{"$f":"'T3'!AS78","v":""},{"$f":"'T4'!AS78","v":""},{"$f":"'T5'!AS78","v":""},{"$f":"'T6'!AS78","v":""},{"$f":"'T1'!AT78","v":""},{"$f":"'T2'!AT78","v":""},{"$f":"'T3'!AT78","v":""},{"$f":"'T4'!AT78","v":""},{"$f":"'T5'!AT78","v":""},{"$f":"'T6'!AT78","v":""},{"$f":"'T1'!AU78","v":""},{"$f":"'T2'!AU78","v":""},{"$f":"'T3'!AU78","v":""},{"$f":"'T4'!AU78","v":""},{"$f":"'T5'!AU78","v":""},{"$f":"'T6'!AU78","v":""},"","","","","",""]
[null,68,null,null,{"$f":"SW!G77","v":0},{"$f":"'T1'!AP79","v":""},{"$f":"'T2'!AP79","v":""},{"$f":"'T3'!AP79","v":""},{"$f":"'T4'!AP79","v":""},{"$f":"'T5'!AP79","v":""},{"$f":"'T6'!AP79","v":""},{"$f":"'T1'!AQ79","v":""},{"$f":"'T2'!AQ79","v":""},{"$f":"'T3'!AQ79","v":""},{"$f":"'T4'!AQ79","v":""},{"$f":"'T5'!AQ79","v":""},{"$f":"'T6'!AQ79","v":""},{"$f":"'T1'!AR79","v":""},{"$f":"'T2'!AR79","v":""},{"$f":"'T3'!AR79","v":""},{"$f":"'T4'!AR79","v":""},{"$f":"'T5'!AR79","v":""},{"$f":"'T6'!AR79","v":""},{"$f":"'T1'!AS79","v":""},{"$f":"'T2'!AS79","v":""},{"$f":"'T3'!AS79","v":""},{"$f":"'T4'!AS79","v":""},{"$f":"'T5'!AS79","v":""},{"$f":"'T6'!AS79","v":""},{"$f":"'T1'!AT79","v":""},{"$f":"'T2'!AT79","v":""},{"$f":"'T3'!AT79","v":""},{"$f":"'T4'!AT79","v":""},{"$f":"'T5'!AT79","v":""},{"$f":"'T6'!AT79","v":""},{"$f":"'T1'!AU79","v":""},{"$f":"'T2'!AU79","v":""},{"$f":"'T3'!AU79","v":""},{"$f":"'T4'!AU79","v":""},{"$f":"'T5'!AU79","v":""},{"$f":"'T6'!AU79","v":""},"","","","","",""]
[null,69,null,null,{"$f":"SW!G78","v":0},{"$f":"'T1'!AP80","v":""},{"$f":"'T2'!AP80","v":""},{"$f":"'T3'!AP80","v":""},{"$f":"'T4'!AP80","v":""},{"$f":"'T5'!AP80","v":""},{"$f":"'T6'!AP80","v":""},{"$f":"'T1'!AQ80","v":""},{"$f":"'T2'!AQ80","v":""},{"$f":"'T3'!AQ80","v":""},{"$f":"'T4'!AQ80","v":""},{"$f":"'T5'!AQ80","v":""},{"$f":"'T6'!AQ80","v":""},{"$f":"'T1'!AR80","v":""},{"$f":"'T2'!AR80","v":""},{"$f":"'T3'!AR80","v":""},{"$f":"'T4'!AR80","v":""},{"$f":"'T5'!AR80","v":""},{"$f":"'T6'!AR80","v":""},{"$f":"'T1'!AS80","v":""},{"$f":"'T2'!AS80","v":""},{"$f":"'T3'!AS80","v":""},{"$f":"'T4'!AS80","v":""},{"$f":"'T5'!AS80","v":""},{"$f":"'T6'!AS80","v":""},{"$f":"'T1'!AT80","v":""},{"$f":"'T2'!AT80","v":""},{"$f":"'T3'!AT80","v":""},{"$f":"'T4'!AT80","v":""},{"$f":"'T5'!AT80","v":""},{"$f":"'T6'!AT80","v":""},{"$f":"'T1'!AU80","v":""},{"$f":"'T2'!AU80","v":""},{"$f":"'T3'!AU80","v":""},{"$f":"'T4'!AU80","v":""},{"$f":"'T5'!AU80","v":""},{"$f":"'T6'!AU80","v":""},"","","","","",""]
[null,70,null,null,{"$f":"SW!G79","v":0},{"$f":"'T1'!AP81","v":""},{"$f":"'T2'!AP81","v":""},{"$f":"'T3'!AP81","v":""},{"$f":"'T4'!AP81","v":""},{"$f":"'T5'!AP81","v":""},{"$f":"'T6'!AP81","v":""},{"$f":"'T1'!AQ81","v":""},{"$f":"'T2'!AQ81","v":""},{"$f":"'T3'!AQ81","v":""},{"$f":"'T4'!AQ81","v":""},{"$f":"'T5'!AQ81","v":""},{"$f":"'T6'!AQ81","v":""},{"$f":"'T1'!AR81","v":""},{"$f":"'T2'!AR81","v":""},{"$f":"'T3'!AR81","v":""},{"$f":"'T4'!AR81","v":""},{"$f":"'T5'!AR81","v":""},{"$f":"'T6'!AR81","v":""},{"$f":"'T1'!AS81","v":""},{"$f":"'T2'!AS81","v":""},{"$f":"'T3'!AS81","v":""},{"$f":"'T4'!AS81","v":""},{"$f":"'T5'!AS81","v":""},{"$f":"'T6'!AS81","v":""},{"$f":"'T1'!AT81","v":""},{"$f":"'T2'!AT81","v":""},{"$f":"'T3'!AT81","v":""},{"$f":"'T4'!AT81","v":""},{"$f":"'T5'!AT81","v":""},{"$f":"'T6'!AT81","v":""},{"$f":"'T1'!AU81","v":""},{"$f":"'T2'!AU81","v":""},{"$f":"'T3'!AU81","v":""},{"$f":"'T4'!AU81","v":""},{"$f":"'T5'!AU81","v":""},{"$f":"'T6'!AU81","v":""},"","","","","",""]
[null,71,null,null,{"$f":"SW!G80","v":0},{"$f":"'T1'!AP82","v":""},{"$f":"'T2'!AP82","v":""},{"$f":"'T3'!AP82","v":""},{"$f":"'T4'!AP82","v":""},{"$f":"'T5'!AP82","v":""},{"$f":"'T6'!AP82","v":""},{"$f":"'T1'!AQ82","v":""},{"$f":"'T2'!AQ82","v":""},{"$f":"'T3'!AQ82","v":""},{"$f":"'T4'!AQ82","v":""},{"$f":"'T5'!AQ82","v":""},{"$f":"'T6'!AQ82","v":""},{"$f":"'T1'!AR82","v":""},{"$f":"'T2'!AR82","v":""},{"$f":"'T3'!AR82","v":""},{"$f":"'T4'!AR82","v":""},{"$f":"'T5'!AR82","v":""},{"$f":"'T6'!AR82","v":""},{"$f":"'T1'!AS82","v":""},{"$f":"'T2'!AS82","v":""},{"$f":"'T3'!AS82","v":""},{"$f":"'T4'!AS82","v":""},{"$f":"'T5'!AS82","v":""},{"$f":"'T6'!AS82","v":""},{"$f":"'T1'!AT82","v":""},{"$f":"'T2'!AT82","v":""},{"$f":"'T3'!AT82","v":""},{"$f":"'T4'!AT82","v":""},{"$f":"'T5'!AT82","v":""},{"$f":"'T6'!AT82","v":""},{"$f":"'T1'!AU82","v":""},{"$f":"'T2'!AU82","v":""},{"$f":"'T3'!AU82","v":""},{"$f":"'T4'!AU82","v":""},{"$f":"'T5'!AU82","v":""},{"$f":"'T6'!AU82","v":""},"","","","","",""]
[null,72,null,null,{"$f":"SW!G81","v":0},{"$f":"'T1'!AP83","v":""},{"$f":"'T2'!AP83","v":""},{"$f":"'T3'!AP83","v":""},{"$f":"'T4'!AP83","v":""},{"$f":"'T5'!AP83","v":""},{"$f":"'T6'!AP83","v":""},{"$f":"'T1'!AQ83","v":""},{"$f":"'T2'!AQ83","v":""},{"$f":"'T3'!AQ83","v":""},{"$f":"'T4'!AQ83","v":""},{"$f":"'T5'!AQ83","v":""},{"$f":"'T6'!AQ83","v":""},{"$f":"'T1'!AR83","v":""},{"$f":"'T2'!AR83","v":""},{"$f":"'T3'!AR83","v":""},{"$f":"'T4'!AR83","v":""},{"$f":"'T5'!AR83","v":""},{"$f":"'T6'!AR83","v":""},{"$f":"'T1'!AS83","v":""},{"$f":"'T2'!AS83","v":""},{"$f":"'T3'!AS83","v":""},{"$f":"'T4'!AS83","v":""},{"$f":"'T5'!AS83","v":""},{"$f":"'T6'!AS83","v":""},{"$f":"'T1'!AT83","v":""},{"$f":"'T2'!AT83","v":""},{"$f":"'T3'!AT83","v":""},{"$f":"'T4'!AT83","v":""},{"$f":"'T5'!AT83","v":""},{"$f":"'T6'!AT83","v":""},{"$f":"'T1'!AU83","v":""},{"$f":"'T2'!AU83","v":""},{"$f":"'T3'!AU83","v":""},{"$f":"'T4'!AU83","v":""},{"$f":"'T5'!AU83","v":""},{"$f":"'T6'!AU83","v":""},"","","","","",""]
[null,73,null,null,{"$f":"SW!G82","v":0},{"$f":"'T1'!AP84","v":""},{"$f":"'T2'!AP84","v":""},{"$f":"'T3'!AP84","v":""},{"$f":"'T4'!AP84","v":""},{"$f":"'T5'!AP84","v":""},{"$f":"'T6'!AP84","v":""},{"$f":"'T1'!AQ84","v":""},{"$f":"'T2'!AQ84","v":""},{"$f":"'T3'!AQ84","v":""},{"$f":"'T4'!AQ84","v":""},{"$f":"'T5'!AQ84","v":""},{"$f":"'T6'!AQ84","v":""},{"$f":"'T1'!AR84","v":""},{"$f":"'T2'!AR84","v":""},{"$f":"'T3'!AR84","v":""},{"$f":"'T4'!AR84","v":""},{"$f":"'T5'!AR84","v":""},{"$f":"'T6'!AR84","v":""},{"$f":"'T1'!AS84","v":""},{"$f":"'T2'!AS84","v":""},{"$f":"'T3'!AS84","v":""},{"$f":"'T4'!AS84","v":""},{"$f":"'T5'!AS84","v":""},{"$f":"'T6'!AS84","v":""},{"$f":"'T1'!AT84","v":""},{"$f":"'T2'!AT84","v":""},{"$f":"'T3'!AT84","v":""},{"$f":"'T4'!AT84","v":""},{"$f":"'T5'!AT84","v":""},{"$f":"'T6'!AT84","v":""},{"$f":"'T1'!AU84","v":""},{"$f":"'T2'!AU84","v":""},{"$f":"'T3'!AU84","v":""},{"$f":"'T4'!AU84","v":""},{"$f":"'T5'!AU84","v":""},{"$f":"'T6'!AU84","v":""},"","","","","",""]
[null,74,null,null,{"$f":"SW!G83","v":0},{"$f":"'T1'!AP85","v":""},{"$f":"'T2'!AP85","v":""},{"$f":"'T3'!AP85","v":""},{"$f":"'T4'!AP85","v":""},{"$f":"'T5'!AP85","v":""},{"$f":"'T6'!AP85","v":""},{"$f":"'T1'!AQ85","v":""},{"$f":"'T2'!AQ85","v":""},{"$f":"'T3'!AQ85","v":""},{"$f":"'T4'!AQ85","v":""},{"$f":"'T5'!AQ85","v":""},{"$f":"'T6'!AQ85","v":""},{"$f":"'T1'!AR85","v":""},{"$f":"'T2'!AR85","v":""},{"$f":"'T3'!AR85","v":""},{"$f":"'T4'!AR85","v":""},{"$f":"'T5'!AR85","v":""},{"$f":"'T6'!AR85","v":""},{"$f":"'T1'!AS85","v":""},{"$f":"'T2'!AS85","v":""},{"$f":"'T3'!AS85","v":""},{"$f":"'T4'!AS85","v":""},{"$f":"'T5'!AS85","v":""},{"$f":"'T6'!AS85","v":""},{"$f":"'T1'!AT85","v":""},{"$f":"'T2'!AT85","v":""},{"$f":"'T3'!AT85","v":""},{"$f":"'T4'!AT85","v":""},{"$f":"'T5'!AT85","v":""},{"$f":"'T6'!AT85","v":""},{"$f":"'T1'!AU85","v":""},{"$f":"'T2'!AU85","v":""},{"$f":"'T3'!AU85","v":""},{"$f":"'T4'!AU85","v":""},{"$f":"'T5'!AU85","v":""},{"$f":"'T6'!AU85","v":""},"","","","","",""]
[null,75,null,null,{"$f":"SW!G84","v":0},{"$f":"'T1'!AP86","v":""},{"$f":"'T2'!AP86","v":""},{"$f":"'T3'!AP86","v":""},{"$f":"'T4'!AP86","v":""},{"$f":"'T5'!AP86","v":""},{"$f":"'T6'!AP86","v":""},{"$f":"'T1'!AQ86","v":""},{"$f":"'T2'!AQ86","v":""},{"$f":"'T3'!AQ86","v":""},{"$f":"'T4'!AQ86","v":""},{"$f":"'T5'!AQ86","v":""},{"$f":"'T6'!AQ86","v":""},{"$f":"'T1'!AR86","v":""},{"$f":"'T2'!AR86","v":""},{"$f":"'T3'!AR86","v":""},{"$f":"'T4'!AR86","v":""},{"$f":"'T5'!AR86","v":""},{"$f":"'T6'!AR86","v":""},{"$f":"'T1'!AS86","v":""},{"$f":"'T2'!AS86","v":""},{"$f":"'T3'!AS86","v":""},{"$f":"'T4'!AS86","v":""},{"$f":"'T5'!AS86","v":""},{"$f":"'T6'!AS86","v":""},{"$f":"'T1'!AT86","v":""},{"$f":"'T2'!AT86","v":""},{"$f":"'T3'!AT86","v":""},{"$f":"'T4'!AT86","v":""},{"$f":"'T5'!AT86","v":""},{"$f":"'T6'!AT86","v":""},{"$f":"'T1'!AU86","v":""},{"$f":"'T2'!AU86","v":""},{"$f":"'T3'!AU86","v":""},{"$f":"'T4'!AU86","v":""},{"$f":"'T5'!AU86","v":""},{"$f":"'T6'!AU86","v":""},"","","","","",""]
[null,76,null,null,{"$f":"SW!G85","v":0},{"$f":"'T1'!AP87","v":""},{"$f":"'T2'!AP87","v":""},{"$f":"'T3'!AP87","v":""},{"$f":"'T4'!AP87","v":""},{"$f":"'T5'!AP87","v":""},{"$f":"'T6'!AP87","v":""},{"$f":"'T1'!AQ87","v":""},{"$f":"'T2'!AQ87","v":""},{"$f":"'T3'!AQ87","v":""},{"$f":"'T4'!AQ87","v":""},{"$f":"'T5'!AQ87","v":""},{"$f":"'T6'!AQ87","v":""},{"$f":"'T1'!AR87","v":""},{"$f":"'T2'!AR87","v":""},{"$f":"'T3'!AR87","v":""},{"$f":"'T4'!AR87","v":""},{"$f":"'T5'!AR87","v":""},{"$f":"'T6'!AR87","v":""},{"$f":"'T1'!AS87","v":""},{"$f":"'T2'!AS87","v":""},{"$f":"'T3'!AS87","v":""},{"$f":"'T4'!AS87","v":""},{"$f":"'T5'!AS87","v":""},{"$f":"'T6'!AS87","v":""},{"$f":"'T1'!AT87","v":""},{"$f":"'T2'!AT87","v":""},{"$f":"'T3'!AT87","v":""},{"$f":"'T4'!AT87","v":""},{"$f":"'T5'!AT87","v":""},{"$f":"'T6'!AT87","v":""},{"$f":"'T1'!AU87","v":""},{"$f":"'T2'!AU87","v":""},{"$f":"'T3'!AU87","v":""},{"$f":"'T4'!AU87","v":""},{"$f":"'T5'!AU87","v":""},{"$f":"'T6'!AU87","v":""},"","","","","",""]
[null,77,null,null,{"$f":"SW!G86","v":0},{"$f":"'T1'!AP88","v":""},{"$f":"'T2'!AP88","v":""},{"$f":"'T3'!AP88","v":""},{"$f":"'T4'!AP88","v":""},{"$f":"'T5'!AP88","v":""},{"$f":"'T6'!AP88","v":""},{"$f":"'T1'!AQ88","v":""},{"$f":"'T2'!AQ88","v":""},{"$f":"'T3'!AQ88","v":""},{"$f":"'T4'!AQ88","v":""},{"$f":"'T5'!AQ88","v":""},{"$f":"'T6'!AQ88","v":""},{"$f":"'T1'!AR88","v":""},{"$f":"'T2'!AR88","v":""},{"$f":"'T3'!AR88","v":""},{"$f":"'T4'!AR88","v":""},{"$f":"'T5'!AR88","v":""},{"$f":"'T6'!AR88","v":""},{"$f":"'T1'!AS88","v":""},{"$f":"'T2'!AS88","v":""},{"$f":"'T3'!AS88","v":""},{"$f":"'T4'!AS88","v":""},{"$f":"'T5'!AS88","v":""},{"$f":"'T6'!AS88","v":""},{"$f":"'T1'!AT88","v":""},{"$f":"'T2'!AT88","v":""},{"$f":"'T3'!AT88","v":""},{"$f":"'T4'!AT88","v":""},{"$f":"'T5'!AT88","v":""},{"$f":"'T6'!AT88","v":""},{"$f":"'T1'!AU88","v":""},{"$f":"'T2'!AU88","v":""},{"$f":"'T3'!AU88","v":""},{"$f":"'T4'!AU88","v":""},{"$f":"'T5'!AU88","v":""},{"$f":"'T6'!AU88","v":""},"","","","","",""]
[null,78,null,null,{"$f":"SW!G87","v":0},{"$f":"'T1'!AP89","v":""},{"$f":"'T2'!AP89","v":""},{"$f":"'T3'!AP89","v":""},{"$f":"'T4'!AP89","v":""},{"$f":"'T5'!AP89","v":""},{"$f":"'T6'!AP89","v":""},{"$f":"'T1'!AQ89","v":""},{"$f":"'T2'!AQ89","v":""},{"$f":"'T3'!AQ89","v":""},{"$f":"'T4'!AQ89","v":""},{"$f":"'T5'!AQ89","v":""},{"$f":"'T6'!AQ89","v":""},{"$f":"'T1'!AR89","v":""},{"$f":"'T2'!AR89","v":""},{"$f":"'T3'!AR89","v":""},{"$f":"'T4'!AR89","v":""},{"$f":"'T5'!AR89","v":""},{"$f":"'T6'!AR89","v":""},{"$f":"'T1'!AS89","v":""},{"$f":"'T2'!AS89","v":""},{"$f":"'T3'!AS89","v":""},{"$f":"'T4'!AS89","v":""},{"$f":"'T5'!AS89","v":""},{"$f":"'T6'!AS89","v":""},{"$f":"'T1'!AT89","v":""},{"$f":"'T2'!AT89","v":""},{"$f":"'T3'!AT89","v":""},{"$f":"'T4'!AT89","v":""},{"$f":"'T5'!AT89","v":""},{"$f":"'T6'!AT89","v":""},{"$f":"'T1'!AU89","v":""},{"$f":"'T2'!AU89","v":""},{"$f":"'T3'!AU89","v":""},{"$f":"'T4'!AU89","v":""},{"$f":"'T5'!AU89","v":""},{"$f":"'T6'!AU89","v":""},"","","","","",""]
[null,79,null,null,{"$f":"SW!G88","v":0},{"$f":"'T1'!AP90","v":""},{"$f":"'T2'!AP90","v":""},{"$f":"'T3'!AP90","v":""},{"$f":"'T4'!AP90","v":""},{"$f":"'T5'!AP90","v":""},{"$f":"'T6'!AP90","v":""},{"$f":"'T1'!AQ90","v":""},{"$f":"'T2'!AQ90","v":""},{"$f":"'T3'!AQ90","v":""},{"$f":"'T4'!AQ90","v":""},{"$f":"'T5'!AQ90","v":""},{"$f":"'T6'!AQ90","v":""},{"$f":"'T1'!AR90","v":""},{"$f":"'T2'!AR90","v":""},{"$f":"'T3'!AR90","v":""},{"$f":"'T4'!AR90","v":""},{"$f":"'T5'!AR90","v":""},{"$f":"'T6'!AR90","v":""},{"$f":"'T1'!AS90","v":""},{"$f":"'T2'!AS90","v":""},{"$f":"'T3'!AS90","v":""},{"$f":"'T4'!AS90","v":""},{"$f":"'T5'!AS90","v":""},{"$f":"'T6'!AS90","v":""},{"$f":"'T1'!AT90","v":""},{"$f":"'T2'!AT90","v":""},{"$f":"'T3'!AT90","v":""},{"$f":"'T4'!AT90","v":""},{"$f":"'T5'!AT90","v":""},{"$f":"'T6'!AT90","v":""},{"$f":"'T1'!AU90","v":""},{"$f":"'T2'!AU90","v":""},{"$f":"'T3'!AU90","v":""},{"$f":"'T4'!AU90","v":""},{"$f":"'T5'!AU90","v":""},{"$f":"'T6'!AU90","v":""},"","","","","",""]
[null,80,null,null,{"$f":"SW!G89","v":0},{"$f":"'T1'!AP91","v":""},{"$f":"'T2'!AP91","v":""},{"$f":"'T3'!AP91","v":""},{"$f":"'T4'!AP91","v":""},{"$f":"'T5'!AP91","v":""},{"$f":"'T6'!AP91","v":""},{"$f":"'T1'!AQ91","v":""},{"$f":"'T2'!AQ91","v":""},{"$f":"'T3'!AQ91","v":""},{"$f":"'T4'!AQ91","v":""},{"$f":"'T5'!AQ91","v":""},{"$f":"'T6'!AQ91","v":""},{"$f":"'T1'!AR91","v":""},{"$f":"'T2'!AR91","v":""},{"$f":"'T3'!AR91","v":""},{"$f":"'T4'!AR91","v":""},{"$f":"'T5'!AR91","v":""},{"$f":"'T6'!AR91","v":""},{"$f":"'T1'!AS91","v":""},{"$f":"'T2'!AS91","v":""},{"$f":"'T3'!AS91","v":""},{"$f":"'T4'!AS91","v":""},{"$f":"'T5'!AS91","v":""},{"$f":"'T6'!AS91","v":""},{"$f":"'T1'!AT91","v":""},{"$f":"'T2'!AT91","v":""},{"$f":"'T3'!AT91","v":""},{"$f":"'T4'!AT91","v":""},{"$f":"'T5'!AT91","v":""},{"$f":"'T6'!AT91","v":""},{"$f":"'T1'!AU91","v":""},{"$f":"'T2'!AU91","v":""},{"$f":"'T3'!AU91","v":""},{"$f":"'T4'!AU91","v":""},{"$f":"'T5'!AU91","v":""},{"$f":"'T6'!AU91","v":""},"","","","","",""]
[null,81,null,null,{"$f":"SW!G90","v":0},{"$f":"'T1'!AP92","v":""},{"$f":"'T2'!AP92","v":""},{"$f":"'T3'!AP92","v":""},{"$f":"'T4'!AP92","v":""},{"$f":"'T5'!AP92","v":""},{"$f":"'T6'!AP92","v":""},{"$f":"'T1'!AQ92","v":""},{"$f":"'T2'!AQ92","v":""},{"$f":"'T3'!AQ92","v":""},{"$f":"'T4'!AQ92","v":""},{"$f":"'T5'!AQ92","v":""},{"$f":"'T6'!AQ92","v":""},{"$f":"'T1'!AR92","v":""},{"$f":"'T2'!AR92","v":""},{"$f":"'T3'!AR92","v":""},{"$f":"'T4'!AR92","v":""},{"$f":"'T5'!AR92","v":""},{"$f":"'T6'!AR92","v":""},{"$f":"'T1'!AS92","v":""},{"$f":"'T2'!AS92","v":""},{"$f":"'T3'!AS92","v":""},{"$f":"'T4'!AS92","v":""},{"$f":"'T5'!AS92","v":""},{"$f":"'T6'!AS92","v":""},{"$f":"'T1'!AT92","v":""},{"$f":"'T2'!AT92","v":""},{"$f":"'T3'!AT92","v":""},{"$f":"'T4'!AT92","v":""},{"$f":"'T5'!AT92","v":""},{"$f":"'T6'!AT92","v":""},{"$f":"'T1'!AU92","v":""},{"$f":"'T2'!AU92","v":""},{"$f":"'T3'!AU92","v":""},{"$f":"'T4'!AU92","v":""},{"$f":"'T5'!AU92","v":""},{"$f":"'T6'!AU92","v":""},"","","","","",""]
[null,82,null,null,{"$f":"SW!G91","v":0},{"$f":"'T1'!AP93","v":""},{"$f":"'T2'!AP93","v":""},{"$f":"'T3'!AP93","v":""},{"$f":"'T4'!AP93","v":""},{"$f":"'T5'!AP93","v":""},{"$f":"'T6'!AP93","v":""},{"$f":"'T1'!AQ93","v":""},{"$f":"'T2'!AQ93","v":""},{"$f":"'T3'!AQ93","v":""},{"$f":"'T4'!AQ93","v":""},{"$f":"'T5'!AQ93","v":""},{"$f":"'T6'!AQ93","v":""},{"$f":"'T1'!AR93","v":""},{"$f":"'T2'!AR93","v":""},{"$f":"'T3'!AR93","v":""},{"$f":"'T4'!AR93","v":""},{"$f":"'T5'!AR93","v":""},{"$f":"'T6'!AR93","v":""},{"$f":"'T1'!AS93","v":""},{"$f":"'T2'!AS93","v":""},{"$f":"'T3'!AS93","v":""},{"$f":"'T4'!AS93","v":""},{"$f":"'T5'!AS93","v":""},{"$f":"'T6'!AS93","v":""},{"$f":"'T1'!AT93","v":""},{"$f":"'T2'!AT93","v":""},{"$f":"'T3'!AT93","v":""},{"$f":"'T4'!AT93","v":""},{"$f":"'T5'!AT93","v":""},{"$f":"'T6'!AT93","v":""},{"$f":"'T1'!AU93","v":""},{"$f":"'T2'!AU93","v":""},{"$f":"'T3'!AU93","v":""},{"$f":"'T4'!AU93","v":""},{"$f":"'T5'!AU93","v":""},{"$f":"'T6'!AU93","v":""},"","","","","",""]
[null,83,null,null,{"$f":"SW!G92","v":0},{"$f":"'T1'!AP94","v":""},{"$f":"'T2'!AP94","v":""},{"$f":"'T3'!AP94","v":""},{"$f":"'T4'!AP94","v":""},{"$f":"'T5'!AP94","v":""},{"$f":"'T6'!AP94","v":""},{"$f":"'T1'!AQ94","v":""},{"$f":"'T2'!AQ94","v":""},{"$f":"'T3'!AQ94","v":""},{"$f":"'T4'!AQ94","v":""},{"$f":"'T5'!AQ94","v":""},{"$f":"'T6'!AQ94","v":""},{"$f":"'T1'!AR94","v":""},{"$f":"'T2'!AR94","v":""},{"$f":"'T3'!AR94","v":""},{"$f":"'T4'!AR94","v":""},{"$f":"'T5'!AR94","v":""},{"$f":"'T6'!AR94","v":""},{"$f":"'T1'!AS94","v":""},{"$f":"'T2'!AS94","v":""},{"$f":"'T3'!AS94","v":""},{"$f":"'T4'!AS94","v":""},{"$f":"'T5'!AS94","v":""},{"$f":"'T6'!AS94","v":""},{"$f":"'T1'!AT94","v":""},{"$f":"'T2'!AT94","v":""},{"$f":"'T3'!AT94","v":""},{"$f":"'T4'!AT94","v":""},{"$f":"'T5'!AT94","v":""},{"$f":"'T6'!AT94","v":""},{"$f":"'T1'!AU94","v":""},{"$f":"'T2'!AU94","v":""},{"$f":"'T3'!AU94","v":""},{"$f":"'T4'!AU94","v":""},{"$f":"'T5'!AU94","v":""},{"$f":"'T6'!AU94","v":""},"","","","","",""]
[null,84,null,null,{"$f":"SW!G93","v":0},{"$f":"'T1'!AP95","v":""},{"$f":"'T2'!AP95","v":""},{"$f":"'T3'!AP95","v":""},{"$f":"'T4'!AP95","v":""},{"$f":"'T5'!AP95","v":""},{"$f":"'T6'!AP95","v":""},{"$f":"'T1'!AQ95","v":""},{"$f":"'T2'!AQ95","v":""},{"$f":"'T3'!AQ95","v":""},{"$f":"'T4'!AQ95","v":""},{"$f":"'T5'!AQ95","v":""},{"$f":"'T6'!AQ95","v":""},{"$f":"'T1'!AR95","v":""},{"$f":"'T2'!AR95","v":""},{"$f":"'T3'!AR95","v":""},{"$f":"'T4'!AR95","v":""},{"$f":"'T5'!AR95","v":""},{"$f":"'T6'!AR95","v":""},{"$f":"'T1'!AS95","v":""},{"$f":"'T2'!AS95","v":""},{"$f":"'T3'!AS95","v":""},{"$f":"'T4'!AS95","v":""},{"$f":"'T5'!AS95","v":""},{"$f":"'T6'!AS95","v":""},{"$f":"'T1'!AT95","v":""},{"$f":"'T2'!AT95","v":""},{"$f":"'T3'!AT95","v":""},{"$f":"'T4'!AT95","v":""},{"$f":"'T5'!AT95","v":""},{"$f":"'T6'!AT95","v":""},{"$f":"'T1'!AU95","v":""},{"$f":"'T2'!AU95","v":""},{"$f":"'T3'!AU95","v":""},{"$f":"'T4'!AU95","v":""},{"$f":"'T5'!AU95","v":""},{"$f":"'T6'!AU95","v":""},"","","","","",""]
[null,85,null,null,{"$f":"SW!G94","v":0},{"$f":"'T1'!AP96","v":""},{"$f":"'T2'!AP96","v":""},{"$f":"'T3'!AP96","v":""},{"$f":"'T4'!AP96","v":""},{"$f":"'T5'!AP96","v":""},{"$f":"'T6'!AP96","v":""},{"$f":"'T1'!AQ96","v":""},{"$f":"'T2'!AQ96","v":""},{"$f":"'T3'!AQ96","v":""},{"$f":"'T4'!AQ96","v":""},{"$f":"'T5'!AQ96","v":""},{"$f":"'T6'!AQ96","v":""},{"$f":"'T1'!AR96","v":""},{"$f":"'T2'!AR96","v":""},{"$f":"'T3'!AR96","v":""},{"$f":"'T4'!AR96","v":""},{"$f":"'T5'!AR96","v":""},{"$f":"'T6'!AR96","v":""},{"$f":"'T1'!AS96","v":""},{"$f":"'T2'!AS96","v":""},{"$f":"'T3'!AS96","v":""},{"$f":"'T4'!AS96","v":""},{"$f":"'T5'!AS96","v":""},{"$f":"'T6'!AS96","v":""},{"$f":"'T1'!AT96","v":""},{"$f":"'T2'!AT96","v":""},{"$f":"'T3'!AT96","v":""},{"$f":"'T4'!AT96","v":""},{"$f":"'T5'!AT96","v":""},{"$f":"'T6'!AT96","v":""},{"$f":"'T1'!AU96","v":""},{"$f":"'T2'!AU96","v":""},{"$f":"'T3'!AU96","v":""},{"$f":"'T4'!AU96","v":""},{"$f":"'T5'!AU96","v":""},{"$f":"'T6'!AU96","v":""},"","","","","",""]
[null,86,null,null,{"$f":"SW!G95","v":0},{"$f":"'T1'!AP97","v":""},{"$f":"'T2'!AP97","v":""},{"$f":"'T3'!AP97","v":""},{"$f":"'T4'!AP97","v":""},{"$f":"'T5'!AP97","v":""},{"$f":"'T6'!AP97","v":""},{"$f":"'T1'!AQ97","v":""},{"$f":"'T2'!AQ97","v":""},{"$f":"'T3'!AQ97","v":""},{"$f":"'T4'!AQ97","v":""},{"$f":"'T5'!AQ97","v":""},{"$f":"'T6'!AQ97","v":""},{"$f":"'T1'!AR97","v":""},{"$f":"'T2'!AR97","v":""},{"$f":"'T3'!AR97","v":""},{"$f":"'T4'!AR97","v":""},{"$f":"'T5'!AR97","v":""},{"$f":"'T6'!AR97","v":""},{"$f":"'T1'!AS97","v":""},{"$f":"'T2'!AS97","v":""},{"$f":"'T3'!AS97","v":""},{"$f":"'T4'!AS97","v":""},{"$f":"'T5'!AS97","v":""},{"$f":"'T6'!AS97","v":""},{"$f":"'T1'!AT97","v":""},{"$f":"'T2'!AT97","v":""},{"$f":"'T3'!AT97","v":""},{"$f":"'T4'!AT97","v":""},{"$f":"'T5'!AT97","v":""},{"$f":"'T6'!AT97","v":""},{"$f":"'T1'!AU97","v":""},{"$f":"'T2'!AU97","v":""},{"$f":"'T3'!AU97","v":""},{"$f":"'T4'!AU97","v":""},{"$f":"'T5'!AU97","v":""},{"$f":"'T6'!AU97","v":""},"","","","","",""]
[null,87,null,null,{"$f":"SW!G96","v":0},{"$f":"'T1'!AP98","v":""},{"$f":"'T2'!AP98","v":""},{"$f":"'T3'!AP98","v":""},{"$f":"'T4'!AP98","v":""},{"$f":"'T5'!AP98","v":""},{"$f":"'T6'!AP98","v":""},{"$f":"'T1'!AQ98","v":""},{"$f":"'T2'!AQ98","v":""},{"$f":"'T3'!AQ98","v":""},{"$f":"'T4'!AQ98","v":""},{"$f":"'T5'!AQ98","v":""},{"$f":"'T6'!AQ98","v":""},{"$f":"'T1'!AR98","v":""},{"$f":"'T2'!AR98","v":""},{"$f":"'T3'!AR98","v":""},{"$f":"'T4'!AR98","v":""},{"$f":"'T5'!AR98","v":""},{"$f":"'T6'!AR98","v":""},{"$f":"'T1'!AS98","v":""},{"$f":"'T2'!AS98","v":""},{"$f":"'T3'!AS98","v":""},{"$f":"'T4'!AS98","v":""},{"$f":"'T5'!AS98","v":""},{"$f":"'T6'!AS98","v":""},{"$f":"'T1'!AT98","v":""},{"$f":"'T2'!AT98","v":""},{"$f":"'T3'!AT98","v":""},{"$f":"'T4'!AT98","v":""},{"$f":"'T5'!AT98","v":""},{"$f":"'T6'!AT98","v":""},{"$f":"'T1'!AU98","v":""},{"$f":"'T2'!AU98","v":""},{"$f":"'T3'!AU98","v":""},{"$f":"'T4'!AU98","v":""},{"$f":"'T5'!AU98","v":""},{"$f":"'T6'!AU98","v":""},"","","","","",""]
[null,88,null,null,{"$f":"SW!G97","v":0},{"$f":"'T1'!AP99","v":""},{"$f":"'T2'!AP99","v":""},{"$f":"'T3'!AP99","v":""},{"$f":"'T4'!AP99","v":""},{"$f":"'T5'!AP99","v":""},{"$f":"'T6'!AP99","v":""},{"$f":"'T1'!AQ99","v":""},{"$f":"'T2'!AQ99","v":""},{"$f":"'T3'!AQ99","v":""},{"$f":"'T4'!AQ99","v":""},{"$f":"'T5'!AQ99","v":""},{"$f":"'T6'!AQ99","v":""},{"$f":"'T1'!AR99","v":""},{"$f":"'T2'!AR99","v":""},{"$f":"'T3'!AR99","v":""},{"$f":"'T4'!AR99","v":""},{"$f":"'T5'!AR99","v":""},{"$f":"'T6'!AR99","v":""},{"$f":"'T1'!AS99","v":""},{"$f":"'T2'!AS99","v":""},{"$f":"'T3'!AS99","v":""},{"$f":"'T4'!AS99","v":""},{"$f":"'T5'!AS99","v":""},{"$f":"'T6'!AS99","v":""},{"$f":"'T1'!AT99","v":""},{"$f":"'T2'!AT99","v":""},{"$f":"'T3'!AT99","v":""},{"$f":"'T4'!AT99","v":""},{"$f":"'T5'!AT99","v":""},{"$f":"'T6'!AT99","v":""},{"$f":"'T1'!AU99","v":""},{"$f":"'T2'!AU99","v":""},{"$f":"'T3'!AU99","v":""},{"$f":"'T4'!AU99","v":""},{"$f":"'T5'!AU99","v":""},{"$f":"'T6'!AU99","v":""},"","","","","",""]
[null,89,null,null,{"$f":"SW!G98","v":0},{"$f":"'T1'!AP100","v":""},{"$f":"'T2'!AP100","v":""},{"$f":"'T3'!AP100","v":""},{"$f":"'T4'!AP100","v":""},{"$f":"'T5'!AP100","v":""},{"$f":"'T6'!AP100","v":""},{"$f":"'T1'!AQ100","v":""},{"$f":"'T2'!AQ100","v":""},{"$f":"'T3'!AQ100","v":""},{"$f":"'T4'!AQ100","v":""},{"$f":"'T5'!AQ100","v":""},{"$f":"'T6'!AQ100","v":""},{"$f":"'T1'!AR100","v":""},{"$f":"'T2'!AR100","v":""},{"$f":"'T3'!AR100","v":""},{"$f":"'T4'!AR100","v":""},{"$f":"'T5'!AR100","v":""},{"$f":"'T6'!AR100","v":""},{"$f":"'T1'!AS100","v":""},{"$f":"'T2'!AS100","v":""},{"$f":"'T3'!AS100","v":""},{"$f":"'T4'!AS100","v":""},{"$f":"'T5'!AS100","v":""},{"$f":"'T6'!AS100","v":""},{"$f":"'T1'!AT100","v":""},{"$f":"'T2'!AT100","v":""},{"$f":"'T3'!AT100","v":""},{"$f":"'T4'!AT100","v":""},{"$f":"'T5'!AT100","v":""},{"$f":"'T6'!AT100","v":""},{"$f":"'T1'!AU100","v":""},{"$f":"'T2'!AU100","v":""},{"$f":"'T3'!AU100","v":""},{"$f":"'T4'!AU100","v":""},{"$f":"'T5'!AU100","v":""},{"$f":"'T6'!AU100","v":""},"","","","","",""]

{"sheet":"MTK","index":7,"n_rows":99,"n_cols":16,"rows_kept":99,"cut":false,"hidden":false,"merged":[[98,6,98,8],[98,10,98,12],[98,14,98,17],[8,6,8,13],[96,6,96,8],[96,10,96,12],[96,14,96,17],[97,6,97,8],[97,10,97,12],[97,14,97,17],[94,6,94,8],[94,10,94,12],[94,14,94,17],[95,6,95,8],[95,10,95,12],[95,14,95,17],[92,6,92,8],[92,10,92,12],[92,14,92,17],[93,6,93,8],[93,10,93,12],[93,14,93,17],[90,6,90,8],[90,10,90,12],[90,14,90,17],[91,6,91,8],[91,10,91,12],[91,14,91,17],[88,6,88,8],[88,10,88,12],[88,14,88,17],[89,6,89,8],[89,10,89,12],[89,14,89,17],[86,6,86,8],[86,10,86,12],[86,14,86,17],[87,6,87,8],[87,10,87,12],[87,14,87,17],[84,6,84,8],[84,10,84,12],[84,14,84,17],[85,6,85,8],[85,10,85,12],[85,14,85,17],[82,6,82,8],[82,10,82,12],[82,14,82,17],[83,6,83,8],[83,10,83,12],[83,14,83,17],[80,6,80,8],[80,10,80,12],[80,14,80,17],[81,6,81,8],[81,10,81,12],[81,14,81,17],[78,6,78,8],[78,10,78,12],[78,14,78,17],[79,6,79,8],[79,10,79,12],[79,14,79,17],[76,6,76,8],[76,10,76,12],[76,14,76,17],[77,6,77,8],[77,10,77,12],[77,14,77,17],[74,6,74,8],[74,10,74,12],[74,14,74,17],[75,6,75,8],[75,10,75,12],[75,14,75,17],[72,6,72,8],[72,10,72,12],[72,14,72,17],[73,6,73,8],[73,10,73,12],[73,14,73,17],[70,6,70,8],[70,10,70,12],[70,14,70,17],[71,6,71,8],[71,10,71,12],[71,14,71,17],[68,6,68,8],[68,10,68,12],[68,14,68,17],[69,6,69,8],[69,10,69,12],[69,14,69,17],[66,6,66,8],[66,10,66,12],[66,14,66,17],[67,6,67,8],[67,10,67,12],[67,14,67,17],[64,6,64,8],[64,10,64,12],[64,14,64,17],[65,6,65,8],[65,10,65,12],[65,14,65,17],[62,6,62,8],[62,10,62,12],[62,14,62,17],[63,6,63,8],[63,10,63,12],[63,14,63,17],[60,6,60,8],[60,10,60,12],[60,14,60,17],[61,6,61,8],[61,10,61,12],[61,14,61,17],[58,6,58,8],[58,10,58,12],[58,14,58,17],[59,6,59,8],[59,10,59,12],[59,14,59,17],[56,6,56,8],[56,10,56,12],[56,14,56,17],[57,6,57,8],[57,10,57,12],[57,14,57,17],[54,6,54,8],[54,10,54,12],[54,14,54,17],[55,6,55,8],[55,10,55,12],[55,14,55,17],[52,6,52,8],[52,10,52,12],[52,14,52,17],[53,6,53,8],[53,10,53,12],[53,14,53,17],[50,6,50,8],[50,10,50,12],[50,14,50,17],[51,6,51,8],[51,10,51,12],[51,14,51,17],[48,6,48,8],[48,10,48,12],[48,14,48,17],[49,6,49,8],[49,10,49,12],[49,14,49,17],[46,6,46,8],[46,10,46,12],[46,14,46,17],[47,6,47,8],[47,10,47,12],[47,14,47,17],[44,6,44,8],[44,10,44,12],[44,14,44,17],[45,6,45,8],[45,10,45,12],[45,14,45,17],[42,6,42,8],[42,10,42,12],[42,14,42,17],[43,6,43,8],[43,10,43,12],[43,14,43,17],[40,6,40,8],[40,10,40,12],[40,14,40,17],[41,6,41,8],[41,10,41,12],[41,14,41,17],[38,6,38,8],[38,10,38,12],[38,14,38,17],[39,6,39,8],[39,10,39,12],[39,14,39,17],[36,6,36,8],[36,10,36,12],[36,14,36,17],[37,6,37,8],[37,10,37,12],[37,14,37,17],[34,6,34,8],[34,10,34,12],[34,14,34,17],[35,6,35,8],[35,10,35,12],[35,14,35,17],[32,6,32,8],[32,10,32,12],[32,14,32,17],[33,6,33,8],[33,10,33,12],[33,14,33,17],[30,6,30,8],[30,10,30,12],[30,14,30,17],[31,6,31,8],[31,10,31,12],[31,14,31,17],[28,6,28,8],[28,10,28,12],[28,14,28,17],[29,6,29,8],[29,10,29,12],[29,14,29,17],[26,6,26,8],[26,10,26,12],[26,14,26,17],[27,6,27,8],[27,10,27,12],[27,14,27,17],[24,6,24,8],[24,10,24,12],[24,14,24,17],[25,6,25,8],[25,10,25,12],[25,14,25,17],[22,6,22,8],[22,10,22,12],[22,14,22,17],[23,6,23,8],[23,10,23,12],[23,14,23,17],[20,6,20,8],[20,10,20,12],[20,14,20,17],[21,6,21,8],[21,10,21,12],[21,14,21,17],[18,6,18,8],[18,10,18,12],[18,14,18,17],[19,6,19,8],[19,10,19,12],[19,14,19,17],[16,6,16,8],[16,10,16,12],[16,14,16,17],[17,6,17,8],[17,10,17,12],[17,14,17,17],[14,6,14,8],[14,10,14,12],[14,14,14,17],[15,6,15,8],[15,10,15,12],[15,14,15,17],[12,6,12,8],[12,10,12,12],[12,14,12,17],[13,6,13,8],[13,10,13,12],[13,14,13,17],[10,6,10,8],[10,10,10,12],[10,14,10,17],[11,6,11,8],[11,10,11,12],[11,14,11,17],[1,1,1,17],[3,7,3,13],[3,15,5,16],[4,7,4,13],[5,7,5,13],[8,14,9,17],[9,6,9,8],[9,10,9,12],[8,1,9,1],[8,4,9,4],[8,5,9,5],[3,1,3,5],[4,1,4,5],[5,1,5,5]]}
[]
[null,"D A F T A R   N I L A I"]
[]
[null,"MATA PELAJARAN",null,null,null,null,":","MATEMATIKA",null,null,null,null,null,null,null,"↗"]
[null,"KELAS",null,null,null,null,":",{"$f":"UPPER(MN!D22)","v":"VI B"}]
[null,"TAHUN PELAJARAN",null,null,null,null,":",{"$f":"MN!D18","v":"2019 - 2020"}]
[]
[]
[null,"No","No. Induk","NISN","Nama Siswa","MATEMATIKA (TEMA)","NILAI",null,null,null,null,null,null,null,"JUMLAH"]
[null,null,null,null,null,null,"PG",null,null,0.5,"ESSAY",null,null,{"$f":"100%-J10","v":0.5}]
[null,1,null,null,{"$f":"SW!G10","v":"ACHID ATHIRIL ARDAN"},{"$f":"RTM!AQ11","v":43},null,null,null,{"$f":"$J$10*G11","v":0},null,null,null,{"$f":"K11*$N$10","v":0},{"$f":"IFERROR(ROUND(AVERAGE(F11+N11+J11),0),\"\")","v":43}]
[null,2,null,null,{"$f":"SW!G11","v":"ACHMAD SEPTIAN HAMDANI"},{"$f":"RTM!AQ12","v":38},null,null,null,{"$f":"$J$10*G12","v":0},null,null,null,{"$f":"K12*$N$10","v":0},{"$f":"IFERROR(ROUND(AVERAGE(F12+N12+J12),0),\"\")","v":38}]
[null,3,null,null,{"$f":"SW!G12","v":"ACHMAD SULAIMAN"},{"$f":"RTM!AQ13","v":15},null,null,null,0,null,null,null,0,15]
[null,4,null,null,{"$f":"SW!G13","v":"AIRLANGGA DWIKA RIZQI"},{"$f":"RTM!AQ14","v":38},null,null,null,0,null,null,null,0,38]
[null,5,null,null,{"$f":"SW!G14","v":"AUFAN AZKAL ABRORI"},{"$f":"RTM!AQ15","v":47},null,null,null,0,null,null,null,0,47]
[null,6,null,null,{"$f":"SW!G15","v":"AZZA PRISHAL DWI PUTRA"},{"$f":"RTM!AQ16","v":59},null,null,null,0,null,null,null,0,59]
[null,7,null,null,{"$f":"SW!G16","v":"EKA AULIYA` PUTRI"},{"$f":"RTM!AQ17","v":34},null,null,null,0,null,null,null,0,34]
[null,8,null,null,{"$f":"SW!G17","v":"ERSA PUSPITA EKA ROSA LINDA"},{"$f":"RTM!AQ18","v":34},null,null,null,0,null,null,null,0,34]
[null,9,null,null,{"$f":"SW!G18","v":"FABIYAN TRI BAKTI OKTAFIAN"},{"$f":"RTM!AQ19","v":56},null,null,null,0,null,null,null,0,56]
[null,10,null,null,{"$f":"SW!G19","v":"FELISITA APRILIA NUR NIHAYA"},{"$f":"RTM!AQ20","v":29},null,null,null,0,null,null,null,0,29]
[null,11,null,null,{"$f":"SW!G20","v":"FIRDA DWI ANDRIANI"},{"$f":"RTM!AQ21","v":59},null,null,null,0,null,null,null,0,59]
[null,12,null,null,{"$f":"SW!G21","v":"GILANG AKBAR PRASETYO"},{"$f":"RTM!AQ22","v":29},null,null,null,0,null,null,null,0,29]
[null,13,null,null,{"$f":"SW!G22","v":"IFTAH IZZAH EMILIA  MAHMUD"},{"$f":"RTM!AQ23","v":51},null,null,null,0,null,null,null,0,51]
[null,14,null,null,{"$f":"SW!G23","v":"INES ARIFANI MAULINA"},{"$f":"RTM!AQ24","v":47},null,null,null,0,null,null,null,0,47]
[null,15,null,null,{"$f":"SW!G24","v":"IYAAD  AFLAKHA RAMZII"},{"$f":"RTM!AQ25","v":34},null,null,null,0,null,null,null,0,34]
[null,16,null,null,{"$f":"SW!G25","v":"JULI ANDRIYANTO"},{"$f":"RTM!AQ26","v":41},null,null,null,0,null,null,null,0,41]
[null,17,null,null,{"$f":"SW!G26","v":"LIYA FEBRIYANI"},{"$f":"RTM!AQ27","v":66},null,null,null,0,null,null,null,0,66]
[null,18,null,null,{"$f":"SW!G27","v":"LIZATUL CHAIYUNI"},{"$f":"RTM!AQ28","v":50},null,null,null,0,null,null,null,0,50]
[null,19,null,null,{"$f":"SW!G28","v":"M.AL HAFIZ"},{"$f":"RTM!AQ29","v":19},null,null,null,0,null,null,null,0,19]
[null,20,null,null,{"$f":"SW!G29","v":"M. RIZKY RIDWAN"},{"$f":"RTM!AQ30","v":41},null,null,null,0,null,null,null,0,41]
[null,21,null,null,{"$f":"SW!G30","v":"MOCHAMAD RAFLI DIAN SAPUTRA"},{"$f":"RTM!AQ31","v":46},null,null,null,0,null,null,null,0,46]
[null,22,null,null,{"$f":"SW!G31","v":"MOCHAMMAD AFAREL PUTRA RAMDHANA"},{"$f":"RTM!AQ32","v":75},null,null,null,0,null,null,null,0,75]
[null,23,null,null,{"$f":"SW!G32","v":"MUHAMAD JEFRI MAULANA"},{"$f":"RTM!AQ33","v":59},null,null,null,0,null,null,null,0,59]
[null,24,null,null,{"$f":"SW!G33","v":"MUHAMMAD DWI WILDAN BAGUS KURNIAWAN"},{"$f":"RTM!AQ34","v":22},null,null,null,0,null,null,null,0,22]
[null,25,null,null,{"$f":"SW!G34","v":"MUHAMMAD FARIL FIRMANSYA"},{"$f":"RTM!AQ35","v":28},null,null,null,0,null,null,null,0,28]
[null,26,null,null,{"$f":"SW!G35","v":"MUHAMMAD FARIZ UBAIDILLA"},{"$f":"RTM!AQ36","v":69},null,null,null,0,null,null,null,0,69]
[null,27,null,null,{"$f":"SW!G36","v":"MUHAMMAD MAULANA ZIDANIL ILMI"},{"$f":"RTM!AQ37","v":47},null,null,null,0,null,null,null,0,47]
[null,28,null,null,{"$f":"SW!G37","v":"MUHAMMAD SUTRISNO ISMAIL"},{"$f":"RTM!AQ38","v":30},null,null,null,0,null,null,null,0,30]
[null,29,null,null,{"$f":"SW!G38","v":"NOVITA ERNIAWAN"},{"$f":"RTM!AQ39","v":62},null,null,null,0,null,null,null,0,62]
[null,30,null,null,{"$f":"SW!G39","v":"PUTRI AULIA DWI AGUSTIN"},{"$f":"RTM!AQ40","v":33},null,null,null,0,null,null,null,0,33]
[null,31,null,null,{"$f":"SW!G40","v":"STANY RAFIDAH RAHMANIA"},{"$f":"RTM!AQ41","v":34},null,null,null,0,null,null,null,0,34]
[null,32,null,null,{"$f":"SW!G41","v":"USWATUN KHASANAH"},{"$f":"RTM!AQ42","v":25},null,null,null,0,null,null,null,0,25]
[null,33,null,null,{"$f":"SW!G42","v":"VIKROUL KHAMILA"},{"$f":"RTM!AQ43","v":77},null,null,null,0,null,null,null,0,77]
[null,34,null,null,{"$f":"SW!G43","v":0},{"$f":"RTM!AQ44","v":""},null,null,null,0,null,null,null,0,""]
[null,35,null,null,{"$f":"SW!G44","v":0},{"$f":"RTM!AQ45","v":""},null,null,null,0,null,null,null,0,""]
[null,36,null,null,{"$f":"SW!G45","v":0},{"$f":"RTM!AQ46","v":""},null,null,null,0,null,null,null,0,""]
[null,37,null,null,{"$f":"SW!G46","v":0},{"$f":"RTM!AQ47","v":""},null,null,null,0,null,null,null,0,""]
[null,38,null,null,{"$f":"SW!G47","v":0},{"$f":"RTM!AQ48","v":""},null,null,null,0,null,null,null,0,""]
[null,39,null,null,{"$f":"SW!G48","v":0},{"$f":"RTM!AQ49","v":""},null,null,null,0,null,null,null,0,""]
[null,40,null,null,{"$f":"SW!G49","v":0},{"$f":"RTM!AQ50","v":""},null,null,null,0,null,null,null,0,""]
[null,41,null,null,{"$f":"SW!G50","v":0},{"$f":"RTM!AQ51","v":""},null,null,null,0,null,null,null,0,""]
[null,42,null,null,{"$f":"SW!G51","v":0},{"$f":"RTM!AQ52","v":""},null,null,null,0,null,null,null,0,""]
[null,43,null,null,{"$f":"SW!G52","v":0},{"$f":"RTM!AQ53","v":""},null,null,null,0,null,null,null,0,""]
[null,44,null,null,{"$f":"SW!G53","v":0},{"$f":"RTM!AQ54","v":""},null,null,null,0,null,null,null,0,""]
[null,45,null,null,{"$f":"SW!G54","v":0},{"$f":"RTM!AQ55","v":""},null,null,null,0,null,null,null,0,""]
[null,46,null,null,{"$f":"SW!G55","v":0},{"$f":"RTM!AQ56","v":""},null,null,null,0,null,null,null,0,""]
[null,47,null,null,{"$f":"SW!G56","v":0},{"$f":"RTM!AQ57","v":""},null,null,null,0,null,null,null,0,""]
[null,48,null,null,{"$f":"SW!G57","v":0},{"$f":"RTM!AQ58","v":""},null,null,null,0,null,null,null,0,""]
[null,49,null,null,{"$f":"SW!G58","v":0},{"$f":"RTM!AQ59","v":""},null,null,null,0,null,null,null,0,""]
[null,50,null,null,{"$f":"SW!G59","v":0},{"$f":"RTM!AQ60","v":""},null,null,null,0,null,null,null,0,""]
[null,51,null,null,{"$f":"SW!G60","v":0},{"$f":"RTM!AQ61","v":""},null,null,null,0,null,null,null,0,""]
[null,52,null,null,{"$f":"SW!G61","v":0},{"$f":"RTM!AQ62","v":""},null,null,null,0,null,null,null,0,""]
[null,53,null,null,{"$f":"SW!G62","v":0},{"$f":"RTM!AQ63","v":""},null,null,null,0,null,null,null,0,""]
[null,54,null,null,{"$f":"SW!G63","v":0},{"$f":"RTM!AQ64","v":""},null,null,null,0,null,null,null,0,""]
[null,55,null,null,{"$f":"SW!G64","v":0},{"$f":"RTM!AQ65","v":""},null,null,null,0,null,null,null,0,""]
[null,56,null,null,{"$f":"SW!G65","v":0},{"$f":"RTM!AQ66","v":""},null,null,null,0,null,null,null,0,""]
[null,57,null,null,{"$f":"SW!G66","v":0},{"$f":"RTM!AQ67","v":""},null,null,null,0,null,null,null,0,""]
[null,58,null,null,{"$f":"SW!G67","v":0},{"$f":"RTM!AQ68","v":""},null,null,null,0,null,null,null,0,""]
[null,59,null,null,{"$f":"SW!G68","v":0},{"$f":"RTM!AQ69","v":""},null,null,null,0,null,null,null,0,""]
[null,60,null,null,{"$f":"SW!G69","v":0},{"$f":"RTM!AQ70","v":""},null,null,null,0,null,null,null,0,""]
[null,61,null,null,{"$f":"SW!G70","v":0},{"$f":"RTM!AQ71","v":""},null,null,null,0,null,null,null,0,""]
[null,62,null,null,{"$f":"SW!G71","v":0},{"$f":"RTM!AQ72","v":""},null,null,null,0,null,null,null,0,""]
[null,63,null,null,{"$f":"SW!G72","v":0},{"$f":"RTM!AQ73","v":""},null,null,null,0,null,null,null,0,""]
[null,64,null,null,{"$f":"SW!G73","v":0},{"$f":"RTM!AQ74","v":""},null,null,null,0,null,null,null,0,""]
[null,65,null,null,{"$f":"SW!G74","v":0},{"$f":"RTM!AQ75","v":""},null,null,null,0,null,null,null,0,""]
[null,66,null,null,{"$f":"SW!G75","v":0},{"$f":"RTM!AQ76","v":""},null,null,null,{"$f":"$J$10*G76","v":0},null,null,null,{"$f":"K76*$N$10","v":0},{"$f":"IFERROR(ROUND(AVERAGE(F76+N76+J76),0),\"\")","v":""}]
[null,67,null,null,{"$f":"SW!G76","v":0},{"$f":"RTM!AQ77","v":""},null,null,null,0,null,null,null,0,""]
[null,68,null,null,{"$f":"SW!G77","v":0},{"$f":"RTM!AQ78","v":""},null,null,null,0,null,null,null,0,""]
[null,69,null,null,{"$f":"SW!G78","v":0},{"$f":"RTM!AQ79","v":""},null,null,null,0,null,null,null,0,""]
[null,70,null,null,{"$f":"SW!G79","v":0},{"$f":"RTM!AQ80","v":""},null,null,null,0,null,null,null,0,""]
[null,71,null,null,{"$f":"SW!G80","v":0},{"$f":"RTM!AQ81","v":""},null,null,null,0,null,null,null,0,""]
[null,72,null,null,{"$f":"SW!G81","v":0},{"$f":"RTM!AQ82","v":""},null,null,null,0,null,null,null,0,""]
[null,73,null,null,{"$f":"SW!G82","v":0},{"$f":"RTM!AQ83","v":""},null,null,null,0,null,null,null,0,""]
[null,74,null,null,{"$f":"SW!G83","v":0},{"$f":"RTM!AQ84","v":""},null,null,null,0,null,null,null,0,""]
[null,75,null,null,{"$f":"SW!G84","v":0},{"$f":"RTM!AQ85","v":""},null,null,null,0,null,null,null,0,""]
[null,76,null,null,{"$f":"SW!G85","v":0},{"$f":"RTM!AQ86","v":""},null,null,null,0,null,null,null,0,""]
[null,77,null,null,{"$f":"SW!G86","v":0},{"$f":"RTM!AQ87","v":""},null,null,null,0,null,null,null,0,""]
[null,78,null,null,{"$f":"SW!G87","v":0},{"$f":"RTM!AQ88","v":""},null,null,null,0,null,null,null,0,""]
[null,79,null,null,{"$f":"SW!G88","v":0},{"$f":"RTM!AQ89","v":""},null,null,null,0,null,null,null,0,""]
[null,80,null,null,{"$f":"SW!G89","v":0},{"$f":"RTM!AQ90","v":""},null,null,null,0,null,null,null,0,""]
[null,81,null,null,{"$f":"SW!G90","v":0},{"$f":"RTM!AQ91","v":""},null,null,null,0,null,null,null,0,""]
[null,82,null,null,{"$f":"SW!G91","v":0},{"$f":"RTM!AQ92","v":""},null,null,null,0,null,null,null,0,""]
[null,83,null,null,{"$f":"SW!G92","v":0},{"$f":"RTM!AQ93","v":""},null,null,null,0,null,null,null,0,""]
[null,84,null,null,{"$f":"SW!G93","v":0},{"$f":"RTM!AQ94","v":""},null,null,null,0,null,null,null,0,""]
[null,85,null,null,{"$f":"SW!G94","v":0},{"$f":"RTM!AQ95","v":""},null,null,null,0,null,null,null,0,""]
[null,86,null,null,{"$f":"SW!G95","v":0},{"$f":"RTM!AQ96","v":""},null,null,null,0,null,null,null,0,""]
[null,87,null,null,{"$f":"SW!G96","v":0},{"$f":"RTM!AQ97","v":""},null,null,null,0,null,null,null,0,""]
[null,88,null,null,{"$f":"SW!G97","v":0},{"$f":"RTM!AQ98","v":""},null,null,null,0,null,null,null,0,""]
[null,89,null,null,{"$f":"SW!G98","v":0},{"$f":"RTM!AQ99","v":""},null,null,null,0,null,null,null,0,""]

{"sheet":"PJOK","index":8,"n_rows":99,"n_cols":15,"rows_kept":99,"cut":false,"hidden":false,"merged":[[98,5,98,7],[98,9,98,11],[98,13,98,16],[96,5,96,7],[96,9,96,11],[96,13,96,16],[97,5,97,7],[97,9,97,11],[97,13,97,16],[94,5,94,7],[94,9,94,11],[94,13,94,16],[95,5,95,7],[95,9,95,11],[95,13,95,16],[92,5,92,7],[92,9,92,11],[92,13,92,16],[93,5,93,7],[93,9,93,11],[93,13,93,16],[90,5,90,7],[90,9,90,11],[90,13,90,16],[91,5,91,7],[91,9,91,11],[91,13,91,16],[88,5,88,7],[88,9,88,11],[88,13,88,16],[89,5,89,7],[89,9,89,11],[89,13,89,16],[86,5,86,7],[86,9,86,11],[86,13,86,16],[87,5,87,7],[87,9,87,11],[87,13,87,16],[84,5,84,7],[84,9,84,11],[84,13,84,16],[85,5,85,7],[85,9,85,11],[85,13,85,16],[82,5,82,7],[82,9,82,11],[82,13,82,16],[83,5,83,7],[83,9,83,11],[83,13,83,16],[80,5,80,7],[80,9,80,11],[80,13,80,16],[81,5,81,7],[81,9,81,11],[81,13,81,16],[78,5,78,7],[78,9,78,11],[78,13,78,16],[79,5,79,7],[79,9,79,11],[79,13,79,16],[76,5,76,7],[76,9,76,11],[76,13,76,16],[77,5,77,7],[77,9,77,11],[77,13,77,16],[74,5,74,7],[74,9,74,11],[74,13,74,16],[75,5,75,7],[75,9,75,11],[75,13,75,16],[72,5,72,7],[72,9,72,11],[72,13,72,16],[73,5,73,7],[73,9,73,11],[73,13,73,16],[70,5,70,7],[70,9,70,11],[70,13,70,16],[71,5,71,7],[71,9,71,11],[71,13,71,16],[68,5,68,7],[68,9,68,11],[68,13,68,16],[69,5,69,7],[69,9,69,11],[69,13,69,16],[66,5,66,7],[66,9,66,11],[66,13,66,16],[67,5,67,7],[67,9,67,11],[67,13,67,16],[64,5,64,7],[64,9,64,11],[64,13,64,16],[65,5,65,7],[65,9,65,11],[65,13,65,16],[62,5,62,7],[62,9,62,11],[62,13,62,16],[63,5,63,7],[63,9,63,11],[63,13,63,16],[60,5,60,7],[60,9,60,11],[60,13,60,16],[61,5,61,7],[61,9,61,11],[61,13,61,16],[58,5,58,7],[58,9,58,11],[58,13,58,16],[59,5,59,7],[59,9,59,11],[59,13,59,16],[56,5,56,7],[56,9,56,11],[56,13,56,16],[57,5,57,7],[57,9,57,11],[57,13,57,16],[54,5,54,7],[54,9,54,11],[54,13,54,16],[55,5,55,7],[55,9,55,11],[55,13,55,16],[52,5,52,7],[52,9,52,11],[52,13,52,16],[53,5,53,7],[53,9,53,11],[53,13,53,16],[50,5,50,7],[50,9,50,11],[50,13,50,16],[51,5,51,7],[51,9,51,11],[51,13,51,16],[48,5,48,7],[48,9,48,11],[48,13,48,16],[49,5,49,7],[49,9,49,11],[49,13,49,16],[46,5,46,7],[46,9,46,11],[46,13,46,16],[47,5,47,7],[47,9,47,11],[47,13,47,16],[44,5,44,7],[44,9,44,11],[44,13,44,16],[45,5,45,7],[45,9,45,11],[45,13,45,16],[42,5,42,7],[42,9,42,11],[42,13,42,16],[43,5,43,7],[43,9,43,11],[43,13,43,16],[40,5,40,7],[40,9,40,11],[40,13,40,16],[41,5,41,7],[41,9,41,11],[41,13,41,16],[38,5,38,7],[38,9,38,11],[38,13,38,16],[39,5,39,7],[39,9,39,11],[39,13,39,16],[36,5,36,7],[36,9,36,11],[36,13,36,16],[37,5,37,7],[37,9,37,11],[37,13,37,16],[34,5,34,7],[34,9,34,11],[34,13,34,16],[35,5,35,7],[35,9,35,11],[35,13,35,16],[32,5,32,7],[32,9,32,11],[32,13,32,16],[33,5,33,7],[33,9,33,11],[33,13,33,16],[30,5,30,7],[30,9,30,11],[30,13,30,16],[31,5,31,7],[31,9,31,11],[31,13,31,16],[28,5,28,7],[28,9,28,11],[28,13,28,16],[29,5,29,7],[29,9,29,11],[29,13,29,16],[26,5,26,7],[26,9,26,11],[26,13,26,16],[27,5,27,7],[27,9,27,11],[27,13,27,16],[24,5,24,7],[24,9,24,11],[24,13,24,16],[25,5,25,7],[25,9,25,11],[25,13,25,16],[22,5,22,7],[22,9,22,11],[22,13,22,16],[23,5,23,7],[23,9,23,11],[23,13,23,16],[20,5,20,7],[20,9,20,11],[20,13,20,16],[21,5,21,7],[21,9,21,11],[21,13,21,16],[18,5,18,7],[18,9,18,11],[18,13,18,16],[19,5,19,7],[19,9,19,11],[19,13,19,16],[16,5,16,7],[16,9,16,11],[16,13,16,16],[17,5,17,7],[17,9,17,11],[17,13,17,16],[14,5,14,7],[14,9,14,11],[14,13,14,16],[15,5,15,7],[15,9,15,11],[15,13,15,16],[12,5,12,7],[12,9,12,11],[12,13,12,16],[13,5,13,7],[13,9,13,11],[13,13,13,16],[9,9,9,11],[10,5,10,7],[10,9,10,11],[10,13,10,16],[11,5,11,7],[11,9,11,11],[11,13,11,16],[1,1,1,16],[3,6,3,12],[3,14,5,15],[4,6,4,12],[5,6,5,12],[8,1,9,1],[8,4,9,4],[8,5,8,12],[8,13,9,16],[9,5,9,7]]}
[]
[null,"D A F T A R   N I L A I"]
[]
[null,"MATA PELAJARAN",null,null,null,":","Pendidikan Jasmani dan Kesehatan",null,null,null,null,null,null,null,"↗"]
[null,"KELAS",null,null,null,":",{"$f":"UPPER(MN!D22)","v":"VI B"}]
[null,"TAHUN PELAJARAN",null,null,null,":",{"$f":"MN!D18","v":"2019 - 2020"}]
[]
[]
[null,"No","No. Induk","NISN","Nama Siswa","NILAI",null,null,null,null,null,null,null,"JUMLAH"]
[null,null,null,null,null,"PG",null,null,0.5,"ESSAY",null,null,{"$f":"100%-I10","v":0.5}]
[null,1,null,null,{"$f":"SW!G10","v":"ACHID ATHIRIL ARDAN"},27,null,null,{"$f":"$I$10*F11","v":13.5},50,null,null,{"$f":"J11*$M$10","v":25},{"$f":"IFERROR(ROUND(AVERAGE(M11+I11),0),\"\")","v":39}]
[null,2,null,null,{"$f":"SW!G11","v":"ACHMAD SEPTIAN HAMDANI"},67,null,null,{"$f":"$I$10*F12","v":33.5},60,null,null,{"$f":"J12*$M$10","v":30},{"$f":"IFERROR(ROUND(AVERAGE(M12+I12),0),\"\")","v":64}]
[null,3,null,null,{"$f":"SW!G12","v":"ACHMAD SULAIMAN"},33,null,null,16.5,60,null,null,30,47]
[null,4,null,null,{"$f":"SW!G13","v":"AIRLANGGA DWIKA RIZQI"},23,null,null,11.5,35,null,null,17.5,29]
[null,5,null,null,{"$f":"SW!G14","v":"AUFAN AZKAL ABRORI"},50,null,null,25,65,null,null,32.5,58]
[null,6,null,null,{"$f":"SW!G15","v":"AZZA PRISHAL DWI PUTRA"},33,null,null,16.5,75,null,null,37.5,54]
[null,7,null,null,{"$f":"SW!G16","v":"EKA AULIYA` PUTRI"},40,null,null,20,70,null,null,35,55]
[null,8,null,null,{"$f":"SW!G17","v":"ERSA PUSPITA EKA ROSA LINDA"},43,null,null,21.5,60,null,null,30,52]
[null,9,null,null,{"$f":"SW!G18","v":"FABIYAN TRI BAKTI OKTAFIAN"},33,null,null,16.5,90,null,null,45,62]
[null,10,null,null,{"$f":"SW!G19","v":"FELISITA APRILIA NUR NIHAYA"},53,null,null,26.5,60,null,null,30,57]
[null,11,null,null,{"$f":"SW!G20","v":"FIRDA DWI ANDRIANI"},33,null,null,16.5,55,null,null,27.5,44]
[null,12,null,null,{"$f":"SW!G21","v":"GILANG AKBAR PRASETYO"},40,null,null,20,35,null,null,17.5,38]
[null,13,null,null,{"$f":"SW!G22","v":"IFTAH IZZAH EMILIA  MAHMUD"},33,null,null,16.5,70,null,null,35,52]
[null,14,null,null,{"$f":"SW!G23","v":"INES ARIFANI MAULINA"},40,null,null,20,70,null,null,35,55]
[null,15,null,null,{"$f":"SW!G24","v":"IYAAD  AFLAKHA RAMZII"},40,null,null,20,65,null,null,32.5,53]
[null,16,null,null,{"$f":"SW!G25","v":"JULI ANDRIYANTO"},43,null,null,21.5,60,null,null,30,52]
[null,17,null,null,{"$f":"SW!G26","v":"LIYA FEBRIYANI"},43,null,null,21.5,90,null,null,45,67]
[null,18,null,null,{"$f":"SW!G27","v":"LIZATUL CHAIYUNI"},33,null,null,16.5,65,null,null,32.5,49]
[null,19,null,null,{"$f":"SW!G28","v":"M.AL HAFIZ"},40,null,null,20,60,null,null,30,50]
[null,20,null,null,{"$f":"SW!G29","v":"M. RIZKY RIDWAN"},60,null,null,30,70,null,null,35,65]
[null,21,null,null,{"$f":"SW!G30","v":"MOCHAMAD RAFLI DIAN SAPUTRA"},67,null,null,33.5,70,null,null,35,69]
[null,22,null,null,{"$f":"SW!G31","v":"MOCHAMMAD AFAREL PUTRA RAMDHANA"},47,null,null,23.5,65,null,null,32.5,56]
[null,23,null,null,{"$f":"SW!G32","v":"MUHAMAD JEFRI MAULANA"},50,null,null,25,90,null,null,45,70]
[null,24,null,null,{"$f":"SW!G33","v":"MUHAMMAD DWI WILDAN BAGUS KURNIAWAN"},27,null,null,13.5,50,null,null,25,39]
[null,25,null,null,{"$f":"SW!G34","v":"MUHAMMAD FARIL FIRMANSYA"},27,null,null,13.5,55,null,null,27.5,41]
[null,26,null,null,{"$f":"SW!G35","v":"MUHAMMAD FARIZ UBAIDILLA"},53,null,null,26.5,70,null,null,35,62]
[null,27,null,null,{"$f":"SW!G36","v":"MUHAMMAD MAULANA ZIDANIL ILMI"},47,null,null,23.5,70,null,null,35,59]
[null,28,null,null,{"$f":"SW!G37","v":"MUHAMMAD SUTRISNO ISMAIL"},30,null,null,15,25,null,null,12.5,28]
[null,29,null,null,{"$f":"SW!G38","v":"NOVITA ERNIAWAN"},53,null,null,26.5,60,null,null,30,57]
[null,30,null,null,{"$f":"SW!G39","v":"PUTRI AULIA DWI AGUSTIN"},47,null,null,23.5,75,null,null,37.5,61]
[null,31,null,null,{"$f":"SW!G40","v":"STANY RAFIDAH RAHMANIA"},30,null,null,15,70,null,null,35,50]
[null,32,null,null,{"$f":"SW!G41","v":"USWATUN KHASANAH"},33,null,null,16.5,65,null,null,32.5,49]
[null,33,null,null,{"$f":"SW!G42","v":"VIKROUL KHAMILA"},30,null,null,15,50,null,null,25,40]
[null,34,null,null,{"$f":"SW!G43","v":0},null,null,null,0,null,null,null,0,0]
[null,35,null,null,{"$f":"SW!G44","v":0},null,null,null,0,null,null,null,0,0]
[null,36,null,null,{"$f":"SW!G45","v":0},null,null,null,0,null,null,null,0,0]
[null,37,null,null,{"$f":"SW!G46","v":0},null,null,null,0,null,null,null,0,0]
[null,38,null,null,{"$f":"SW!G47","v":0},null,null,null,0,null,null,null,0,0]
[null,39,null,null,{"$f":"SW!G48","v":0},null,null,null,0,null,null,null,0,0]
[null,40,null,null,{"$f":"SW!G49","v":0},null,null,null,0,null,null,null,0,0]
[null,41,null,null,{"$f":"SW!G50","v":0},null,null,null,0,null,null,null,0,0]
[null,42,null,null,{"$f":"SW!G51","v":0},null,null,null,0,null,null,null,0,0]
[null,43,null,null,{"$f":"SW!G52","v":0},null,null,null,0,null,null,null,0,0]
[null,44,null,null,{"$f":"SW!G53","v":0},null,null,null,0,null,null,null,0,0]
[null,45,null,null,{"$f":"SW!G54","v":0},null,null,null,0,null,null,null,0,0]
[null,46,null,null,{"$f":"SW!G55","v":0},null,null,null,0,null,null,null,0,0]
[null,47,null,null,{"$f":"SW!G56","v":0},null,null,null,0,null,null,null,0,0]
[null,48,null,null,{"$f":"SW!G57","v":0},null,null,null,0,null,null,null,0,0]
[null,49,null,null,{"$f":"SW!G58","v":0},null,null,null,0,null,null,null,0,0]
[null,50,null,null,{"$f":"SW!G59","v":0},null,null,null,0,null,null,null,0,0]
[null,51,null,null,{"$f":"SW!G60","v":0},null,null,null,0,null,null,null,0,0]
[null,52,null,null,{"$f":"SW!G61","v":0},null,null,null,0,null,null,null,0,0]
[null,53,null,null,{"$f":"SW!G62","v":0},null,null,null,0,null,null,null,0,0]
[null,54,null,null,{"$f":"SW!G63","v":0},null,null,null,0,null,null,null,0,0]
[null,55,null,null,{"$f":"SW!G64","v":0},null,null,null,0,null,null,null,0,0]
[null,56,null,null,{"$f":"SW!G65","v":0},null,null,null,0,null,null,null,0,0]
[null,57,null,null,{"$f":"SW!G66","v":0},null,null,null,0,null,null,null,0,0]
[null,58,null,null,{"$f":"SW!G67","v":0},null,null,null,0,null,null,null,0,0]
[null,59,null,null,{"$f":"SW!G68","v":0},null,null,null,0,null,null,null,0,0]
[null,60,null,null,{"$f":"SW!G69","v":0},null,null,null,0,null,null,null,0,0]
[null,61,null,null,{"$f":"SW!G70","v":0},null,null,null,0,null,null,null,0,0]
[null,62,null,null,{"$f":"SW!G71","v":0},null,null,null,0,null,null,null,0,0]
[null,63,null,null,{"$f":"SW!G72","v":0},null,null,null,0,null,null,null,0,0]
[null,64,null,null,{"$f":"SW!G73","v":0},null,null,null,0,null,null,null,0,0]
[null,65,null,null,{"$f":"SW!G74","v":0},null,null,null,0,null,null,null,0,0]
[null,66,null,null,{"$f":"SW!G75","v":0},null,null,null,{"$f":"$I$10*F76","v":0},null,null,null,{"$f":"J76*$M$10","v":0},{"$f":"IFERROR(ROUND(AVERAGE(M76+I76),0),\"\")","v":0}]
[null,67,null,null,{"$f":"SW!G76","v":0},null,null,null,0,null,null,null,0,0]
[null,68,null,null,{"$f":"SW!G77","v":0},null,null,null,0,null,null,null,0,0]
[null,69,null,null,{"$f":"SW!G78","v":0},null,null,null,0,null,null,null,0,0]
[null,70,null,null,{"$f":"SW!G79","v":0},null,null,null,0,null,null,null,0,0]
[null,71,null,null,{"$f":"SW!G80","v":0},null,null,null,0,null,null,null,0,0]
[null,72,null,null,{"$f":"SW!G81","v":0},null,null,null,0,null,null,null,0,0]
[null,73,null,null,{"$f":"SW!G82","v":0},null,null,null,0,null,null,null,0,0]
[null,74,null,null,{"$f":"SW!G83","v":0},null,null,null,0,null,null,null,0,0]
[null,75,null,null,{"$f":"SW!G84","v":0},null,null,null,0,null,null,null,0,0]
[null,76,null,null,{"$f":"SW!G85","v":0},null,null,null,0,null,null,null,0,0]
[null,77,null,null,{"$f":"SW!G86","v":0},null,null,null,0,null,null,null,0,0]
[null,78,null,null,{"$f":"SW!G87","v":0},null,null,null,0,null,null,null,0,0]
[null,79,null,null,{"$f":"SW!G88","v":0},null,null,null,0,null,null,null,0,0]
[null,80,null,null,{"$f":"SW!G89","v":0},null,null,null,0,null,null,null,0,0]
[null,81,null,null,{"$f":"SW!G90","v":0},null,null,null,0,null,null,null,0,0]
[null,82,null,null,{"$f":"SW!G91","v":0},null,null,null,0,null,null,null,0,0]
[null,83,null,null,{"$f":"SW!G92","v":0},null,null,null,0,null,null,null,0,0]
[null,84,null,null,{"$f":"SW!G93","v":0},null,null,null,0,null,null,null,0,0]
[null,85,null,null,{"$f":"SW!G94","v":0},null,null,null,0,null,null,null,0,0]
[null,86,null,null,{"$f":"SW!G95","v":0},null,null,null,0,null,null,null,0,0]
[null,87,null,null,{"$f":"SW!G96","v":0},null,null,null,0,null,null,null,0,0]
[null,88,null,null,{"$f":"SW!G97","v":0},null,null,null,0,null,null,null,0,0]
[null,89,null,null,{"$f":"SW!G98","v":0},null,null,null,0,null,null,null,0,0]

{"sheet":"BD","index":9,"n_rows":99,"n_cols":15,"rows_kept":99,"cut":false,"hidden":false,"merged":[[98,5,98,7],[98,9,98,11],[98,13,98,16],[96,5,96,7],[96,9,96,11],[96,13,96,16],[97,5,97,7],[97,9,97,11],[97,13,97,16],[94,5,94,7],[94,9,94,11],[94,13,94,16],[95,5,95,7],[95,9,95,11],[95,13,95,16],[92,5,92,7],[92,9,92,11],[92,13,92,16],[93,5,93,7],[93,9,93,11],[93,13,93,16],[90,5,90,7],[90,9,90,11],[90,13,90,16],[91,5,91,7],[91,9,91,11],[91,13,91,16],[88,5,88,7],[88,9,88,11],[88,13,88,16],[89,5,89,7],[89,9,89,11],[89,13,89,16],[86,5,86,7],[86,9,86,11],[86,13,86,16],[87,5,87,7],[87,9,87,11],[87,13,87,16],[84,5,84,7],[84,9,84,11],[84,13,84,16],[85,5,85,7],[85,9,85,11],[85,13,85,16],[82,5,82,7],[82,9,82,11],[82,13,82,16],[83,5,83,7],[83,9,83,11],[83,13,83,16],[80,5,80,7],[80,9,80,11],[80,13,80,16],[81,5,81,7],[81,9,81,11],[81,13,81,16],[78,5,78,7],[78,9,78,11],[78,13,78,16],[79,5,79,7],[79,9,79,11],[79,13,79,16],[76,5,76,7],[76,9,76,11],[76,13,76,16],[77,5,77,7],[77,9,77,11],[77,13,77,16],[74,5,74,7],[74,9,74,11],[74,13,74,16],[75,5,75,7],[75,9,75,11],[75,13,75,16],[72,5,72,7],[72,9,72,11],[72,13,72,16],[73,5,73,7],[73,9,73,11],[73,13,73,16],[70,5,70,7],[70,9,70,11],[70,13,70,16],[71,5,71,7],[71,9,71,11],[71,13,71,16],[68,5,68,7],[68,9,68,11],[68,13,68,16],[69,5,69,7],[69,9,69,11],[69,13,69,16],[66,5,66,7],[66,9,66,11],[66,13,66,16],[67,5,67,7],[67,9,67,11],[67,13,67,16],[64,5,64,7],[64,9,64,11],[64,13,64,16],[65,5,65,7],[65,9,65,11],[65,13,65,16],[62,5,62,7],[62,9,62,11],[62,13,62,16],[63,5,63,7],[63,9,63,11],[63,13,63,16],[60,5,60,7],[60,9,60,11],[60,13,60,16],[61,5,61,7],[61,9,61,11],[61,13,61,16],[58,5,58,7],[58,9,58,11],[58,13,58,16],[59,5,59,7],[59,9,59,11],[59,13,59,16],[56,5,56,7],[56,9,56,11],[56,13,56,16],[57,5,57,7],[57,9,57,11],[57,13,57,16],[54,5,54,7],[54,9,54,11],[54,13,54,16],[55,5,55,7],[55,9,55,11],[55,13,55,16],[52,5,52,7],[52,9,52,11],[52,13,52,16],[53,5,53,7],[53,9,53,11],[53,13,53,16],[50,5,50,7],[50,9,50,11],[50,13,50,16],[51,5,51,7],[51,9,51,11],[51,13,51,16],[48,5,48,7],[48,9,48,11],[48,13,48,16],[49,5,49,7],[49,9,49,11],[49,13,49,16],[46,5,46,7],[46,9,46,11],[46,13,46,16],[47,5,47,7],[47,9,47,11],[47,13,47,16],[44,5,44,7],[44,9,44,11],[44,13,44,16],[45,5,45,7],[45,9,45,11],[45,13,45,16],[42,5,42,7],[42,9,42,11],[42,13,42,16],[43,5,43,7],[43,9,43,11],[43,13,43,16],[40,5,40,7],[40,9,40,11],[40,13,40,16],[41,5,41,7],[41,9,41,11],[41,13,41,16],[38,5,38,7],[38,9,38,11],[38,13,38,16],[39,5,39,7],[39,9,39,11],[39,13,39,16],[36,5,36,7],[36,9,36,11],[36,13,36,16],[37,5,37,7],[37,9,37,11],[37,13,37,16],[34,5,34,7],[34,9,34,11],[34,13,34,16],[35,5,35,7],[35,9,35,11],[35,13,35,16],[32,5,32,7],[32,9,32,11],[32,13,32,16],[33,5,33,7],[33,9,33,11],[33,13,33,16],[30,5,30,7],[30,9,30,11],[30,13,30,16],[31,5,31,7],[31,9,31,11],[31,13,31,16],[28,5,28,7],[28,9,28,11],[28,13,28,16],[29,5,29,7],[29,9,29,11],[29,13,29,16],[26,5,26,7],[26,9,26,11],[26,13,26,16],[27,5,27,7],[27,9,27,11],[27,13,27,16],[24,5,24,7],[24,9,24,11],[24,13,24,16],[25,5,25,7],[25,9,25,11],[25,13,25,16],[22,5,22,7],[22,9,22,11],[22,13,22,16],[23,5,23,7],[23,9,23,11],[23,13,23,16],[20,5,20,7],[20,9,20,11],[20,13,20,16],[21,5,21,7],[21,9,21,11],[21,13,21,16],[18,5,18,7],[18,9,18,11],[18,13,18,16],[19,5,19,7],[19,9,19,11],[19,13,19,16],[16,5,16,7],[16,9,16,11],[16,13,16,16],[17,5,17,7],[17,9,17,11],[17,13,17,16],[14,5,14,7],[14,9,14,11],[14,13,14,16],[15,5,15,7],[15,9,15,11],[15,13,15,16],[12,5,12,7],[12,9,12,11],[12,13,12,16],[13,5,13,7],[13,9,13,11],[13,13,13,16],[9,9,9,11],[10,5,10,7],[10,9,10,11],[10,13,10,16],[11,5,11,7],[11,9,11,11],[11,13,11,16],[1,1,1,16],[3,6,3,12],[3,14,5,15],[4,6,4,12],[5,6,5,12],[8,1,9,1],[8,4,9,4],[8,5,8,12],[8,13,9,16],[9,5,9,7]]}
[]
[null,"D A F T A R   N I L A I"]
[]
[null,"MATA PELAJARAN",null,null,null,":","Bahasa Daerah",null,null,null,null,null,null,null,"↗"]
[null,"KELAS",null,null,null,":",{"$f":"UPPER(MN!D22)","v":"VI B"}]
[null,"TAHUN PELAJARAN",null,null,null,":",{"$f":"MN!D18","v":"2019 - 2020"}]
[]
[]
[null,"No","No. Induk","NISN","Nama Siswa","NILAI",null,null,null,null,null,null,null,"JUMLAH"]
[null,null,null,null,null,"PG",null,null,1,"ESSAY",null,null,{"$f":"100%-I10","v":0}]
[null,1,null,null,{"$f":"SW!G10","v":"ACHID ATHIRIL ARDAN"},47,null,null,{"$f":"$I$10*F11","v":47},null,null,null,{"$f":"J11*$M$10","v":0},{"$f":"IFERROR(ROUND(AVERAGE(M11+I11),0),\"\")","v":47}]
[null,2,null,null,{"$f":"SW!G11","v":"ACHMAD SEPTIAN HAMDANI"},69,null,null,{"$f":"$I$10*F12","v":69},null,null,null,{"$f":"J12*$M$10","v":0},{"$f":"IFERROR(ROUND(AVERAGE(M12+I12),0),\"\")","v":69}]
[null,3,null,null,{"$f":"SW!G12","v":"ACHMAD SULAIMAN"},41,null,null,41,null,null,null,0,41]
[null,4,null,null,{"$f":"SW!G13","v":"AIRLANGGA DWIKA RIZQI"},23,null,null,23,null,null,null,0,23]
[null,5,null,null,{"$f":"SW!G14","v":"AUFAN AZKAL ABRORI"},25,null,null,25,null,null,null,0,25]
[null,6,null,null,{"$f":"SW!G15","v":"AZZA PRISHAL DWI PUTRA"},45,null,null,45,null,null,null,0,45]
[null,7,null,null,{"$f":"SW!G16","v":"EKA AULIYA` PUTRI"},74,null,null,74,null,null,null,0,74]
[null,8,null,null,{"$f":"SW!G17","v":"ERSA PUSPITA EKA ROSA LINDA"},66,null,null,66,null,null,null,0,66]
[null,9,null,null,{"$f":"SW!G18","v":"FABIYAN TRI BAKTI OKTAFIAN"},59,null,null,59,null,null,null,0,59]
[null,10,null,null,{"$f":"SW!G19","v":"FELISITA APRILIA NUR NIHAYA"},58,null,null,58,null,null,null,0,58]
[null,11,null,null,{"$f":"SW!G20","v":"FIRDA DWI ANDRIANI"},33,null,null,33,null,null,null,0,33]
[null,12,null,null,{"$f":"SW!G21","v":"GILANG AKBAR PRASETYO"},25,null,null,25,null,null,null,0,25]
[null,13,null,null,{"$f":"SW!G22","v":"IFTAH IZZAH EMILIA  MAHMUD"},38,null,null,38,null,null,null,0,38]
[null,14,null,null,{"$f":"SW!G23","v":"INES ARIFANI MAULINA"},70,null,null,70,null,null,null,0,70]
[null,15,null,null,{"$f":"SW!G24","v":"IYAAD  AFLAKHA RAMZII"},26,null,null,26,null,null,null,0,26]
[null,16,null,null,{"$f":"SW!G25","v":"JULI ANDRIYANTO"},23,null,null,23,null,null,null,0,23]
[null,17,null,null,{"$f":"SW!G26","v":"LIYA FEBRIYANI"},76,null,null,76,null,null,null,0,76]
[null,18,null,null,{"$f":"SW!G27","v":"LIZATUL CHAIYUNI"},70,null,null,70,null,null,null,0,70]
[null,19,null,null,{"$f":"SW!G28","v":"M.AL HAFIZ"},44,null,null,44,null,null,null,0,44]
[null,20,null,null,{"$f":"SW!G29","v":"M. RIZKY RIDWAN"},28,null,null,28,null,null,null,0,28]
[null,21,null,null,{"$f":"SW!G30","v":"MOCHAMAD RAFLI DIAN SAPUTRA"},13,null,null,13,null,null,null,0,13]
[null,22,null,null,{"$f":"SW!G31","v":"MOCHAMMAD AFAREL PUTRA RAMDHANA"},55,null,null,55,null,null,null,0,55]
[null,23,null,null,{"$f":"SW!G32","v":"MUHAMAD JEFRI MAULANA"},66,null,null,66,null,null,null,0,66]
[null,24,null,null,{"$f":"SW!G33","v":"MUHAMMAD DWI WILDAN BAGUS KURNIAWAN"},56,null,null,56,null,null,null,0,56]
[null,25,null,null,{"$f":"SW!G34","v":"MUHAMMAD FARIL FIRMANSYA"},44,null,null,44,null,null,null,0,44]
[null,26,null,null,{"$f":"SW!G35","v":"MUHAMMAD FARIZ UBAIDILLA"},55,null,null,55,null,null,null,0,55]
[null,27,null,null,{"$f":"SW!G36","v":"MUHAMMAD MAULANA ZIDANIL ILMI"},58,null,null,58,null,null,null,0,58]
[null,28,null,null,{"$f":"SW!G37","v":"MUHAMMAD SUTRISNO ISMAIL"},38,null,null,38,null,null,null,0,38]
[null,29,null,null,{"$f":"SW!G38","v":"NOVITA ERNIAWAN"},77,null,null,77,null,null,null,0,77]
[null,30,null,null,{"$f":"SW!G39","v":"PUTRI AULIA DWI AGUSTIN"},69,null,null,69,null,null,null,0,69]
[null,31,null,null,{"$f":"SW!G40","v":"STANY RAFIDAH RAHMANIA"},21,null,null,21,null,null,null,0,21]
[null,32,null,null,{"$f":"SW!G41","v":"USWATUN KHASANAH"},48,null,null,48,null,null,null,0,48]
[null,33,null,null,{"$f":"SW!G42","v":"VIKROUL KHAMILA"},48,null,null,48,null,null,null,0,48]
[null,34,null,null,{"$f":"SW!G43","v":0},null,null,null,0,null,null,null,0,0]
[null,35,null,null,{"$f":"SW!G44","v":0},null,null,null,0,null,null,null,0,0]
[null,36,null,null,{"$f":"SW!G45","v":0},null,null,null,0,null,null,null,0,0]
[null,37,null,null,{"$f":"SW!G46","v":0},null,null,null,0,null,null,null,0,0]
[null,38,null,null,{"$f":"SW!G47","v":0},null,null,null,0,null,null,null,0,0]
[null,39,null,null,{"$f":"SW!G48","v":0},null,null,null,0,null,null,null,0,0]
[null,40,null,null,{"$f":"SW!G49","v":0},null,null,null,0,null,null,null,0,0]
[null,41,null,null,{"$f":"SW!G50","v":0},null,null,null,0,null,null,null,0,0]
[null,42,null,null,{"$f":"SW!G51","v":0},null,null,null,0,null,null,null,0,0]
[null,43,null,null,{"$f":"SW!G52","v":0},null,null,null,0,null,null,null,0,0]
[null,44,null,null,{"$f":"SW!G53","v":0},null,null,null,0,null,null,null,0,0]
[null,45,null,null,{"$f":"SW!G54","v":0},null,null,null,0,null,null,null,0,0]
[null,46,null,null,{"$f":"SW!G55","v":0},null,null,null,0,null,null,null,0,0]
[null,47,null,null,{"$f":"SW!G56","v":0},null,null,null,0,null,null,null,0,0]
[null,48,null,null,{"$f":"SW!G57","v":0},null,null,null,0,null,null,null,0,0]
[null,49,null,null,{"$f":"SW!G58","v":0},null,null,null,0,null,null,null,0,0]
[null,50,null,null,{"$f":"SW!G59","v":0},null,null,null,0,null,null,null,0,0]
[null,51,null,null,{"$f":"SW!G60","v":0},null,null,null,0,null,null,null,0,0]
[null,52,null,null,{"$f":"SW!G61","v":0},null,null,null,0,null,null,null,0,0]
[null,53,null,null,{"$f":"SW!G62","v":0},null,null,null,0,null,null,null,0,0]
[null,54,null,null,{"$f":"SW!G63","v":0},null,null,null,0,null,null,null,0,0]
[null,55,null,null,{"$f":"SW!G64","v":0},null,null,null,0,null,null,null,0,0]
[null,56,null,null,{"$f":"SW!G65","v":0},null,null,null,0,null,null,null,0,0]
[null,57,null,null,{"$f":"SW!G66","v":0},null,null,null,0,null,null,null,0,0]
[null,58,null,null,{"$f":"SW!G67","v":0},null,null,null,0,null,null,null,0,0]
[null,59,null,null,{"$f":"SW!G68","v":0},null,null,null,0,null,null,null,0,0]
[null,60,null,null,{"$f":"SW!G69","v":0},null,null,null,0,null,null,null,0,0]
[null,61,null,null,{"$f":"SW!G70","v":0},null,null,null,0,null,null,null,0,0]
[null,62,null,null,{"$f":"SW!G71","v":0},null,null,null,0,null,null,null,0,0]
[null,63,null,null,{"$f":"SW!G72","v":0},null,null,null,0,null,null,null,0,0]
[null,64,null,null,{"$f":"SW!G73","v":0},null,null,null,0,null,null,null,0,0]
[null,65,null,null,{"$f":"SW!G74","v":0},null,null,null,0,null,null,null,0,0]
[null,66,null,null,{"$f":"SW!G75","v":0},null,null,null,{"$f":"$I$10*F76","v":0},null,null,null,{"$f":"J76*$M$10","v":0},{"$f":"IFERROR(ROUND(AVERAGE(M76+I76),0),\"\")","v":0}]
[null,67,null,null,{"$f":"SW!G76","v":0},null,null,null,0,null,null,null,0,0]
[null,68,null,null,{"$f":"SW!G77","v":0},null,null,null,0,null,null,null,0,0]
[null,69,null,null,{"$f":"SW!G78","v":0},null,null,null,0,null,null,null,0,0]
[null,70,null,null,{"$f":"SW!G79","v":0},null,null,null,0,null,null,null,0,0]
[null,71,null,null,{"$f":"SW!G80","v":0},null,null,null,0,null,null,null,0,0]
[null,72,null,null,{"$f":"SW!G81","v":0},null,null,null,0,null,null,null,0,0]
[null,73,null,null,{"$f":"SW!G82","v":0},null,null,null,0,null,null,null,0,0]
[null,74,null,null,{"$f":"SW!G83","v":0},null,null,null,0,null,null,null,0,0]
[null,75,null,null,{"$f":"SW!G84","v":0},null,null,null,0,null,null,null,0,0]
[null,76,null,null,{"$f":"SW!G85","v":0},null,null,null,0,null,null,null,0,0]
[null,77,null,null,{"$f":"SW!G86","v":0},null,null,null,0,null,null,null,0,0]
[null,78,null,null,{"$f":"SW!G87","v":0},null,null,null,0,null,null,null,0,0]
[null,79,null,null,{"$f":"SW!G88","v":0},null,null,null,0,null,null,null,0,0]
[null,80,null,null,{"$f":"SW!G89","v":0},null,null,null,0,null,null,null,0,0]
[null,81,null,null,{"$f":"SW!G90","v":0},null,null,null,0,null,null,null,0,0]
[null,82,null,null,{"$f":"SW!G91","v":0},null,null,null,0,null,null,null,0,0]
[null,83,null,null,{"$f":"SW!G92","v":0},null,null,null,0,null,null,null,0,0]
[null,84,null,null,{"$f":"SW!G93","v":0},null,null,null,0,null,null,null,0,0]
[null,85,null,null,{"$f":"SW!G94","v":0},null,null,null,0,null,null,null,0,0]
[null,86,null,null,{"$f":"SW!G95","v":0},null,null,null,0,null,null,null,0,0]
[null,87,null,null,{"$f":"SW!G96","v":0},null,null,null,0,null,null,null,0,0]
[null,88,null,null,{"$f":"SW!G97","v":0},null,null,null,0,null,null,null,0,0]
[null,89,null,null,{"$f":"SW!G98","v":0},null,null,null,0,null,null,null,0,0]

{"sheet":"BIG","index":10,"n_rows":99,"n_cols":15,"rows_kept":99,"cut":false,"hidden":false,"merged":[[98,5,98,7],[98,9,98,11],[98,13,98,16],[96,5,96,7],[96,9,96,11],[96,13,96,16],[97,5,97,7],[97,9,97,11],[97,13,97,16],[94,5,94,7],[94,9,94,11],[94,13,94,16],[95,5,95,7],[95,9,95,11],[95,13,95,16],[92,5,92,7],[92,9,92,11],[92,13,92,16],[93,5,93,7],[93,9,93,11],[93,13,93,16],[90,5,90,7],[90,9,90,11],[90,13,90,16],[91,5,91,7],[91,9,91,11],[91,13,91,16],[88,5,88,7],[88,9,88,11],[88,13,88,16],[89,5,89,7],[89,9,89,11],[89,13,89,16],[86,5,86,7],[86,9,86,11],[86,13,86,16],[87,5,87,7],[87,9,87,11],[87,13,87,16],[84,5,84,7],[84,9,84,11],[84,13,84,16],[85,5,85,7],[85,9,85,11],[85,13,85,16],[82,5,82,7],[82,9,82,11],[82,13,82,16],[83,5,83,7],[83,9,83,11],[83,13,83,16],[80,5,80,7],[80,9,80,11],[80,13,80,16],[81,5,81,7],[81,9,81,11],[81,13,81,16],[78,5,78,7],[78,9,78,11],[78,13,78,16],[79,5,79,7],[79,9,79,11],[79,13,79,16],[76,5,76,7],[76,9,76,11],[76,13,76,16],[77,5,77,7],[77,9,77,11],[77,13,77,16],[74,5,74,7],[74,9,74,11],[74,13,74,16],[75,5,75,7],[75,9,75,11],[75,13,75,16],[72,5,72,7],[72,9,72,11],[72,13,72,16],[73,5,73,7],[73,9,73,11],[73,13,73,16],[70,5,70,7],[70,9,70,11],[70,13,70,16],[71,5,71,7],[71,9,71,11],[71,13,71,16],[68,5,68,7],[68,9,68,11],[68,13,68,16],[69,5,69,7],[69,9,69,11],[69,13,69,16],[66,5,66,7],[66,9,66,11],[66,13,66,16],[67,5,67,7],[67,9,67,11],[67,13,67,16],[64,5,64,7],[64,9,64,11],[64,13,64,16],[65,5,65,7],[65,9,65,11],[65,13,65,16],[62,5,62,7],[62,9,62,11],[62,13,62,16],[63,5,63,7],[63,9,63,11],[63,13,63,16],[60,5,60,7],[60,9,60,11],[60,13,60,16],[61,5,61,7],[61,9,61,11],[61,13,61,16],[58,5,58,7],[58,9,58,11],[58,13,58,16],[59,5,59,7],[59,9,59,11],[59,13,59,16],[56,5,56,7],[56,9,56,11],[56,13,56,16],[57,5,57,7],[57,9,57,11],[57,13,57,16],[54,5,54,7],[54,9,54,11],[54,13,54,16],[55,5,55,7],[55,9,55,11],[55,13,55,16],[52,5,52,7],[52,9,52,11],[52,13,52,16],[53,5,53,7],[53,9,53,11],[53,13,53,16],[50,5,50,7],[50,9,50,11],[50,13,50,16],[51,5,51,7],[51,9,51,11],[51,13,51,16],[48,5,48,7],[48,9,48,11],[48,13,48,16],[49,5,49,7],[49,9,49,11],[49,13,49,16],[46,5,46,7],[46,9,46,11],[46,13,46,16],[47,5,47,7],[47,9,47,11],[47,13,47,16],[44,5,44,7],[44,9,44,11],[44,13,44,16],[45,5,45,7],[45,9,45,11],[45,13,45,16],[42,5,42,7],[42,9,42,11],[42,13,42,16],[43,5,43,7],[43,9,43,11],[43,13,43,16],[40,5,40,7],[40,9,40,11],[40,13,40,16],[41,5,41,7],[41,9,41,11],[41,13,41,16],[38,5,38,7],[38,9,38,11],[38,13,38,16],[39,5,39,7],[39,9,39,11],[39,13,39,16],[36,5,36,7],[36,9,36,11],[36,13,36,16],[37,5,37,7],[37,9,37,11],[37,13,37,16],[34,5,34,7],[34,9,34,11],[34,13,34,16],[35,5,35,7],[35,9,35,11],[35,13,35,16],[32,5,32,7],[32,9,32,11],[32,13,32,16],[33,5,33,7],[33,9,33,11],[33,13,33,16],[30,5,30,7],[30,9,30,11],[30,13,30,16],[31,5,31,7],[31,9,31,11],[31,13,31,16],[28,5,28,7],[28,9,28,11],[28,13,28,16],[29,5,29,7],[29,9,29,11],[29,13,29,16],[26,5,26,7],[26,9,26,11],[26,13,26,16],[27,5,27,7],[27,9,27,11],[27,13,27,16],[24,5,24,7],[24,9,24,11],[24,13,24,16],[25,5,25,7],[25,9,25,11],[25,13,25,16],[22,5,22,7],[22,9,22,11],[22,13,22,16],[23,5,23,7],[23,9,23,11],[23,13,23,16],[20,5,20,7],[20,9,20,11],[20,13,20,16],[21,5,21,7],[21,9,21,11],[21,13,21,16],[18,5,18,7],[18,9,18,11],[18,13,18,16],[19,5,19,7],[19,9,19,11],[19,13,19,16],[16,5,16,7],[16,9,16,11],[16,13,16,16],[17,5,17,7],[17,9,17,11],[17,13,17,16],[14,5,14,7],[14,9,14,11],[14,13,14,16],[15,5,15,7],[15,9,15,11],[15,13,15,16],[12,5,12,7],[12,9,12,11],[12,13,12,16],[13,5,13,7],[13,9,13,11],[13,13,13,16],[9,9,9,11],[10,5,10,7],[10,9,10,11],[10,13,10,16],[11,5,11,7],[11,9,11,11],[11,13,11,16],[1,1,1,16],[3,6,3,12],[3,14,5,15],[4,6,4,12],[5,6,5,12],[8,1,9,1],[8,4,9,4],[8,5,8,12],[8,13,9,16],[9,5,9,7]]}
[]
[null,"D A F T A R   N I L A I"]
[]
[null,"MATA PELAJARAN",null,null,null,":","Bahasa Inggris",null,null,null,null,null,null,null,"↗"]
[null,"KELAS",null,null,null,":",{"$f":"UPPER(MN!D22)","v":"VI B"}]
[null,"TAHUN PELAJARAN",null,null,null,":",{"$f":"MN!D18","v":"2019 - 2020"}]
[]
[]
[null,"No","No. Induk","NISN","Nama Siswa","NILAI",null,null,null,null,null,null,null,"JUMLAH"]
[null,null,null,null,null,"PG",null,null,1,"ESSAY",null,null,{"$f":"100%-I10","v":0}]
[null,1,null,null,{"$f":"SW!G10","v":"ACHID ATHIRIL ARDAN"},50,null,null,{"$f":"$I$10*F11","v":50},null,null,null,{"$f":"J11*$M$10","v":0},{"$f":"IFERROR(ROUND(AVERAGE(M11+I11),0),\"\")","v":50}]
[null,2,null,null,{"$f":"SW!G11","v":"ACHMAD SEPTIAN HAMDANI"},83,null,null,{"$f":"$I$10*F12","v":83},null,null,null,{"$f":"J12*$M$10","v":0},{"$f":"IFERROR(ROUND(AVERAGE(M12+I12),0),\"\")","v":83}]
[null,3,null,null,{"$f":"SW!G12","v":"ACHMAD SULAIMAN"},25,null,null,25,null,null,null,0,25]
[null,4,null,null,{"$f":"SW!G13","v":"AIRLANGGA DWIKA RIZQI"},88,null,null,88,null,null,null,0,88]
[null,5,null,null,{"$f":"SW!G14","v":"AUFAN AZKAL ABRORI"},47,null,null,47,null,null,null,0,47]
[null,6,null,null,{"$f":"SW!G15","v":"AZZA PRISHAL DWI PUTRA"},62,null,null,62,null,null,null,0,62]
[null,7,null,null,{"$f":"SW!G16","v":"EKA AULIYA` PUTRI"},64,null,null,64,null,null,null,0,64]
[null,8,null,null,{"$f":"SW!G17","v":"ERSA PUSPITA EKA ROSA LINDA"},54,null,null,54,null,null,null,0,54]
[null,9,null,null,{"$f":"SW!G18","v":"FABIYAN TRI BAKTI OKTAFIAN"},57,null,null,57,null,null,null,0,57]
[null,10,null,null,{"$f":"SW!G19","v":"FELISITA APRILIA NUR NIHAYA"},59,null,null,59,null,null,null,0,59]
[null,11,null,null,{"$f":"SW!G20","v":"FIRDA DWI ANDRIANI"},30,null,null,30,null,null,null,0,30]
[null,12,null,null,{"$f":"SW!G21","v":"GILANG AKBAR PRASETYO"},85,null,null,85,null,null,null,0,85]
[null,13,null,null,{"$f":"SW!G22","v":"IFTAH IZZAH EMILIA  MAHMUD"},34,null,null,34,null,null,null,0,34]
[null,14,null,null,{"$f":"SW!G23","v":"INES ARIFANI MAULINA"},66,null,null,66,null,null,null,0,66]
[null,15,null,null,{"$f":"SW!G24","v":"IYAAD  AFLAKHA RAMZII"},36,null,null,36,null,null,null,0,36]
[null,16,null,null,{"$f":"SW!G25","v":"JULI ANDRIYANTO"},30,null,null,30,null,null,null,0,30]
[null,17,null,null,{"$f":"SW!G26","v":"LIYA FEBRIYANI"},66,null,null,66,null,null,null,0,66]
[null,18,null,null,{"$f":"SW!G27","v":"LIZATUL CHAIYUNI"},57,null,null,57,null,null,null,0,57]
[null,19,null,null,{"$f":"SW!G28","v":"M.AL HAFIZ"},57,null,null,57,null,null,null,0,57]
[null,20,null,null,{"$f":"SW!G29","v":"M. RIZKY RIDWAN"},25,null,null,25,null,null,null,0,25]
[null,21,null,null,{"$f":"SW!G30","v":"MOCHAMAD RAFLI DIAN SAPUTRA"},85,null,null,85,null,null,null,0,85]
[null,22,null,null,{"$f":"SW!G31","v":"MOCHAMMAD AFAREL PUTRA RAMDHANA"},20,null,null,20,null,null,null,0,20]
[null,23,null,null,{"$f":"SW!G32","v":"MUHAMAD JEFRI MAULANA"},55,null,null,55,null,null,null,0,55]
[null,24,null,null,{"$f":"SW!G33","v":"MUHAMMAD DWI WILDAN BAGUS KURNIAWAN"},79,null,null,79,null,null,null,0,79]
[null,25,null,null,{"$f":"SW!G34","v":"MUHAMMAD FARIL FIRMANSYA"},25,null,null,25,null,null,null,0,25]
[null,26,null,null,{"$f":"SW!G35","v":"MUHAMMAD FARIZ UBAIDILLA"},34,null,null,34,null,null,null,0,34]
[null,27,null,null,{"$f":"SW!G36","v":"MUHAMMAD MAULANA ZIDANIL ILMI"},57,null,null,57,null,null,null,0,57]
[null,28,null,null,{"$f":"SW!G37","v":"MUHAMMAD SUTRISNO ISMAIL"},49,null,null,49,null,null,null,0,49]
[null,29,null,null,{"$f":"SW!G38","v":"NOVITA ERNIAWAN"},74,null,null,74,null,null,null,0,74]
[null,30,null,null,{"$f":"SW!G39","v":"PUTRI AULIA DWI AGUSTIN"},43,null,null,43,null,null,null,0,43]
[null,31,null,null,{"$f":"SW!G40","v":"STANY RAFIDAH RAHMANIA"},37,null,null,37,null,null,null,0,37]
[null,32,null,null,{"$f":"SW!G41","v":"USWATUN KHASANAH"},30,null,null,30,null,null,null,0,30]
[null,33,null,null,{"$f":"SW!G42","v":"VIKROUL KHAMILA"},30,null,null,30,null,null,null,0,30]
[null,34,null,null,{"$f":"SW!G43","v":0},null,null,null,0,null,null,null,0,0]
[null,35,null,null,{"$f":"SW!G44","v":0},null,null,null,0,null,null,null,0,0]
[null,36,null,null,{"$f":"SW!G45","v":0},null,null,null,0,null,null,null,0,0]
[null,37,null,null,{"$f":"SW!G46","v":0},null,null,null,0,null,null,null,0,0]
[null,38,null,null,{"$f":"SW!G47","v":0},null,null,null,0,null,null,null,0,0]
[null,39,null,null,{"$f":"SW!G48","v":0},null,null,null,0,null,null,null,0,0]
[null,40,null,null,{"$f":"SW!G49","v":0},null,null,null,0,null,null,null,0,0]
[null,41,null,null,{"$f":"SW!G50","v":0},null,null,null,0,null,null,null,0,0]
[null,42,null,null,{"$f":"SW!G51","v":0},null,null,null,0,null,null,null,0,0]
[null,43,null,null,{"$f":"SW!G52","v":0},null,null,null,0,null,null,null,0,0]
[null,44,null,null,{"$f":"SW!G53","v":0},null,null,null,0,null,null,null,0,0]
[null,45,null,null,{"$f":"SW!G54","v":0},null,null,null,0,null,null,null,0,0]
[null,46,null,null,{"$f":"SW!G55","v":0},null,null,null,0,null,null,null,0,0]
[null,47,null,null,{"$f":"SW!G56","v":0},null,null,null,0,null,null,null,0,0]
[null,48,null,null,{"$f":"SW!G57","v":0},null,null,null,0,null,null,null,0,0]
[null,49,null,null,{"$f":"SW!G58","v":0},null,null,null,0,null,null,null,0,0]
[null,50,null,null,{"$f":"SW!G59","v":0},null,null,null,0,null,null,null,0,0]
[null,51,null,null,{"$f":"SW!G60","v":0},null,null,null,0,null,null,null,0,0]
[null,52,null,null,{"$f":"SW!G61","v":0},null,null,null,0,null,null,null,0,0]
[null,53,null,null,{"$f":"SW!G62","v":0},null,null,null,0,null,null,null,0,0]
[null,54,null,null,{"$f":"SW!G63","v":0},null,null,null,0,null,null,null,0,0]
[null,55,null,null,{"$f":"SW!G64","v":0},null,null,null,0,null,null,null,0,0]
[null,56,null,null,{"$f":"SW!G65","v":0},null,null,null,0,null,null,null,0,0]
[null,57,null,null,{"$f":"SW!G66","v":0},null,null,null,0,null,null,null,0,0]
[null,58,null,null,{"$f":"SW!G67","v":0},null,null,null,0,null,null,null,0,0]
[null,59,null,null,{"$f":"SW!G68","v":0},null,null,null,0,null,null,null,0,0]
[null,60,null,null,{"$f":"SW!G69","v":0},null,null,null,0,null,null,null,0,0]
[null,61,null,null,{"$f":"SW!G70","v":0},null,null,null,0,null,null,null,0,0]
[null,62,null,null,{"$f":"SW!G71","v":0},null,null,null,0,null,null,null,0,0]
[null,63,null,null,{"$f":"SW!G72","v":0},null,null,null,0,null,null,null,0,0]
[null,64,null,null,{"$f":"SW!G73","v":0},null,null,null,0,null,null,null,0,0]
[null,65,null,null,{"$f":"SW!G74","v":0},null,null,null,0,null,null,null,0,0]
[null,66,null,null,{"$f":"SW!G75","v":0},null,null,null,{"$f":"$I$10*F76","v":0},null,null,null,{"$f":"J76*$M$10","v":0},{"$f":"IFERROR(ROUND(AVERAGE(M76+I76),0),\"\")","v":0}]
[null,67,null,null,{"$f":"SW!G76","v":0},null,null,null,0,null,null,null,0,0]
[null,68,null,null,{"$f":"SW!G77","v":0},null,null,null,0,null,null,null,0,0]
[null,69,null,null,{"$f":"SW!G78","v":0},null,null,null,0,null,null,null,0,0]
[null,70,null,null,{"$f":"SW!G79","v":0},null,null,null,0,null,null,null,0,0]
[null,71,null,null,{"$f":"SW!G80","v":0},null,null,null,0,null,null,null,0,0]
[null,72,null,null,{"$f":"SW!G81","v":0},null,null,null,0,null,null,null,0,0]
[null,73,null,null,{"$f":"SW!G82","v":0},null,null,null,0,null,null,null,0,0]
[null,74,null,null,{"$f":"SW!G83","v":0},null,null,null,0,null,null,null,0,0]
[null,75,null,null,{"$f":"SW!G84","v":0},null,null,null,0,null,null,null,0,0]
[null,76,null,null,{"$f":"SW!G85","v":0},null,null,null,0,null,null,null,0,0]
[null,77,null,null,{"$f":"SW!G86","v":0},null,null,null,0,null,null,null,0,0]
[null,78,null,null,{"$f":"SW!G87","v":0},null,null,null,0,null,null,null,0,0]
[null,79,null,null,{"$f":"SW!G88","v":0},null,null,null,0,null,null,null,0,0]
[null,80,null,null,{"$f":"SW!G89","v":0},null,null,null,0,null,null,null,0,0]
[null,81,null,null,{"$f":"SW!G90","v":0},null,null,null,0,null,null,null,0,0]
[null,82,null,null,{"$f":"SW!G91","v":0},null,null,null,0,null,null,null,0,0]
[null,83,null,null,{"$f":"SW!G92","v":0},null,null,null,0,null,null,null,0,0]
[null,84,null,null,{"$f":"SW!G93","v":0},null,null,null,0,null,null,null,0,0]
[null,85,null,null,{"$f":"SW!G94","v":0},null,null,null,0,null,null,null,0,0]
[null,86,null,null,{"$f":"SW!G95","v":0},null,null,null,0,null,null,null,0,0]
[null,87,null,null,{"$f":"SW!G96","v":0},null,null,null,0,null,null,null,0,0]
[null,88,null,null,{"$f":"SW!G97","v":0},null,null,null,0,null,null,null,0,0]
[null,89,null,null,{"$f":"SW!G98","v":0},null,null,null,0,null,null,null,0,0]

{"sheet":"ASWJ","index":11,"n_rows":99,"n_cols":15,"rows_kept":99,"cut":false,"hidden":false,"merged":[[98,5,98,7],[98,9,98,11],[98,13,98,16],[96,5,96,7],[96,9,96,11],[96,13,96,16],[97,5,97,7],[97,9,97,11],[97,13,97,16],[94,5,94,7],[94,9,94,11],[94,13,94,16],[95,5,95,7],[95,9,95,11],[95,13,95,16],[92,5,92,7],[92,9,92,11],[92,13,92,16],[93,5,93,7],[93,9,93,11],[93,13,93,16],[90,5,90,7],[90,9,90,11],[90,13,90,16],[91,5,91,7],[91,9,91,11],[91,13,91,16],[88,5,88,7],[88,9,88,11],[88,13,88,16],[89,5,89,7],[89,9,89,11],[89,13,89,16],[86,5,86,7],[86,9,86,11],[86,13,86,16],[87,5,87,7],[87,9,87,11],[87,13,87,16],[84,5,84,7],[84,9,84,11],[84,13,84,16],[85,5,85,7],[85,9,85,11],[85,13,85,16],[82,5,82,7],[82,9,82,11],[82,13,82,16],[83,5,83,7],[83,9,83,11],[83,13,83,16],[80,5,80,7],[80,9,80,11],[80,13,80,16],[81,5,81,7],[81,9,81,11],[81,13,81,16],[78,5,78,7],[78,9,78,11],[78,13,78,16],[79,5,79,7],[79,9,79,11],[79,13,79,16],[76,5,76,7],[76,9,76,11],[76,13,76,16],[77,5,77,7],[77,9,77,11],[77,13,77,16],[74,5,74,7],[74,9,74,11],[74,13,74,16],[75,5,75,7],[75,9,75,11],[75,13,75,16],[72,5,72,7],[72,9,72,11],[72,13,72,16],[73,5,73,7],[73,9,73,11],[73,13,73,16],[70,5,70,7],[70,9,70,11],[70,13,70,16],[71,5,71,7],[71,9,71,11],[71,13,71,16],[68,5,68,7],[68,9,68,11],[68,13,68,16],[69,5,69,7],[69,9,69,11],[69,13,69,16],[66,5,66,7],[66,9,66,11],[66,13,66,16],[67,5,67,7],[67,9,67,11],[67,13,67,16],[64,5,64,7],[64,9,64,11],[64,13,64,16],[65,5,65,7],[65,9,65,11],[65,13,65,16],[62,5,62,7],[62,9,62,11],[62,13,62,16],[63,5,63,7],[63,9,63,11],[63,13,63,16],[60,5,60,7],[60,9,60,11],[60,13,60,16],[61,5,61,7],[61,9,61,11],[61,13,61,16],[58,5,58,7],[58,9,58,11],[58,13,58,16],[59,5,59,7],[59,9,59,11],[59,13,59,16],[56,5,56,7],[56,9,56,11],[56,13,56,16],[57,5,57,7],[57,9,57,11],[57,13,57,16],[54,5,54,7],[54,9,54,11],[54,13,54,16],[55,5,55,7],[55,9,55,11],[55,13,55,16],[52,5,52,7],[52,9,52,11],[52,13,52,16],[53,5,53,7],[53,9,53,11],[53,13,53,16],[50,5,50,7],[50,9,50,11],[50,13,50,16],[51,5,51,7],[51,9,51,11],[51,13,51,16],[48,5,48,7],[48,9,48,11],[48,13,48,16],[49,5,49,7],[49,9,49,11],[49,13,49,16],[46,5,46,7],[46,9,46,11],[46,13,46,16],[47,5,47,7],[47,9,47,11],[47,13,47,16],[44,5,44,7],[44,9,44,11],[44,13,44,16],[45,5,45,7],[45,9,45,11],[45,13,45,16],[42,5,42,7],[42,9,42,11],[42,13,42,16],[43,5,43,7],[43,9,43,11],[43,13,43,16],[40,5,40,7],[40,9,40,11],[40,13,40,16],[41,5,41,7],[41,9,41,11],[41,13,41,16],[38,5,38,7],[38,9,38,11],[38,13,38,16],[39,5,39,7],[39,9,39,11],[39,13,39,16],[36,5,36,7],[36,9,36,11],[36,13,36,16],[37,5,37,7],[37,9,37,11],[37,13,37,16],[34,5,34,7],[34,9,34,11],[34,13,34,16],[35,5,35,7],[35,9,35,11],[35,13,35,16],[32,5,32,7],[32,9,32,11],[32,13,32,16],[33,5,33,7],[33,9,33,11],[33,13,33,16],[30,5,30,7],[30,9,30,11],[30,13,30,16],[31,5,31,7],[31,9,31,11],[31,13,31,16],[28,5,28,7],[28,9,28,11],[28,13,28,16],[29,5,29,7],[29,9,29,11],[29,13,29,16],[26,5,26,7],[26,9,26,11],[26,13,26,16],[27,5,27,7],[27,9,27,11],[27,13,27,16],[24,5,24,7],[24,9,24,11],[24,13,24,16],[25,5,25,7],[25,9,25,11],[25,13,25,16],[22,5,22,7],[22,9,22,11],[22,13,22,16],[23,5,23,7],[23,9,23,11],[23,13,23,16],[20,5,20,7],[20,9,20,11],[20,13,20,16],[21,5,21,7],[21,9,21,11],[21,13,21,16],[18,5,18,7],[18,9,18,11],[18,13,18,16],[19,5,19,7],[19,9,19,11],[19,13,19,16],[16,5,16,7],[16,9,16,11],[16,13,16,16],[17,5,17,7],[17,9,17,11],[17,13,17,16],[14,5,14,7],[14,9,14,11],[14,13,14,16],[15,5,15,7],[15,9,15,11],[15,13,15,16],[12,5,12,7],[12,9,12,11],[12,13,12,16],[13,5,13,7],[13,9,13,11],[13,13,13,16],[9,9,9,11],[10,5,10,7],[10,9,10,11],[10,13,10,16],[11,5,11,7],[11,9,11,11],[11,13,11,16],[1,1,1,16],[3,6,3,12],[3,14,5,15],[4,6,4,12],[5,6,5,12],[8,1,9,1],[8,4,9,4],[8,5,8,12],[8,13,9,16],[9,5,9,7]]}
[]
[null,"D A F T A R   N I L A I"]
[]
[null,"MATA PELAJARAN",null,null,null,":","Aswaja",null,null,null,null,null,null,null,"↗"]
[null,"KELAS",null,null,null,":",{"$f":"UPPER(MN!D22)","v":"VI B"}]
[null,"TAHUN PELAJARAN",null,null,null,":",{"$f":"MN!D18","v":"2019 - 2020"}]
[]
[]
[null,"No","No. Induk","NISN","Nama Siswa","NILAI",null,null,null,null,null,null,null,"JUMLAH"]
[null,null,null,null,null,"PG",null,null,0.5,"ESSAY",null,null,{"$f":"100%-I10","v":0.5}]
[null,1,null,null,{"$f":"SW!G10","v":"ACHID ATHIRIL ARDAN"},60,null,null,{"$f":"$I$10*F11","v":30},70,null,null,{"$f":"J11*$M$10","v":35},{"$f":"IFERROR(ROUND(AVERAGE(M11+I11),0),\"\")","v":65}]
[null,2,null,null,{"$f":"SW!G11","v":"ACHMAD SEPTIAN HAMDANI"},40,null,null,{"$f":"$I$10*F12","v":20},70,null,null,{"$f":"J12*$M$10","v":35},{"$f":"IFERROR(ROUND(AVERAGE(M12+I12),0),\"\")","v":55}]
[null,3,null,null,{"$f":"SW!G12","v":"ACHMAD SULAIMAN"},37,null,null,18.5,70,null,null,35,54]
[null,4,null,null,{"$f":"SW!G13","v":"AIRLANGGA DWIKA RIZQI"},40,null,null,20,70,null,null,35,55]
[null,5,null,null,{"$f":"SW!G14","v":"AUFAN AZKAL ABRORI"},70,null,null,35,70,null,null,35,70]
[null,6,null,null,{"$f":"SW!G15","v":"AZZA PRISHAL DWI PUTRA"},27,null,null,13.5,70,null,null,35,49]
[null,7,null,null,{"$f":"SW!G16","v":"EKA AULIYA` PUTRI"},70,null,null,35,70,null,null,35,70]
[null,8,null,null,{"$f":"SW!G17","v":"ERSA PUSPITA EKA ROSA LINDA"},77,null,null,38.5,75,null,null,37.5,76]
[null,9,null,null,{"$f":"SW!G18","v":"FABIYAN TRI BAKTI OKTAFIAN"},47,null,null,23.5,70,null,null,35,59]
[null,10,null,null,{"$f":"SW!G19","v":"FELISITA APRILIA NUR NIHAYA"},67,null,null,33.5,70,null,null,35,69]
[null,11,null,null,{"$f":"SW!G20","v":"FIRDA DWI ANDRIANI"},60,null,null,30,70,null,null,35,65]
[null,12,null,null,{"$f":"SW!G21","v":"GILANG AKBAR PRASETYO"},50,null,null,25,70,null,null,35,60]
[null,13,null,null,{"$f":"SW!G22","v":"IFTAH IZZAH EMILIA  MAHMUD"},63,null,null,31.5,70,null,null,35,67]
[null,14,null,null,{"$f":"SW!G23","v":"INES ARIFANI MAULINA"},47,null,null,23.5,70,null,null,35,59]
[null,15,null,null,{"$f":"SW!G24","v":"IYAAD  AFLAKHA RAMZII"},30,null,null,15,75,null,null,37.5,53]
[null,16,null,null,{"$f":"SW!G25","v":"JULI ANDRIYANTO"},53,null,null,26.5,70,null,null,35,62]
[null,17,null,null,{"$f":"SW!G26","v":"LIYA FEBRIYANI"},77,null,null,38.5,80,null,null,40,79]
[null,18,null,null,{"$f":"SW!G27","v":"LIZATUL CHAIYUNI"},67,null,null,33.5,80,null,null,40,74]
[null,19,null,null,{"$f":"SW!G28","v":"M.AL HAFIZ"},53,null,null,26.5,70,null,null,35,62]
[null,20,null,null,{"$f":"SW!G29","v":"M. RIZKY RIDWAN"},40,null,null,20,70,null,null,35,55]
[null,21,null,null,{"$f":"SW!G30","v":"MOCHAMAD RAFLI DIAN SAPUTRA"},53,null,null,26.5,70,null,null,35,62]
[null,22,null,null,{"$f":"SW!G31","v":"MOCHAMMAD AFAREL PUTRA RAMDHANA"},63,null,null,31.5,70,null,null,35,67]
[null,23,null,null,{"$f":"SW!G32","v":"MUHAMAD JEFRI MAULANA"},60,null,null,30,70,null,null,35,65]
[null,24,null,null,{"$f":"SW!G33","v":"MUHAMMAD DWI WILDAN BAGUS KURNIAWAN"},53,null,null,26.5,70,null,null,35,62]
[null,25,null,null,{"$f":"SW!G34","v":"MUHAMMAD FARIL FIRMANSYA"},47,null,null,23.5,70,null,null,35,59]
[null,26,null,null,{"$f":"SW!G35","v":"MUHAMMAD FARIZ UBAIDILLA"},60,null,null,30,75,null,null,37.5,68]
[null,27,null,null,{"$f":"SW!G36","v":"MUHAMMAD MAULANA ZIDANIL ILMI"},80,null,null,40,80,null,null,40,80]
[null,28,null,null,{"$f":"SW!G37","v":"MUHAMMAD SUTRISNO ISMAIL"},43,null,null,21.5,70,null,null,35,57]
[null,29,null,null,{"$f":"SW!G38","v":"NOVITA ERNIAWAN"},57,null,null,28.5,80,null,null,40,69]
[null,30,null,null,{"$f":"SW!G39","v":"PUTRI AULIA DWI AGUSTIN"},70,null,null,35,80,null,null,40,75]
[null,31,null,null,{"$f":"SW!G40","v":"STANY RAFIDAH RAHMANIA"},50,null,null,25,70,null,null,35,60]
[null,32,null,null,{"$f":"SW!G41","v":"USWATUN KHASANAH"},57,null,null,28.5,70,null,null,35,64]
[null,33,null,null,{"$f":"SW!G42","v":"VIKROUL KHAMILA"},63,null,null,31.5,75,null,null,37.5,69]
[null,34,null,null,{"$f":"SW!G43","v":0},null,null,null,0,null,null,null,0,0]
[null,35,null,null,{"$f":"SW!G44","v":0},null,null,null,0,null,null,null,0,0]
[null,36,null,null,{"$f":"SW!G45","v":0},null,null,null,0,null,null,null,0,0]
[null,37,null,null,{"$f":"SW!G46","v":0},null,null,null,0,null,null,null,0,0]
[null,38,null,null,{"$f":"SW!G47","v":0},null,null,null,0,null,null,null,0,0]
[null,39,null,null,{"$f":"SW!G48","v":0},null,null,null,0,null,null,null,0,0]
[null,40,null,null,{"$f":"SW!G49","v":0},null,null,null,0,null,null,null,0,0]
[null,41,null,null,{"$f":"SW!G50","v":0},null,null,null,0,null,null,null,0,0]
[null,42,null,null,{"$f":"SW!G51","v":0},null,null,null,0,null,null,null,0,0]
[null,43,null,null,{"$f":"SW!G52","v":0},null,null,null,0,null,null,null,0,0]
[null,44,null,null,{"$f":"SW!G53","v":0},null,null,null,0,null,null,null,0,0]
[null,45,null,null,{"$f":"SW!G54","v":0},null,null,null,0,null,null,null,0,0]
[null,46,null,null,{"$f":"SW!G55","v":0},null,null,null,0,null,null,null,0,0]
[null,47,null,null,{"$f":"SW!G56","v":0},null,null,null,0,null,null,null,0,0]
[null,48,null,null,{"$f":"SW!G57","v":0},null,null,null,0,null,null,null,0,0]
[null,49,null,null,{"$f":"SW!G58","v":0},null,null,null,0,null,null,null,0,0]
[null,50,null,null,{"$f":"SW!G59","v":0},null,null,null,0,null,null,null,0,0]
[null,51,null,null,{"$f":"SW!G60","v":0},null,null,null,0,null,null,null,0,0]
[null,52,null,null,{"$f":"SW!G61","v":0},null,null,null,0,null,null,null,0,0]
[null,53,null,null,{"$f":"SW!G62","v":0},null,null,null,0,null,null,null,0,0]
[null,54,null,null,{"$f":"SW!G63","v":0},null,null,null,0,null,null,null,0,0]
[null,55,null,null,{"$f":"SW!G64","v":0},null,null,null,0,null,null,null,0,0]
[null,56,null,null,{"$f":"SW!G65","v":0},null,null,null,0,null,null,null,0,0]
[null,57,null,null,{"$f":"SW!G66","v":0},null,null,null,0,null,null,null,0,0]
[null,58,null,null,{"$f":"SW!G67","v":0},null,null,null,0,null,null,null,0,0]
[null,59,null,null,{"$f":"SW!G68","v":0},null,null,null,0,null,null,null,0,0]
[null,60,null,null,{"$f":"SW!G69","v":0},null,null,null,0,null,null,null,0,0]
[null,61,null,null,{"$f":"SW!G70","v":0},null,null,null,0,null,null,null,0,0]
[null,62,null,null,{"$f":"SW!G71","v":0},null,null,null,0,null,null,null,0,0]
[null,63,null,null,{"$f":"SW!G72","v":0},null,null,null,0,null,null,null,0,0]
[null,64,null,null,{"$f":"SW!G73","v":0},null,null,null,0,null,null,null,0,0]
[null,65,null,null,{"$f":"SW!G74","v":0},null,null,null,0,null,null,null,0,0]
[null,66,null,null,{"$f":"SW!G75","v":0},null,null,null,{"$f":"$I$10*F76","v":0},null,null,null,{"$f":"J76*$M$10","v":0},{"$f":"IFERROR(ROUND(AVERAGE(M76+I76),0),\"\")","v":0}]
[null,67,null,null,{"$f":"SW!G76","v":0},null,null,null,0,null,null,null,0,0]
[null,68,null,null,{"$f":"SW!G77","v":0},null,null,null,0,null,null,null,0,0]
[null,69,null,null,{"$f":"SW!G78","v":0},null,null,null,0,null,null,null,0,0]
[null,70,null,null,{"$f":"SW!G79","v":0},null,null,null,0,null,null,null,0,0]
[null,71,null,null,{"$f":"SW!G80","v":0},null,null,null,0,null,null,null,0,0]
[null,72,null,null,{"$f":"SW!G81","v":0},null,null,null,0,null,null,null,0,0]
[null,73,null,null,{"$f":"SW!G82","v":0},null,null,null,0,null,null,null,0,0]
[null,74,null,null,{"$f":"SW!G83","v":0},null,null,null,0,null,null,null,0,0]
[null,75,null,null,{"$f":"SW!G84","v":0},null,null,null,0,null,null,null,0,0]
[null,76,null,null,{"$f":"SW!G85","v":0},null,null,null,0,null,null,null,0,0]
[null,77,null,null,{"$f":"SW!G86","v":0},null,null,null,0,null,null,null,0,0]
[null,78,null,null,{"$f":"SW!G87","v":0},null,null,null,0,null,null,null,0,0]
[null,79,null,null,{"$f":"SW!G88","v":0},null,null,null,0,null,null,null,0,0]
[null,80,null,null,{"$f":"SW!G89","v":0},null,null,null,0,null,null,null,0,0]
[null,81,null,null,{"$f":"SW!G90","v":0},null,null,null,0,null,null,null,0,0]
[null,82,null,null,{"$f":"SW!G91","v":0},null,null,null,0,null,null,null,0,0]
[null,83,null,null,{"$f":"SW!G92","v":0},null,null,null,0,null,null,null,0,0]
[null,84,null,null,{"$f":"SW!G93","v":0},null,null,null,0,null,null,null,0,0]
[null,85,null,null,{"$f":"SW!G94","v":0},null,null,null,0,null,null,null,0,0]
[null,86,null,null,{"$f":"SW!G95","v":0},null,null,null,0,null,null,null,0,0]
[null,87,null,null,{"$f":"SW!G96","v":0},null,null,null,0,null,null,null,0,0]
[null,88,null,null,{"$f":"SW!G97","v":0},null,null,null,0,null,null,null,0,0]
[null,89,null,null,{"$f":"SW!G98","v":0},null,null,null,0,null,null,null,0,0]

{"sheet":"AA","index":12,"n_rows":99,"n_cols":15,"rows_kept":99,"cut":false,"hidden":false,"merged":[[98,5,98,7],[98,9,98,11],[98,13,98,16],[96,5,96,7],[96,9,96,11],[96,13,96,16],[97,5,97,7],[97,9,97,11],[97,13,97,16],[94,5,94,7],[94,9,94,11],[94,13,94,16],[95,5,95,7],[95,9,95,11],[95,13,95,16],[92,5,92,7],[92,9,92,11],[92,13,92,16],[93,5,93,7],[93,9,93,11],[93,13,93,16],[90,5,90,7],[90,9,90,11],[90,13,90,16],[91,5,91,7],[91,9,91,11],[91,13,91,16],[88,5,88,7],[88,9,88,11],[88,13,88,16],[89,5,89,7],[89,9,89,11],[89,13,89,16],[86,5,86,7],[86,9,86,11],[86,13,86,16],[87,5,87,7],[87,9,87,11],[87,13,87,16],[84,5,84,7],[84,9,84,11],[84,13,84,16],[85,5,85,7],[85,9,85,11],[85,13,85,16],[82,5,82,7],[82,9,82,11],[82,13,82,16],[83,5,83,7],[83,9,83,11],[83,13,83,16],[80,5,80,7],[80,9,80,11],[80,13,80,16],[81,5,81,7],[81,9,81,11],[81,13,81,16],[78,5,78,7],[78,9,78,11],[78,13,78,16],[79,5,79,7],[79,9,79,11],[79,13,79,16],[76,5,76,7],[76,9,76,11],[76,13,76,16],[77,5,77,7],[77,9,77,11],[77,13,77,16],[74,5,74,7],[74,9,74,11],[74,13,74,16],[75,5,75,7],[75,9,75,11],[75,13,75,16],[72,5,72,7],[72,9,72,11],[72,13,72,16],[73,5,73,7],[73,9,73,11],[73,13,73,16],[70,5,70,7],[70,9,70,11],[70,13,70,16],[71,5,71,7],[71,9,71,11],[71,13,71,16],[68,5,68,7],[68,9,68,11],[68,13,68,16],[69,5,69,7],[69,9,69,11],[69,13,69,16],[66,5,66,7],[66,9,66,11],[66,13,66,16],[67,5,67,7],[67,9,67,11],[67,13,67,16],[64,5,64,7],[64,9,64,11],[64,13,64,16],[65,5,65,7],[65,9,65,11],[65,13,65,16],[62,5,62,7],[62,9,62,11],[62,13,62,16],[63,5,63,7],[63,9,63,11],[63,13,63,16],[60,5,60,7],[60,9,60,11],[60,13,60,16],[61,5,61,7],[61,9,61,11],[61,13,61,16],[58,5,58,7],[58,9,58,11],[58,13,58,16],[59,5,59,7],[59,9,59,11],[59,13,59,16],[56,5,56,7],[56,9,56,11],[56,13,56,16],[57,5,57,7],[57,9,57,11],[57,13,57,16],[54,5,54,7],[54,9,54,11],[54,13,54,16],[55,5,55,7],[55,9,55,11],[55,13,55,16],[52,5,52,7],[52,9,52,11],[52,13,52,16],[53,5,53,7],[53,9,53,11],[53,13,53,16],[50,5,50,7],[50,9,50,11],[50,13,50,16],[51,5,51,7],[51,9,51,11],[51,13,51,16],[48,5,48,7],[48,9,48,11],[48,13,48,16],[49,5,49,7],[49,9,49,11],[49,13,49,16],[46,5,46,7],[46,9,46,11],[46,13,46,16],[47,5,47,7],[47,9,47,11],[47,13,47,16],[44,5,44,7],[44,9,44,11],[44,13,44,16],[45,5,45,7],[45,9,45,11],[45,13,45,16],[42,5,42,7],[42,9,42,11],[42,13,42,16],[43,5,43,7],[43,9,43,11],[43,13,43,16],[40,5,40,7],[40,9,40,11],[40,13,40,16],[41,5,41,7],[41,9,41,11],[41,13,41,16],[38,5,38,7],[38,9,38,11],[38,13,38,16],[39,5,39,7],[39,9,39,11],[39,13,39,16],[36,5,36,7],[36,9,36,11],[36,13,36,16],[37,5,37,7],[37,9,37,11],[37,13,37,16],[34,5,34,7],[34,9,34,11],[34,13,34,16],[35,5,35,7],[35,9,35,11],[35,13,35,16],[32,5,32,7],[32,9,32,11],[32,13,32,16],[33,5,33,7],[33,9,33,11],[33,13,33,16],[30,5,30,7],[30,9,30,11],[30,13,30,16],[31,5,31,7],[31,9,31,11],[31,13,31,16],[28,5,28,7],[28,9,28,11],[28,13,28,16],[29,5,29,7],[29,9,29,11],[29,13,29,16],[26,5,26,7],[26,9,26,11],[26,13,26,16],[27,5,27,7],[27,9,27,11],[27,13,27,16],[24,5,24,7],[24,9,24,11],[24,13,24,16],[25,5,25,7],[25,9,25,11],[25,13,25,16],[22,5,22,7],[22,9,22,11],[22,13,22,16],[23,5,23,7],[23,9,23,11],[23,13,23,16],[20,5,20,7],[20,9,20,11],[20,13,20,16],[21,5,21,7],[21,9,21,11],[21,13,21,16],[18,5,18,7],[18,9,18,11],[18,13,18,16],[19,5,19,7],[19,9,19,11],[19,13,19,16],[16,5,16,7],[16,9,16,11],[16,13,16,16],[17,5,17,7],[17,9,17,11],[17,13,17,16],[14,5,14,7],[14,9,14,11],[14,13,14,16],[15,5,15,7],[15,9,15,11],[15,13,15,16],[12,5,12,7],[12,9,12,11],[12,13,12,16],[13,5,13,7],[13,9,13,11],[13,13,13,16],[9,9,9,11],[10,5,10,7],[10,9,10,11],[10,13,10,16],[11,5,11,7],[11,9,11,11],[11,13,11,16],[1,1,1,16],[3,6,3,12],[3,14,5,15],[4,6,4,12],[5,6,5,12],[8,1,9,1],[8,4,9,4],[8,5,8,12],[8,13,9,16],[9,5,9,7]]}
[]
[null,"D A F T A R   N I L A I"]
[]
[null,"MATA PELAJARAN",null,null,null,":","Aqidah Akhlaq",null,null,null,null,null,null,null,"↗"]
[null,"KELAS",null,null,null,":",{"$f":"UPPER(MN!D22)","v":"VI B"}]
[null,"TAHUN PELAJARAN",null,null,null,":",{"$f":"MN!D18","v":"2019 - 2020"}]
[]
[]
[null,"No","No. Induk","NISN","Nama Siswa","NILAI",null,null,null,null,null,null,null,"JUMLAH"]
[null,null,null,null,null,"PG",null,null,0.5,"ESSAY",null,null,{"$f":"100%-I10","v":0.5}]
[null,1,null,null,{"$f":"SW!G10","v":"ACHID ATHIRIL ARDAN"},60,null,null,{"$f":"$I$10*F11","v":30},90,null,null,{"$f":"J11*$M$10","v":45},{"$f":"IFERROR(ROUND(AVERAGE(M11+I11),0),\"\")","v":75}]
[null,2,null,null,{"$f":"SW!G11","v":"ACHMAD SEPTIAN HAMDANI"},60,null,null,{"$f":"$I$10*F12","v":30},90,null,null,{"$f":"J12*$M$10","v":45},{"$f":"IFERROR(ROUND(AVERAGE(M12+I12),0),\"\")","v":75}]
[null,3,null,null,{"$f":"SW!G12","v":"ACHMAD SULAIMAN"},30,null,null,15,80,null,null,40,55]
[null,4,null,null,{"$f":"SW!G13","v":"AIRLANGGA DWIKA RIZQI"},23,null,null,11.5,75,null,null,37.5,49]
[null,5,null,null,{"$f":"SW!G14","v":"AUFAN AZKAL ABRORI"},37,null,null,18.5,60,null,null,30,49]
[null,6,null,null,{"$f":"SW!G15","v":"AZZA PRISHAL DWI PUTRA"},33,null,null,16.5,75,null,null,37.5,54]
[null,7,null,null,{"$f":"SW!G16","v":"EKA AULIYA` PUTRI"},40,null,null,20,95,null,null,47.5,68]
[null,8,null,null,{"$f":"SW!G17","v":"ERSA PUSPITA EKA ROSA LINDA"},67,null,null,33.5,85,null,null,42.5,76]
[null,9,null,null,{"$f":"SW!G18","v":"FABIYAN TRI BAKTI OKTAFIAN"},53,null,null,26.5,40,null,null,20,47]
[null,10,null,null,{"$f":"SW!G19","v":"FELISITA APRILIA NUR NIHAYA"},73,null,null,36.5,80,null,null,40,77]
[null,11,null,null,{"$f":"SW!G20","v":"FIRDA DWI ANDRIANI"},23,null,null,11.5,95,null,null,47.5,59]
[null,12,null,null,{"$f":"SW!G21","v":"GILANG AKBAR PRASETYO"},13,null,null,6.5,80,null,null,40,47]
[null,13,null,null,{"$f":"SW!G22","v":"IFTAH IZZAH EMILIA  MAHMUD"},47,null,null,23.5,95,null,null,47.5,71]
[null,14,null,null,{"$f":"SW!G23","v":"INES ARIFANI MAULINA"},63,null,null,31.5,75,null,null,37.5,69]
[null,15,null,null,{"$f":"SW!G24","v":"IYAAD  AFLAKHA RAMZII"},43,null,null,21.5,90,null,null,45,67]
[null,16,null,null,{"$f":"SW!G25","v":"JULI ANDRIYANTO"},37,null,null,18.5,70,null,null,35,54]
[null,17,null,null,{"$f":"SW!G26","v":"LIYA FEBRIYANI"},70,null,null,35,90,null,null,45,80]
[null,18,null,null,{"$f":"SW!G27","v":"LIZATUL CHAIYUNI"},63,null,null,31.5,80,null,null,40,72]
[null,19,null,null,{"$f":"SW!G28","v":"M.AL HAFIZ"},43,null,null,21.5,90,null,null,45,67]
[null,20,null,null,{"$f":"SW!G29","v":"M. RIZKY RIDWAN"},50,null,null,25,75,null,null,37.5,63]
[null,21,null,null,{"$f":"SW!G30","v":"MOCHAMAD RAFLI DIAN SAPUTRA"},60,null,null,30,65,null,null,32.5,63]
[null,22,null,null,{"$f":"SW!G31","v":"MOCHAMMAD AFAREL PUTRA RAMDHANA"},63,null,null,31.5,70,null,null,35,67]
[null,23,null,null,{"$f":"SW!G32","v":"MUHAMAD JEFRI MAULANA"},47,null,null,23.5,75,null,null,37.5,61]
[null,24,null,null,{"$f":"SW!G33","v":"MUHAMMAD DWI WILDAN BAGUS KURNIAWAN"},23,null,null,11.5,75,null,null,37.5,49]
[null,25,null,null,{"$f":"SW!G34","v":"MUHAMMAD FARIL FIRMANSYA"},20,null,null,10,80,null,null,40,50]
[null,26,null,null,{"$f":"SW!G35","v":"MUHAMMAD FARIZ UBAIDILLA"},27,null,null,13.5,85,null,null,42.5,56]
[null,27,null,null,{"$f":"SW!G36","v":"MUHAMMAD MAULANA ZIDANIL ILMI"},70,null,null,35,95,null,null,47.5,83]
[null,28,null,null,{"$f":"SW!G37","v":"MUHAMMAD SUTRISNO ISMAIL"},50,null,null,25,90,null,null,45,70]
[null,29,null,null,{"$f":"SW!G38","v":"NOVITA ERNIAWAN"},63,null,null,31.5,95,null,null,47.5,79]
[null,30,null,null,{"$f":"SW!G39","v":"PUTRI AULIA DWI AGUSTIN"},53,null,null,26.5,70,null,null,35,62]
[null,31,null,null,{"$f":"SW!G40","v":"STANY RAFIDAH RAHMANIA"},33,null,null,16.5,70,null,null,35,52]
[null,32,null,null,{"$f":"SW!G41","v":"USWATUN KHASANAH"},60,null,null,30,100,null,null,50,80]
[null,33,null,null,{"$f":"SW!G42","v":"VIKROUL KHAMILA"},40,null,null,20,85,null,null,42.5,63]
[null,34,null,null,{"$f":"SW!G43","v":0},null,null,null,0,null,null,null,0,0]
[null,35,null,null,{"$f":"SW!G44","v":0},null,null,null,0,null,null,null,0,0]
[null,36,null,null,{"$f":"SW!G45","v":0},null,null,null,0,null,null,null,0,0]
[null,37,null,null,{"$f":"SW!G46","v":0},null,null,null,0,null,null,null,0,0]
[null,38,null,null,{"$f":"SW!G47","v":0},null,null,null,0,null,null,null,0,0]
[null,39,null,null,{"$f":"SW!G48","v":0},null,null,null,0,null,null,null,0,0]
[null,40,null,null,{"$f":"SW!G49","v":0},null,null,null,0,null,null,null,0,0]
[null,41,null,null,{"$f":"SW!G50","v":0},null,null,null,0,null,null,null,0,0]
[null,42,null,null,{"$f":"SW!G51","v":0},null,null,null,0,null,null,null,0,0]
[null,43,null,null,{"$f":"SW!G52","v":0},null,null,null,0,null,null,null,0,0]
[null,44,null,null,{"$f":"SW!G53","v":0},null,null,null,0,null,null,null,0,0]
[null,45,null,null,{"$f":"SW!G54","v":0},null,null,null,0,null,null,null,0,0]
[null,46,null,null,{"$f":"SW!G55","v":0},null,null,null,0,null,null,null,0,0]
[null,47,null,null,{"$f":"SW!G56","v":0},null,null,null,0,null,null,null,0,0]
[null,48,null,null,{"$f":"SW!G57","v":0},null,null,null,0,null,null,null,0,0]
[null,49,null,null,{"$f":"SW!G58","v":0},null,null,null,0,null,null,null,0,0]
[null,50,null,null,{"$f":"SW!G59","v":0},null,null,null,0,null,null,null,0,0]
[null,51,null,null,{"$f":"SW!G60","v":0},null,null,null,0,null,null,null,0,0]
[null,52,null,null,{"$f":"SW!G61","v":0},null,null,null,0,null,null,null,0,0]
[null,53,null,null,{"$f":"SW!G62","v":0},null,null,null,0,null,null,null,0,0]
[null,54,null,null,{"$f":"SW!G63","v":0},null,null,null,0,null,null,null,0,0]
[null,55,null,null,{"$f":"SW!G64","v":0},null,null,null,0,null,null,null,0,0]
[null,56,null,null,{"$f":"SW!G65","v":0},null,null,null,0,null,null,null,0,0]
[null,57,null,null,{"$f":"SW!G66","v":0},null,null,null,0,null,null,null,0,0]
[null,58,null,null,{"$f":"SW!G67","v":0},null,null,null,0,null,null,null,0,0]
[null,59,null,null,{"$f":"SW!G68","v":0},null,null,null,0,null,null,null,0,0]
[null,60,null,null,{"$f":"SW!G69","v":0},null,null,null,0,null,null,null,0,0]
[null,61,null,null,{"$f":"SW!G70","v":0},null,null,null,0,null,null,null,0,0]
[null,62,null,null,{"$f":"SW!G71","v":0},null,null,null,0,null,null,null,0,0]
[null,63,null,null,{"$f":"SW!G72","v":0},null,null,null,0,null,null,null,0,0]
[null,64,null,null,{"$f":"SW!G73","v":0},null,null,null,0,null,null,null,0,0]
[null,65,null,null,{"$f":"SW!G74","v":0},null,null,null,0,null,null,null,0,0]
[null,66,null,null,{"$f":"SW!G75","v":0},null,null,null,{"$f":"$I$10*F76","v":0},null,null,null,{"$f":"J76*$M$10","v":0},{"$f":"IFERROR(ROUND(AVERAGE(M76+I76),0),\"\")","v":0}]
[null,67,null,null,{"$f":"SW!G76","v":0},null,null,null,0,null,null,null,0,0]
[null,68,null,null,{"$f":"SW!G77","v":0},null,null,null,0,null,null,null,0,0]
[null,69,null,null,{"$f":"SW!G78","v":0},null,null,null,0,null,null,null,0,0]
[null,70,null,null,{"$f":"SW!G79","v":0},null,null,null,0,null,null,null,0,0]
[null,71,null,null,{"$f":"SW!G80","v":0},null,null,null,0,null,null,null,0,0]
[null,72,null,null,{"$f":"SW!G81","v":0},null,null,null,0,null,null,null,0,0]
[null,73,null,null,{"$f":"SW!G82","v":0},null,null,null,0,null,null,null,0,0]
[null,74,null,null,{"$f":"SW!G83","v":0},null,null,null,0,null,null,null,0,0]
[null,75,null,null,{"$f":"SW!G84","v":0},null,null,null,0,null,null,null,0,0]
[null,76,null,null,{"$f":"SW!G85","v":0},null,null,null,0,null,null,null,0,0]
[null,77,null,null,{"$f":"SW!G86","v":0},null,null,null,0,null,null,null,0,0]
[null,78,null,null,{"$f":"SW!G87","v":0},null,null,null,0,null,null,null,0,0]
[null,79,null,null,{"$f":"SW!G88","v":0},null,null,null,0,null,null,null,0,0]
[null,80,null,null,{"$f":"SW!G89","v":0},null,null,null,0,null,null,null,0,0]
[null,81,null,null,{"$f":"SW!G90","v":0},null,null,null,0,null,null,null,0,0]
[null,82,null,null,{"$f":"SW!G91","v":0},null,null,null,0,null,null,null,0,0]
[null,83,null,null,{"$f":"SW!G92","v":0},null,null,null,0,null,null,null,0,0]
[null,84,null,null,{"$f":"SW!G93","v":0},null,null,null,0,null,null,null,0,0]
[null,85,null,null,{"$f":"SW!G94","v":0},null,null,null,0,null,null,null,0,0]
[null,86,null,null,{"$f":"SW!G95","v":0},null,null,null,0,null,null,null,0,0]
[null,87,null,null,{"$f":"SW!G96","v":0},null,null,null,0,null,null,null,0,0]
[null,88,null,null,{"$f":"SW!G97","v":0},null,null,null,0,null,null,null,0,0]
[null,89,null,null,{"$f":"SW!G98","v":0},null,null,null,0,null,null,null,0,0]

{"sheet":"AH","index":13,"n_rows":99,"n_cols":15,"rows_kept":99,"cut":false,"hidden":false,"merged":[[98,5,98,7],[98,9,98,11],[98,13,98,16],[96,5,96,7],[96,9,96,11],[96,13,96,16],[97,5,97,7],[97,9,97,11],[97,13,97,16],[94,5,94,7],[94,9,94,11],[94,13,94,16],[95,5,95,7],[95,9,95,11],[95,13,95,16],[92,5,92,7],[92,9,92,11],[92,13,92,16],[93,5,93,7],[93,9,93,11],[93,13,93,16],[90,5,90,7],[90,9,90,11],[90,13,90,16],[91,5,91,7],[91,9,91,11],[91,13,91,16],[88,5,88,7],[88,9,88,11],[88,13,88,16],[89,5,89,7],[89,9,89,11],[89,13,89,16],[86,5,86,7],[86,9,86,11],[86,13,86,16],[87,5,87,7],[87,9,87,11],[87,13,87,16],[84,5,84,7],[84,9,84,11],[84,13,84,16],[85,5,85,7],[85,9,85,11],[85,13,85,16],[82,5,82,7],[82,9,82,11],[82,13,82,16],[83,5,83,7],[83,9,83,11],[83,13,83,16],[80,5,80,7],[80,9,80,11],[80,13,80,16],[81,5,81,7],[81,9,81,11],[81,13,81,16],[78,5,78,7],[78,9,78,11],[78,13,78,16],[79,5,79,7],[79,9,79,11],[79,13,79,16],[76,5,76,7],[76,9,76,11],[76,13,76,16],[77,5,77,7],[77,9,77,11],[77,13,77,16],[74,5,74,7],[74,9,74,11],[74,13,74,16],[75,5,75,7],[75,9,75,11],[75,13,75,16],[72,5,72,7],[72,9,72,11],[72,13,72,16],[73,5,73,7],[73,9,73,11],[73,13,73,16],[70,5,70,7],[70,9,70,11],[70,13,70,16],[71,5,71,7],[71,9,71,11],[71,13,71,16],[68,5,68,7],[68,9,68,11],[68,13,68,16],[69,5,69,7],[69,9,69,11],[69,13,69,16],[66,5,66,7],[66,9,66,11],[66,13,66,16],[67,5,67,7],[67,9,67,11],[67,13,67,16],[64,5,64,7],[64,9,64,11],[64,13,64,16],[65,5,65,7],[65,9,65,11],[65,13,65,16],[62,5,62,7],[62,9,62,11],[62,13,62,16],[63,5,63,7],[63,9,63,11],[63,13,63,16],[60,5,60,7],[60,9,60,11],[60,13,60,16],[61,5,61,7],[61,9,61,11],[61,13,61,16],[58,5,58,7],[58,9,58,11],[58,13,58,16],[59,5,59,7],[59,9,59,11],[59,13,59,16],[56,5,56,7],[56,9,56,11],[56,13,56,16],[57,5,57,7],[57,9,57,11],[57,13,57,16],[54,5,54,7],[54,9,54,11],[54,13,54,16],[55,5,55,7],[55,9,55,11],[55,13,55,16],[52,5,52,7],[52,9,52,11],[52,13,52,16],[53,5,53,7],[53,9,53,11],[53,13,53,16],[50,5,50,7],[50,9,50,11],[50,13,50,16],[51,5,51,7],[51,9,51,11],[51,13,51,16],[48,5,48,7],[48,9,48,11],[48,13,48,16],[49,5,49,7],[49,9,49,11],[49,13,49,16],[46,5,46,7],[46,9,46,11],[46,13,46,16],[47,5,47,7],[47,9,47,11],[47,13,47,16],[44,5,44,7],[44,9,44,11],[44,13,44,16],[45,5,45,7],[45,9,45,11],[45,13,45,16],[42,5,42,7],[42,9,42,11],[42,13,42,16],[43,5,43,7],[43,9,43,11],[43,13,43,16],[40,5,40,7],[40,9,40,11],[40,13,40,16],[41,5,41,7],[41,9,41,11],[41,13,41,16],[38,5,38,7],[38,9,38,11],[38,13,38,16],[39,5,39,7],[39,9,39,11],[39,13,39,16],[36,5,36,7],[36,9,36,11],[36,13,36,16],[37,5,37,7],[37,9,37,11],[37,13,37,16],[34,5,34,7],[34,9,34,11],[34,13,34,16],[35,5,35,7],[35,9,35,11],[35,13,35,16],[32,5,32,7],[32,9,32,11],[32,13,32,16],[33,5,33,7],[33,9,33,11],[33,13,33,16],[30,5,30,7],[30,9,30,11],[30,13,30,16],[31,5,31,7],[31,9,31,11],[31,13,31,16],[28,5,28,7],[28,9,28,11],[28,13,28,16],[29,5,29,7],[29,9,29,11],[29,13,29,16],[26,5,26,7],[26,9,26,11],[26,13,26,16],[27,5,27,7],[27,9,27,11],[27,13,27,16],[24,5,24,7],[24,9,24,11],[24,13,24,16],[25,5,25,7],[25,9,25,11],[25,13,25,16],[22,5,22,7],[22,9,22,11],[22,13,22,16],[23,5,23,7],[23,9,23,11],[23,13,23,16],[20,5,20,7],[20,9,20,11],[20,13,20,16],[21,5,21,7],[21,9,21,11],[21,13,21,16],[18,5,18,7],[18,9,18,11],[18,13,18,16],[19,5,19,7],[19,9,19,11],[19,13,19,16],[16,5,16,7],[16,9,16,11],[16,13,16,16],[17,5,17,7],[17,9,17,11],[17,13,17,16],[14,5,14,7],[14,9,14,11],[14,13,14,16],[15,5,15,7],[15,9,15,11],[15,13,15,16],[12,5,12,7],[12,9,12,11],[12,13,12,16],[13,5,13,7],[13,9,13,11],[13,13,13,16],[9,9,9,11],[10,5,10,7],[10,9,10,11],[10,13,10,16],[11,5,11,7],[11,9,11,11],[11,13,11,16],[1,1,1,16],[3,6,3,12],[3,14,5,15],[4,6,4,12],[5,6,5,12],[8,1,9,1],[8,4,9,4],[8,5,8,12],[8,13,9,16],[9,5,9,7]]}
[]
[null,"D A F T A R   N I L A I"]
[]
[null,"MATA PELAJARAN",null,null,null,":","Alqur'an Hadits",null,null,null,null,null,null,null,"↗"]
[null,"KELAS",null,null,null,":",{"$f":"UPPER(MN!D22)","v":"VI B"}]
[null,"TAHUN PELAJARAN",null,null,null,":",{"$f":"MN!D18","v":"2019 - 2020"}]
[]
[]
[null,"No","No. Induk","NISN","Nama Siswa","NILAI",null,null,null,null,null,null,null,"JUMLAH"]
[null,null,null,null,null,"PG",null,null,0.5,"ESSAY",null,null,{"$f":"100%-I10","v":0.5}]
[null,1,null,null,{"$f":"SW!G10","v":"ACHID ATHIRIL ARDAN"},37,null,null,{"$f":"$I$10*F11","v":18.5},55,null,null,{"$f":"J11*$M$10","v":27.5},{"$f":"IFERROR(ROUND(AVERAGE(M11+I11),0),\"\")","v":46}]
[null,2,null,null,{"$f":"SW!G11","v":"ACHMAD SEPTIAN HAMDANI"},50,null,null,{"$f":"$I$10*F12","v":25},100,null,null,{"$f":"J12*$M$10","v":50},{"$f":"IFERROR(ROUND(AVERAGE(M12+I12),0),\"\")","v":75}]
[null,3,null,null,{"$f":"SW!G12","v":"ACHMAD SULAIMAN"},33,null,null,16.5,55,null,null,27.5,44]
[null,4,null,null,{"$f":"SW!G13","v":"AIRLANGGA DWIKA RIZQI"},30,null,null,15,55,null,null,27.5,43]
[null,5,null,null,{"$f":"SW!G14","v":"AUFAN AZKAL ABRORI"},47,null,null,23.5,55,null,null,27.5,51]
[null,6,null,null,{"$f":"SW!G15","v":"AZZA PRISHAL DWI PUTRA"},37,null,null,18.5,70,null,null,35,54]
[null,7,null,null,{"$f":"SW!G16","v":"EKA AULIYA` PUTRI"},70,null,null,35,70,null,null,35,70]
[null,8,null,null,{"$f":"SW!G17","v":"ERSA PUSPITA EKA ROSA LINDA"},70,null,null,35,100,null,null,50,85]
[null,9,null,null,{"$f":"SW!G18","v":"FABIYAN TRI BAKTI OKTAFIAN"},57,null,null,28.5,100,null,null,50,79]
[null,10,null,null,{"$f":"SW!G19","v":"FELISITA APRILIA NUR NIHAYA"},67,null,null,33.5,70,null,null,35,69]
[null,11,null,null,{"$f":"SW!G20","v":"FIRDA DWI ANDRIANI"},40,null,null,20,55,null,null,27.5,48]
[null,12,null,null,{"$f":"SW!G21","v":"GILANG AKBAR PRASETYO"},27,null,null,13.5,85,null,null,42.5,56]
[null,13,null,null,{"$f":"SW!G22","v":"IFTAH IZZAH EMILIA  MAHMUD"},57,null,null,28.5,70,null,null,35,64]
[null,14,null,null,{"$f":"SW!G23","v":"INES ARIFANI MAULINA"},63,null,null,31.5,80,null,null,40,72]
[null,15,null,null,{"$f":"SW!G24","v":"IYAAD  AFLAKHA RAMZII"},50,null,null,25,70,null,null,35,60]
[null,16,null,null,{"$f":"SW!G25","v":"JULI ANDRIYANTO"},57,null,null,28.5,40,null,null,20,49]
[null,17,null,null,{"$f":"SW!G26","v":"LIYA FEBRIYANI"},67,null,null,33.5,70,null,null,35,69]
[null,18,null,null,{"$f":"SW!G27","v":"LIZATUL CHAIYUNI"},67,null,null,33.5,100,null,null,50,84]
[null,19,null,null,{"$f":"SW!G28","v":"M.AL HAFIZ"},40,null,null,20,55,null,null,27.5,48]
[null,20,null,null,{"$f":"SW!G29","v":"M. RIZKY RIDWAN"},63,null,null,31.5,55,null,null,27.5,59]
[null,21,null,null,{"$f":"SW!G30","v":"MOCHAMAD RAFLI DIAN SAPUTRA"},43,null,null,21.5,55,null,null,27.5,49]
[null,22,null,null,{"$f":"SW!G31","v":"MOCHAMMAD AFAREL PUTRA RAMDHANA"},50,null,null,25,85,null,null,42.5,68]
[null,23,null,null,{"$f":"SW!G32","v":"MUHAMAD JEFRI MAULANA"},60,null,null,30,85,null,null,42.5,73]
[null,24,null,null,{"$f":"SW!G33","v":"MUHAMMAD DWI WILDAN BAGUS KURNIAWAN"},17,null,null,8.5,40,null,null,20,29]
[null,25,null,null,{"$f":"SW!G34","v":"MUHAMMAD FARIL FIRMANSYA"},40,null,null,20,85,null,null,42.5,63]
[null,26,null,null,{"$f":"SW!G35","v":"MUHAMMAD FARIZ UBAIDILLA"},57,null,null,28.5,85,null,null,42.5,71]
[null,27,null,null,{"$f":"SW!G36","v":"MUHAMMAD MAULANA ZIDANIL ILMI"},60,null,null,30,85,null,null,42.5,73]
[null,28,null,null,{"$f":"SW!G37","v":"MUHAMMAD SUTRISNO ISMAIL"},23,null,null,11.5,55,null,null,27.5,39]
[null,29,null,null,{"$f":"SW!G38","v":"NOVITA ERNIAWAN"},67,null,null,33.5,70,null,null,35,69]
[null,30,null,null,{"$f":"SW!G39","v":"PUTRI AULIA DWI AGUSTIN"},70,null,null,35,100,null,null,50,85]
[null,31,null,null,{"$f":"SW!G40","v":"STANY RAFIDAH RAHMANIA"},27,null,null,13.5,70,null,null,35,49]
[null,32,null,null,{"$f":"SW!G41","v":"USWATUN KHASANAH"},63,null,null,31.5,70,null,null,35,67]
[null,33,null,null,{"$f":"SW!G42","v":"VIKROUL KHAMILA"},53,null,null,26.5,100,null,null,50,77]
[null,34,null,null,{"$f":"SW!G43","v":0},null,null,null,0,null,null,null,0,0]
[null,35,null,null,{"$f":"SW!G44","v":0},null,null,null,0,null,null,null,0,0]
[null,36,null,null,{"$f":"SW!G45","v":0},null,null,null,0,null,null,null,0,0]
[null,37,null,null,{"$f":"SW!G46","v":0},null,null,null,0,null,null,null,0,0]
[null,38,null,null,{"$f":"SW!G47","v":0},null,null,null,0,null,null,null,0,0]
[null,39,null,null,{"$f":"SW!G48","v":0},null,null,null,0,null,null,null,0,0]
[null,40,null,null,{"$f":"SW!G49","v":0},null,null,null,0,null,null,null,0,0]
[null,41,null,null,{"$f":"SW!G50","v":0},null,null,null,0,null,null,null,0,0]
[null,42,null,null,{"$f":"SW!G51","v":0},null,null,null,0,null,null,null,0,0]
[null,43,null,null,{"$f":"SW!G52","v":0},null,null,null,0,null,null,null,0,0]
[null,44,null,null,{"$f":"SW!G53","v":0},null,null,null,0,null,null,null,0,0]
[null,45,null,null,{"$f":"SW!G54","v":0},null,null,null,0,null,null,null,0,0]
[null,46,null,null,{"$f":"SW!G55","v":0},null,null,null,0,null,null,null,0,0]
[null,47,null,null,{"$f":"SW!G56","v":0},null,null,null,0,null,null,null,0,0]
[null,48,null,null,{"$f":"SW!G57","v":0},null,null,null,0,null,null,null,0,0]
[null,49,null,null,{"$f":"SW!G58","v":0},null,null,null,0,null,null,null,0,0]
[null,50,null,null,{"$f":"SW!G59","v":0},null,null,null,0,null,null,null,0,0]
[null,51,null,null,{"$f":"SW!G60","v":0},null,null,null,0,null,null,null,0,0]
[null,52,null,null,{"$f":"SW!G61","v":0},null,null,null,0,null,null,null,0,0]
[null,53,null,null,{"$f":"SW!G62","v":0},null,null,null,0,null,null,null,0,0]
[null,54,null,null,{"$f":"SW!G63","v":0},null,null,null,0,null,null,null,0,0]
[null,55,null,null,{"$f":"SW!G64","v":0},null,null,null,0,null,null,null,0,0]
[null,56,null,null,{"$f":"SW!G65","v":0},null,null,null,0,null,null,null,0,0]
[null,57,null,null,{"$f":"SW!G66","v":0},null,null,null,0,null,null,null,0,0]
[null,58,null,null,{"$f":"SW!G67","v":0},null,null,null,0,null,null,null,0,0]
[null,59,null,null,{"$f":"SW!G68","v":0},null,null,null,0,null,null,null,0,0]
[null,60,null,null,{"$f":"SW!G69","v":0},null,null,null,0,null,null,null,0,0]
[null,61,null,null,{"$f":"SW!G70","v":0},null,null,null,0,null,null,null,0,0]
[null,62,null,null,{"$f":"SW!G71","v":0},null,null,null,0,null,null,null,0,0]
[null,63,null,null,{"$f":"SW!G72","v":0},null,null,null,0,null,null,null,0,0]
[null,64,null,null,{"$f":"SW!G73","v":0},null,null,null,0,null,null,null,0,0]
[null,65,null,null,{"$f":"SW!G74","v":0},null,null,null,0,null,null,null,0,0]
[null,66,null,null,{"$f":"SW!G75","v":0},null,null,null,{"$f":"$I$10*F76","v":0},null,null,null,{"$f":"J76*$M$10","v":0},{"$f":"IFERROR(ROUND(AVERAGE(M76+I76),0),\"\")","v":0}]
[null,67,null,null,{"$f":"SW!G76","v":0},null,null,null,0,null,null,null,0,0]
[null,68,null,null,{"$f":"SW!G77","v":0},null,null,null,0,null,null,null,0,0]
[null,69,null,null,{"$f":"SW!G78","v":0},null,null,null,0,null,null,null,0,0]
[null,70,null,null,{"$f":"SW!G79","v":0},null,null,null,0,null,null,null,0,0]
[null,71,null,null,{"$f":"SW!G80","v":0},null,null,null,0,null,null,null,0,0]
[null,72,null,null,{"$f":"SW!G81","v":0},null,null,null,0,null,null,null,0,0]
[null,73,null,null,{"$f":"SW!G82","v":0},null,null,null,0,null,null,null,0,0]
[null,74,null,null,{"$f":"SW!G83","v":0},null,null,null,0,null,null,null,0,0]
[null,75,null,null,{"$f":"SW!G84","v":0},null,null,null,0,null,null,null,0,0]
[null,76,null,null,{"$f":"SW!G85","v":0},null,null,null,0,null,null,null,0,0]
[null,77,null,null,{"$f":"SW!G86","v":0},null,null,null,0,null,null,null,0,0]
[null,78,null,null,{"$f":"SW!G87","v":0},null,null,null,0,null,null,null,0,0]
[null,79,null,null,{"$f":"SW!G88","v":0},null,null,null,0,null,null,null,0,0]
[null,80,null,null,{"$f":"SW!G89","v":0},null,null,null,0,null,null,null,0,0]
[null,81,null,null,{"$f":"SW!G90","v":0},null,null,null,0,null,null,null,0,0]
[null,82,null,null,{"$f":"SW!G91","v":0},null,null,null,0,null,null,null,0,0]
[null,83,null,null,{"$f":"SW!G92","v":0},null,null,null,0,null,null,null,0,0]
[null,84,null,null,{"$f":"SW!G93","v":0},null,null,null,0,null,null,null,0,0]
[null,85,null,null,{"$f":"SW!G94","v":0},null,null,null,0,null,null,null,0,0]
[null,86,null,null,{"$f":"SW!G95","v":0},null,null,null,0,null,null,null,0,0]
[null,87,null,null,{"$f":"SW!G96","v":0},null,null,null,0,null,null,null,0,0]
[null,88,null,null,{"$f":"SW!G97","v":0},null,null,null,0,null,null,null,0,0]
[null,89,null,null,{"$f":"SW!G98","v":0},null,null,null,0,null,null,null,0,0]

{"sheet":"FQ","index":14,"n_rows":99,"n_cols":15,"rows_kept":99,"cut":false,"hidden":false,"merged":[[98,5,98,7],[98,9,98,11],[98,13,98,16],[96,5,96,7],[96,9,96,11],[96,13,96,16],[97,5,97,7],[97,9,97,11],[97,13,97,16],[94,5,94,7],[94,9,94,11],[94,13,94,16],[95,5,95,7],[95,9,95,11],[95,13,95,16],[92,5,92,7],[92,9,92,11],[92,13,92,16],[93,5,93,7],[93,9,93,11],[93,13,93,16],[90,5,90,7],[90,9,90,11],[90,13,90,16],[91,5,91,7],[91,9,91,11],[91,13,91,16],[88,5,88,7],[88,9,88,11],[88,13,88,16],[89,5,89,7],[89,9,89,11],[89,13,89,16],[86,5,86,7],[86,9,86,11],[86,13,86,16],[87,5,87,7],[87,9,87,11],[87,13,87,16],[84,5,84,7],[84,9,84,11],[84,13,84,16],[85,5,85,7],[85,9,85,11],[85,13,85,16],[82,5,82,7],[82,9,82,11],[82,13,82,16],[83,5,83,7],[83,9,83,11],[83,13,83,16],[80,5,80,7],[80,9,80,11],[80,13,80,16],[81,5,81,7],[81,9,81,11],[81,13,81,16],[78,5,78,7],[78,9,78,11],[78,13,78,16],[79,5,79,7],[79,9,79,11],[79,13,79,16],[76,5,76,7],[76,9,76,11],[76,13,76,16],[77,5,77,7],[77,9,77,11],[77,13,77,16],[74,5,74,7],[74,9,74,11],[74,13,74,16],[75,5,75,7],[75,9,75,11],[75,13,75,16],[72,5,72,7],[72,9,72,11],[72,13,72,16],[73,5,73,7],[73,9,73,11],[73,13,73,16],[70,5,70,7],[70,9,70,11],[70,13,70,16],[71,5,71,7],[71,9,71,11],[71,13,71,16],[68,5,68,7],[68,9,68,11],[68,13,68,16],[69,5,69,7],[69,9,69,11],[69,13,69,16],[66,5,66,7],[66,9,66,11],[66,13,66,16],[67,5,67,7],[67,9,67,11],[67,13,67,16],[64,5,64,7],[64,9,64,11],[64,13,64,16],[65,5,65,7],[65,9,65,11],[65,13,65,16],[62,5,62,7],[62,9,62,11],[62,13,62,16],[63,5,63,7],[63,9,63,11],[63,13,63,16],[60,5,60,7],[60,9,60,11],[60,13,60,16],[61,5,61,7],[61,9,61,11],[61,13,61,16],[58,5,58,7],[58,9,58,11],[58,13,58,16],[59,5,59,7],[59,9,59,11],[59,13,59,16],[56,5,56,7],[56,9,56,11],[56,13,56,16],[57,5,57,7],[57,9,57,11],[57,13,57,16],[54,5,54,7],[54,9,54,11],[54,13,54,16],[55,5,55,7],[55,9,55,11],[55,13,55,16],[52,5,52,7],[52,9,52,11],[52,13,52,16],[53,5,53,7],[53,9,53,11],[53,13,53,16],[50,5,50,7],[50,9,50,11],[50,13,50,16],[51,5,51,7],[51,9,51,11],[51,13,51,16],[48,5,48,7],[48,9,48,11],[48,13,48,16],[49,5,49,7],[49,9,49,11],[49,13,49,16],[46,5,46,7],[46,9,46,11],[46,13,46,16],[47,5,47,7],[47,9,47,11],[47,13,47,16],[44,5,44,7],[44,9,44,11],[44,13,44,16],[45,5,45,7],[45,9,45,11],[45,13,45,16],[42,5,42,7],[42,9,42,11],[42,13,42,16],[43,5,43,7],[43,9,43,11],[43,13,43,16],[40,5,40,7],[40,9,40,11],[40,13,40,16],[41,5,41,7],[41,9,41,11],[41,13,41,16],[38,5,38,7],[38,9,38,11],[38,13,38,16],[39,5,39,7],[39,9,39,11],[39,13,39,16],[36,5,36,7],[36,9,36,11],[36,13,36,16],[37,5,37,7],[37,9,37,11],[37,13,37,16],[34,5,34,7],[34,9,34,11],[34,13,34,16],[35,5,35,7],[35,9,35,11],[35,13,35,16],[32,5,32,7],[32,9,32,11],[32,13,32,16],[33,5,33,7],[33,9,33,11],[33,13,33,16],[30,5,30,7],[30,9,30,11],[30,13,30,16],[31,5,31,7],[31,9,31,11],[31,13,31,16],[28,5,28,7],[28,9,28,11],[28,13,28,16],[29,5,29,7],[29,9,29,11],[29,13,29,16],[26,5,26,7],[26,9,26,11],[26,13,26,16],[27,5,27,7],[27,9,27,11],[27,13,27,16],[24,5,24,7],[24,9,24,11],[24,13,24,16],[25,5,25,7],[25,9,25,11],[25,13,25,16],[22,5,22,7],[22,9,22,11],[22,13,22,16],[23,5,23,7],[23,9,23,11],[23,13,23,16],[20,5,20,7],[20,9,20,11],[20,13,20,16],[21,5,21,7],[21,9,21,11],[21,13,21,16],[18,5,18,7],[18,9,18,11],[18,13,18,16],[19,5,19,7],[19,9,19,11],[19,13,19,16],[16,5,16,7],[16,9,16,11],[16,13,16,16],[17,5,17,7],[17,9,17,11],[17,13,17,16],[14,5,14,7],[14,9,14,11],[14,13,14,16],[15,5,15,7],[15,9,15,11],[15,13,15,16],[12,5,12,7],[12,9,12,11],[12,13,12,16],[13,5,13,7],[13,9,13,11],[13,13,13,16],[9,9,9,11],[10,5,10,7],[10,9,10,11],[10,13,10,16],[11,5,11,7],[11,9,11,11],[11,13,11,16],[1,1,1,16],[3,6,3,12],[3,14,5,15],[4,6,4,12],[5,6,5,12],[8,1,9,1],[8,4,9,4],[8,5,8,12],[8,13,9,16],[9,5,9,7]]}
[]
[null,"D A F T A R   N I L A I"]
[]
[null,"MATA PELAJARAN",null,null,null,":","Fiqih",null,null,null,null,null,null,null,"↗"]
[null,"KELAS",null,null,null,":",{"$f":"UPPER(MN!D22)","v":"VI B"}]
[null,"TAHUN PELAJARAN",null,null,null,":",{"$f":"MN!D18","v":"2019 - 2020"}]
[]
[]
[null,"No","No. Induk","NISN","Nama Siswa","NILAI",null,null,null,null,null,null,null,"JUMLAH"]
[null,null,null,null,null,"PG",null,null,0.5,"ESSAY",null,null,{"$f":"100%-I10","v":0.5}]
[null,1,null,null,{"$f":"SW!G10","v":"ACHID ATHIRIL ARDAN"},67,null,null,{"$f":"$I$10*F11","v":33.5},100,null,null,{"$f":"J11*$M$10","v":50},{"$f":"IFERROR(ROUND(AVERAGE(M11+I11),0),\"\")","v":84}]
[null,2,null,null,{"$f":"SW!G11","v":"ACHMAD SEPTIAN HAMDANI"},87,null,null,{"$f":"$I$10*F12","v":43.5},85,null,null,{"$f":"J12*$M$10","v":42.5},{"$f":"IFERROR(ROUND(AVERAGE(M12+I12),0),\"\")","v":86}]
[null,3,null,null,{"$f":"SW!G12","v":"ACHMAD SULAIMAN"},30,null,null,15,55,null,null,27.5,43]
[null,4,null,null,{"$f":"SW!G13","v":"AIRLANGGA DWIKA RIZQI"},63,null,null,31.5,85,null,null,42.5,74]
[null,5,null,null,{"$f":"SW!G14","v":"AUFAN AZKAL ABRORI"},60,null,null,30,55,null,null,27.5,58]
[null,6,null,null,{"$f":"SW!G15","v":"AZZA PRISHAL DWI PUTRA"},57,null,null,28.5,55,null,null,27.5,56]
[null,7,null,null,{"$f":"SW!G16","v":"EKA AULIYA` PUTRI"},80,null,null,40,100,null,null,50,90]
[null,8,null,null,{"$f":"SW!G17","v":"ERSA PUSPITA EKA ROSA LINDA"},77,null,null,38.5,85,null,null,42.5,81]
[null,9,null,null,{"$f":"SW!G18","v":"FABIYAN TRI BAKTI OKTAFIAN"},73,null,null,36.5,85,null,null,42.5,79]
[null,10,null,null,{"$f":"SW!G19","v":"FELISITA APRILIA NUR NIHAYA"},67,null,null,33.5,70,null,null,35,69]
[null,11,null,null,{"$f":"SW!G20","v":"FIRDA DWI ANDRIANI"},67,null,null,33.5,85,null,null,42.5,76]
[null,12,null,null,{"$f":"SW!G21","v":"GILANG AKBAR PRASETYO"},50,null,null,25,70,null,null,35,60]
[null,13,null,null,{"$f":"SW!G22","v":"IFTAH IZZAH EMILIA  MAHMUD"},50,null,null,25,85,null,null,42.5,68]
[null,14,null,null,{"$f":"SW!G23","v":"INES ARIFANI MAULINA"},57,null,null,28.5,70,null,null,35,64]
[null,15,null,null,{"$f":"SW!G24","v":"IYAAD  AFLAKHA RAMZII"},77,null,null,38.5,100,null,null,50,89]
[null,16,null,null,{"$f":"SW!G25","v":"JULI ANDRIYANTO"},63,null,null,31.5,100,null,null,50,82]
[null,17,null,null,{"$f":"SW!G26","v":"LIYA FEBRIYANI"},80,null,null,40,85,null,null,42.5,83]
[null,18,null,null,{"$f":"SW!G27","v":"LIZATUL CHAIYUNI"},73,null,null,36.5,70,null,null,35,72]
[null,19,null,null,{"$f":"SW!G28","v":"M.AL HAFIZ"},60,null,null,30,100,null,null,50,80]
[null,20,null,null,{"$f":"SW!G29","v":"M. RIZKY RIDWAN"},67,null,null,33.5,70,null,null,35,69]
[null,21,null,null,{"$f":"SW!G30","v":"MOCHAMAD RAFLI DIAN SAPUTRA"},60,null,null,30,55,null,null,27.5,58]
[null,22,null,null,{"$f":"SW!G31","v":"MOCHAMMAD AFAREL PUTRA RAMDHANA"},70,null,null,35,100,null,null,50,85]
[null,23,null,null,{"$f":"SW!G32","v":"MUHAMAD JEFRI MAULANA"},67,null,null,33.5,100,null,null,50,84]
[null,24,null,null,{"$f":"SW!G33","v":"MUHAMMAD DWI WILDAN BAGUS KURNIAWAN"},33,null,null,16.5,85,null,null,42.5,59]
[null,25,null,null,{"$f":"SW!G34","v":"MUHAMMAD FARIL FIRMANSYA"},53,null,null,26.5,100,null,null,50,77]
[null,26,null,null,{"$f":"SW!G35","v":"MUHAMMAD FARIZ UBAIDILLA"},83,null,null,41.5,85,null,null,42.5,84]
[null,27,null,null,{"$f":"SW!G36","v":"MUHAMMAD MAULANA ZIDANIL ILMI"},70,null,null,35,70,null,null,35,70]
[null,28,null,null,{"$f":"SW!G37","v":"MUHAMMAD SUTRISNO ISMAIL"},43,null,null,21.5,70,null,null,35,57]
[null,29,null,null,{"$f":"SW!G38","v":"NOVITA ERNIAWAN"},73,null,null,36.5,85,null,null,42.5,79]
[null,30,null,null,{"$f":"SW!G39","v":"PUTRI AULIA DWI AGUSTIN"},70,null,null,35,100,null,null,50,85]
[null,31,null,null,{"$f":"SW!G40","v":"STANY RAFIDAH RAHMANIA"},37,null,null,18.5,70,null,null,35,54]
[null,32,null,null,{"$f":"SW!G41","v":"USWATUN KHASANAH"},57,null,null,28.5,85,null,null,42.5,71]
[null,33,null,null,{"$f":"SW!G42","v":"VIKROUL KHAMILA"},57,null,null,28.5,85,null,null,42.5,71]
[null,34,null,null,{"$f":"SW!G43","v":0},null,null,null,0,null,null,null,0,0]
[null,35,null,null,{"$f":"SW!G44","v":0},null,null,null,0,null,null,null,0,0]
[null,36,null,null,{"$f":"SW!G45","v":0},null,null,null,0,null,null,null,0,0]
[null,37,null,null,{"$f":"SW!G46","v":0},null,null,null,0,null,null,null,0,0]
[null,38,null,null,{"$f":"SW!G47","v":0},null,null,null,0,null,null,null,0,0]
[null,39,null,null,{"$f":"SW!G48","v":0},null,null,null,0,null,null,null,0,0]
[null,40,null,null,{"$f":"SW!G49","v":0},null,null,null,0,null,null,null,0,0]
[null,41,null,null,{"$f":"SW!G50","v":0},null,null,null,0,null,null,null,0,0]
[null,42,null,null,{"$f":"SW!G51","v":0},null,null,null,0,null,null,null,0,0]
[null,43,null,null,{"$f":"SW!G52","v":0},null,null,null,0,null,null,null,0,0]
[null,44,null,null,{"$f":"SW!G53","v":0},null,null,null,0,null,null,null,0,0]
[null,45,null,null,{"$f":"SW!G54","v":0},null,null,null,0,null,null,null,0,0]
[null,46,null,null,{"$f":"SW!G55","v":0},null,null,null,0,null,null,null,0,0]
[null,47,null,null,{"$f":"SW!G56","v":0},null,null,null,0,null,null,null,0,0]
[null,48,null,null,{"$f":"SW!G57","v":0},null,null,null,0,null,null,null,0,0]
[null,49,null,null,{"$f":"SW!G58","v":0},null,null,null,0,null,null,null,0,0]
[null,50,null,null,{"$f":"SW!G59","v":0},null,null,null,0,null,null,null,0,0]
[null,51,null,null,{"$f":"SW!G60","v":0},null,null,null,0,null,null,null,0,0]
[null,52,null,null,{"$f":"SW!G61","v":0},null,null,null,0,null,null,null,0,0]
[null,53,null,null,{"$f":"SW!G62","v":0},null,null,null,0,null,null,null,0,0]
[null,54,null,null,{"$f":"SW!G63","v":0},null,null,null,0,null,null,null,0,0]
[null,55,null,null,{"$f":"SW!G64","v":0},null,null,null,0,null,null,null,0,0]
[null,56,null,null,{"$f":"SW!G65","v":0},null,null,null,0,null,null,null,0,0]
[null,57,null,null,{"$f":"SW!G66","v":0},null,null,null,0,null,null,null,0,0]
[null,58,null,null,{"$f":"SW!G67","v":0},null,null,null,0,null,null,null,0,0]
[null,59,null,null,{"$f":"SW!G68","v":0},null,null,null,0,null,null,null,0,0]
[null,60,null,null,{"$f":"SW!G69","v":0},null,null,null,0,null,null,null,0,0]
[null,61,null,null,{"$f":"SW!G70","v":0},null,null,null,0,null,null,null,0,0]
[null,62,null,null,{"$f":"SW!G71","v":0},null,null,null,0,null,null,null,0,0]
[null,63,null,null,{"$f":"SW!G72","v":0},null,null,null,0,null,null,null,0,0]
[null,64,null,null,{"$f":"SW!G73","v":0},null,null,null,0,null,null,null,0,0]
[null,65,null,null,{"$f":"SW!G74","v":0},null,null,null,0,null,null,null,0,0]
[null,66,null,null,{"$f":"SW!G75","v":0},null,null,null,{"$f":"$I$10*F76","v":0},null,null,null,{"$f":"J76*$M$10","v":0},{"$f":"IFERROR(ROUND(AVERAGE(M76+I76),0),\"\")","v":0}]
[null,67,null,null,{"$f":"SW!G76","v":0},null,null,null,0,null,null,null,0,0]
[null,68,null,null,{"$f":"SW!G77","v":0},null,null,null,0,null,null,null,0,0]
[null,69,null,null,{"$f":"SW!G78","v":0},null,null,null,0,null,null,null,0,0]
[null,70,null,null,{"$f":"SW!G79","v":0},null,null,null,0,null,null,null,0,0]
[null,71,null,null,{"$f":"SW!G80","v":0},null,null,null,0,null,null,null,0,0]
[null,72,null,null,{"$f":"SW!G81","v":0},null,null,null,0,null,null,null,0,0]
[null,73,null,null,{"$f":"SW!G82","v":0},null,null,null,0,null,null,null,0,0]
[null,74,null,null,{"$f":"SW!G83","v":0},null,null,null,0,null,null,null,0,0]
[null,75,null,null,{"$f":"SW!G84","v":0},null,null,null,0,null,null,null,0,0]
[null,76,null,null,{"$f":"SW!G85","v":0},null,null,null,0,null,null,null,0,0]
[null,77,null,null,{"$f":"SW!G86","v":0},null,null,null,0,null,null,null,0,0]
[null,78,null,null,{"$f":"SW!G87","v":0},null,null,null,0,null,null,null,0,0]
[null,79,null,null,{"$f":"SW!G88","v":0},null,null,null,0,null,null,null,0,0]
[null,80,null,null,{"$f":"SW!G89","v":0},null,null,null,0,null,null,null,0,0]
[null,81,null,null,{"$f":"SW!G90","v":0},null,null,null,0,null,null,null,0,0]
[null,82,null,null,{"$f":"SW!G91","v":0},null,null,null,0,null,null,null,0,0]
[null,83,null,null,{"$f":"SW!G92","v":0},null,null,null,0,null,null,null,0,0]
[null,84,null,null,{"$f":"SW!G93","v":0},null,null,null,0,null,null,null,0,0]
[null,85,null,null,{"$f":"SW!G94","v":0},null,null,null,0,null,null,null,0,0]
[null,86,null,null,{"$f":"SW!G95","v":0},null,null,null,0,null,null,null,0,0]
[null,87,null,null,{"$f":"SW!G96","v":0},null,null,null,0,null,null,null,0,0]
[null,88,null,null,{"$f":"SW!G97","v":0},null,null,null,0,null,null,null,0,0]
[null,89,null,null,{"$f":"SW!G98","v":0},null,null,null,0,null,null,null,0,0]

{"sheet":"SKI","index":15,"n_rows":99,"n_cols":15,"rows_kept":99,"cut":false,"hidden":false,"merged":[[98,5,98,7],[98,9,98,11],[98,13,98,16],[96,5,96,7],[96,9,96,11],[96,13,96,16],[97,5,97,7],[97,9,97,11],[97,13,97,16],[94,5,94,7],[94,9,94,11],[94,13,94,16],[95,5,95,7],[95,9,95,11],[95,13,95,16],[92,5,92,7],[92,9,92,11],[92,13,92,16],[93,5,93,7],[93,9,93,11],[93,13,93,16],[90,5,90,7],[90,9,90,11],[90,13,90,16],[91,5,91,7],[91,9,91,11],[91,13,91,16],[88,5,88,7],[88,9,88,11],[88,13,88,16],[89,5,89,7],[89,9,89,11],[89,13,89,16],[86,5,86,7],[86,9,86,11],[86,13,86,16],[87,5,87,7],[87,9,87,11],[87,13,87,16],[84,5,84,7],[84,9,84,11],[84,13,84,16],[85,5,85,7],[85,9,85,11],[85,13,85,16],[82,5,82,7],[82,9,82,11],[82,13,82,16],[83,5,83,7],[83,9,83,11],[83,13,83,16],[80,5,80,7],[80,9,80,11],[80,13,80,16],[81,5,81,7],[81,9,81,11],[81,13,81,16],[78,5,78,7],[78,9,78,11],[78,13,78,16],[79,5,79,7],[79,9,79,11],[79,13,79,16],[76,5,76,7],[76,9,76,11],[76,13,76,16],[77,5,77,7],[77,9,77,11],[77,13,77,16],[74,5,74,7],[74,9,74,11],[74,13,74,16],[75,5,75,7],[75,9,75,11],[75,13,75,16],[72,5,72,7],[72,9,72,11],[72,13,72,16],[73,5,73,7],[73,9,73,11],[73,13,73,16],[70,5,70,7],[70,9,70,11],[70,13,70,16],[71,5,71,7],[71,9,71,11],[71,13,71,16],[68,5,68,7],[68,9,68,11],[68,13,68,16],[69,5,69,7],[69,9,69,11],[69,13,69,16],[66,5,66,7],[66,9,66,11],[66,13,66,16],[67,5,67,7],[67,9,67,11],[67,13,67,16],[64,5,64,7],[64,9,64,11],[64,13,64,16],[65,5,65,7],[65,9,65,11],[65,13,65,16],[62,5,62,7],[62,9,62,11],[62,13,62,16],[63,5,63,7],[63,9,63,11],[63,13,63,16],[60,5,60,7],[60,9,60,11],[60,13,60,16],[61,5,61,7],[61,9,61,11],[61,13,61,16],[58,5,58,7],[58,9,58,11],[58,13,58,16],[59,5,59,7],[59,9,59,11],[59,13,59,16],[56,5,56,7],[56,9,56,11],[56,13,56,16],[57,5,57,7],[57,9,57,11],[57,13,57,16],[54,5,54,7],[54,9,54,11],[54,13,54,16],[55,5,55,7],[55,9,55,11],[55,13,55,16],[52,5,52,7],[52,9,52,11],[52,13,52,16],[53,5,53,7],[53,9,53,11],[53,13,53,16],[50,5,50,7],[50,9,50,11],[50,13,50,16],[51,5,51,7],[51,9,51,11],[51,13,51,16],[48,5,48,7],[48,9,48,11],[48,13,48,16],[49,5,49,7],[49,9,49,11],[49,13,49,16],[46,5,46,7],[46,9,46,11],[46,13,46,16],[47,5,47,7],[47,9,47,11],[47,13,47,16],[44,5,44,7],[44,9,44,11],[44,13,44,16],[45,5,45,7],[45,9,45,11],[45,13,45,16],[42,5,42,7],[42,9,42,11],[42,13,42,16],[43,5,43,7],[43,9,43,11],[43,13,43,16],[40,5,40,7],[40,9,40,11],[40,13,40,16],[41,5,41,7],[41,9,41,11],[41,13,41,16],[38,5,38,7],[38,9,38,11],[38,13,38,16],[39,5,39,7],[39,9,39,11],[39,13,39,16],[36,5,36,7],[36,9,36,11],[36,13,36,16],[37,5,37,7],[37,9,37,11],[37,13,37,16],[34,5,34,7],[34,9,34,11],[34,13,34,16],[35,5,35,7],[35,9,35,11],[35,13,35,16],[32,5,32,7],[32,9,32,11],[32,13,32,16],[33,5,33,7],[33,9,33,11],[33,13,33,16],[30,5,30,7],[30,9,30,11],[30,13,30,16],[31,5,31,7],[31,9,31,11],[31,13,31,16],[28,5,28,7],[28,9,28,11],[28,13,28,16],[29,5,29,7],[29,9,29,11],[29,13,29,16],[26,5,26,7],[26,9,26,11],[26,13,26,16],[27,5,27,7],[27,9,27,11],[27,13,27,16],[24,5,24,7],[24,9,24,11],[24,13,24,16],[25,5,25,7],[25,9,25,11],[25,13,25,16],[22,5,22,7],[22,9,22,11],[22,13,22,16],[23,5,23,7],[23,9,23,11],[23,13,23,16],[20,5,20,7],[20,9,20,11],[20,13,20,16],[21,5,21,7],[21,9,21,11],[21,13,21,16],[18,5,18,7],[18,9,18,11],[18,13,18,16],[19,5,19,7],[19,9,19,11],[19,13,19,16],[16,5,16,7],[16,9,16,11],[16,13,16,16],[17,5,17,7],[17,9,17,11],[17,13,17,16],[14,5,14,7],[14,9,14,11],[14,13,14,16],[15,5,15,7],[15,9,15,11],[15,13,15,16],[12,5,12,7],[12,9,12,11],[12,13,12,16],[13,5,13,7],[13,9,13,11],[13,13,13,16],[9,9,9,11],[10,5,10,7],[10,9,10,11],[10,13,10,16],[11,5,11,7],[11,9,11,11],[11,13,11,16],[1,1,1,16],[3,6,3,12],[3,14,5,15],[4,6,4,12],[5,6,5,12],[8,1,9,1],[8,4,9,4],[8,5,8,12],[8,13,9,16],[9,5,9,7]]}
[]
[null,"D A F T A R   N I L A I"]
[]
[null,"MATA PELAJARAN",null,null,null,":","Sejarah Kebudayaan Islam",null,null,null,null,null,null,null,"↗"]
[null,"KELAS",null,null,null,":",{"$f":"UPPER(MN!D22)","v":"VI B"}]
[null,"TAHUN PELAJARAN",null,null,null,":",{"$f":"MN!D18","v":"2019 - 2020"}]
[]
[]
[null,"No","No. Induk","NISN","Nama Siswa","NILAI",null,null,null,null,null,null,null,"JUMLAH"]
[null,null,null,null,null,"PG",null,null,0.5,"ESSAY",null,null,{"$f":"100%-I10","v":0.5}]
[null,1,null,null,{"$f":"SW!G10","v":"ACHID ATHIRIL ARDAN"},40,null,null,{"$f":"$I$10*F11","v":20},50,null,null,{"$f":"J11*$M$10","v":25},{"$f":"IFERROR(ROUND(AVERAGE(M11+I11),0),\"\")","v":45}]
[null,2,null,null,{"$f":"SW!G11","v":"ACHMAD SEPTIAN HAMDANI"},30,null,null,{"$f":"$I$10*F12","v":15},60,null,null,{"$f":"J12*$M$10","v":30},{"$f":"IFERROR(ROUND(AVERAGE(M12+I12),0),\"\")","v":45}]
[null,3,null,null,{"$f":"SW!G12","v":"ACHMAD SULAIMAN"},13,null,null,6.5,50,null,null,25,32]
[null,4,null,null,{"$f":"SW!G13","v":"AIRLANGGA DWIKA RIZQI"},13,null,null,6.5,40,null,null,20,27]
[null,5,null,null,{"$f":"SW!G14","v":"AUFAN AZKAL ABRORI"},37,null,null,18.5,50,null,null,25,44]
[null,6,null,null,{"$f":"SW!G15","v":"AZZA PRISHAL DWI PUTRA"},20,null,null,10,50,null,null,25,35]
[null,7,null,null,{"$f":"SW!G16","v":"EKA AULIYA` PUTRI"},40,null,null,20,80,null,null,40,60]
[null,8,null,null,{"$f":"SW!G17","v":"ERSA PUSPITA EKA ROSA LINDA"},40,null,null,20,70,null,null,35,55]
[null,9,null,null,{"$f":"SW!G18","v":"FABIYAN TRI BAKTI OKTAFIAN"},23,null,null,11.5,60,null,null,30,42]
[null,10,null,null,{"$f":"SW!G19","v":"FELISITA APRILIA NUR NIHAYA"},37,null,null,18.5,80,null,null,40,59]
[null,11,null,null,{"$f":"SW!G20","v":"FIRDA DWI ANDRIANI"},20,null,null,10,60,null,null,30,40]
[null,12,null,null,{"$f":"SW!G21","v":"GILANG AKBAR PRASETYO"},27,null,null,13.5,50,null,null,25,39]
[null,13,null,null,{"$f":"SW!G22","v":"IFTAH IZZAH EMILIA  MAHMUD"},33,null,null,16.5,60,null,null,30,47]
[null,14,null,null,{"$f":"SW!G23","v":"INES ARIFANI MAULINA"},33,null,null,16.5,80,null,null,40,57]
[null,15,null,null,{"$f":"SW!G24","v":"IYAAD  AFLAKHA RAMZII"},40,null,null,20,70,null,null,35,55]
[null,16,null,null,{"$f":"SW!G25","v":"JULI ANDRIYANTO"},37,null,null,18.5,50,null,null,25,44]
[null,17,null,null,{"$f":"SW!G26","v":"LIYA FEBRIYANI"},47,null,null,23.5,90,null,null,45,69]
[null,18,null,null,{"$f":"SW!G27","v":"LIZATUL CHAIYUNI"},37,null,null,18.5,80,null,null,40,59]
[null,19,null,null,{"$f":"SW!G28","v":"M.AL HAFIZ"},49,null,null,24.5,50,null,null,25,50]
[null,20,null,null,{"$f":"SW!G29","v":"M. RIZKY RIDWAN"},17,null,null,8.5,40,null,null,20,29]
[null,21,null,null,{"$f":"SW!G30","v":"MOCHAMAD RAFLI DIAN SAPUTRA"},30,null,null,15,50,null,null,25,40]
[null,22,null,null,{"$f":"SW!G31","v":"MOCHAMMAD AFAREL PUTRA RAMDHANA"},23,null,null,11.5,60,null,null,30,42]
[null,23,null,null,{"$f":"SW!G32","v":"MUHAMAD JEFRI MAULANA"},37,null,null,18.5,70,null,null,35,54]
[null,24,null,null,{"$f":"SW!G33","v":"MUHAMMAD DWI WILDAN BAGUS KURNIAWAN"},43,null,null,21.5,50,null,null,25,47]
[null,25,null,null,{"$f":"SW!G34","v":"MUHAMMAD FARIL FIRMANSYA"},20,null,null,10,60,null,null,30,40]
[null,26,null,null,{"$f":"SW!G35","v":"MUHAMMAD FARIZ UBAIDILLA"},43,null,null,21.5,60,null,null,30,52]
[null,27,null,null,{"$f":"SW!G36","v":"MUHAMMAD MAULANA ZIDANIL ILMI"},47,null,null,23.5,70,null,null,35,59]
[null,28,null,null,{"$f":"SW!G37","v":"MUHAMMAD SUTRISNO ISMAIL"},33,null,null,16.5,50,null,null,25,42]
[null,29,null,null,{"$f":"SW!G38","v":"NOVITA ERNIAWAN"},27,null,null,13.5,80,null,null,40,54]
[null,30,null,null,{"$f":"SW!G39","v":"PUTRI AULIA DWI AGUSTIN"},23,null,null,11.5,70,null,null,35,47]
[null,31,null,null,{"$f":"SW!G40","v":"STANY RAFIDAH RAHMANIA"},13,null,null,6.5,60,null,null,30,37]
[null,32,null,null,{"$f":"SW!G41","v":"USWATUN KHASANAH"},33,null,null,16.5,50,null,null,25,42]
[null,33,null,null,{"$f":"SW!G42","v":"VIKROUL KHAMILA"},20,null,null,10,70,null,null,35,45]
[null,34,null,null,{"$f":"SW!G43","v":0},null,null,null,0,null,null,null,0,0]
[null,35,null,null,{"$f":"SW!G44","v":0},null,null,null,0,null,null,null,0,0]
[null,36,null,null,{"$f":"SW!G45","v":0},null,null,null,0,null,null,null,0,0]
[null,37,null,null,{"$f":"SW!G46","v":0},null,null,null,0,null,null,null,0,0]
[null,38,null,null,{"$f":"SW!G47","v":0},null,null,null,0,null,null,null,0,0]
[null,39,null,null,{"$f":"SW!G48","v":0},null,null,null,0,null,null,null,0,0]
[null,40,null,null,{"$f":"SW!G49","v":0},null,null,null,0,null,null,null,0,0]
[null,41,null,null,{"$f":"SW!G50","v":0},null,null,null,0,null,null,null,0,0]
[null,42,null,null,{"$f":"SW!G51","v":0},null,null,null,0,null,null,null,0,0]
[null,43,null,null,{"$f":"SW!G52","v":0},null,null,null,0,null,null,null,0,0]
[null,44,null,null,{"$f":"SW!G53","v":0},null,null,null,0,null,null,null,0,0]
[null,45,null,null,{"$f":"SW!G54","v":0},null,null,null,0,null,null,null,0,0]
[null,46,null,null,{"$f":"SW!G55","v":0},null,null,null,0,null,null,null,0,0]
[null,47,null,null,{"$f":"SW!G56","v":0},null,null,null,0,null,null,null,0,0]
[null,48,null,null,{"$f":"SW!G57","v":0},null,null,null,0,null,null,null,0,0]
[null,49,null,null,{"$f":"SW!G58","v":0},null,null,null,0,null,null,null,0,0]
[null,50,null,null,{"$f":"SW!G59","v":0},null,null,null,0,null,null,null,0,0]
[null,51,null,null,{"$f":"SW!G60","v":0},null,null,null,0,null,null,null,0,0]
[null,52,null,null,{"$f":"SW!G61","v":0},null,null,null,0,null,null,null,0,0]
[null,53,null,null,{"$f":"SW!G62","v":0},null,null,null,0,null,null,null,0,0]
[null,54,null,null,{"$f":"SW!G63","v":0},null,null,null,0,null,null,null,0,0]
[null,55,null,null,{"$f":"SW!G64","v":0},null,null,null,0,null,null,null,0,0]
[null,56,null,null,{"$f":"SW!G65","v":0},null,null,null,0,null,null,null,0,0]
[null,57,null,null,{"$f":"SW!G66","v":0},null,null,null,0,null,null,null,0,0]
[null,58,null,null,{"$f":"SW!G67","v":0},null,null,null,0,null,null,null,0,0]
[null,59,null,null,{"$f":"SW!G68","v":0},null,null,null,0,null,null,null,0,0]
[null,60,null,null,{"$f":"SW!G69","v":0},null,null,null,0,null,null,null,0,0]
[null,61,null,null,{"$f":"SW!G70","v":0},null,null,null,0,null,null,null,0,0]
[null,62,null,null,{"$f":"SW!G71","v":0},null,null,null,0,null,null,null,0,0]
[null,63,null,null,{"$f":"SW!G72","v":0},null,null,null,0,null,null,null,0,0]
[null,64,null,null,{"$f":"SW!G73","v":0},null,null,null,0,null,null,null,0,0]
[null,65,null,null,{"$f":"SW!G74","v":0},null,null,null,0,null,null,null,0,0]
[null,66,null,null,{"$f":"SW!G75","v":0},null,null,null,{"$f":"$I$10*F76","v":0},null,null,null,{"$f":"J76*$M$10","v":0},{"$f":"IFERROR(ROUND(AVERAGE(M76+I76),0),\"\")","v":0}]
[null,67,null,null,{"$f":"SW!G76","v":0},null,null,null,0,null,null,null,0,0]
[null,68,null,null,{"$f":"SW!G77","v":0},null,null,null,0,null,null,null,0,0]
[null,69,null,null,{"$f":"SW!G78","v":0},null,null,null,0,null,null,null,0,0]
[null,70,null,null,{"$f":"SW!G79","v":0},null,null,null,0,null,null,null,0,0]
[null,71,null,null,{"$f":"SW!G80","v":0},null,null,null,0,null,null,null,0,0]
[null,72,null,null,{"$f":"SW!G81","v":0},null,null,null,0,null,null,null,0,0]
[null,73,null,null,{"$f":"SW!G82","v":0},null,null,null,0,null,null,null,0,0]
[null,74,null,null,{"$f":"SW!G83","v":0},null,null,null,0,null,null,null,0,0]
[null,75,null,null,{"$f":"SW!G84","v":0},null,null,null,0,null,null,null,0,0]
[null,76,null,null,{"$f":"SW!G85","v":0},null,null,null,0,null,null,null,0,0]
[null,77,null,null,{"$f":"SW!G86","v":0},null,null,null,0,null,null,null,0,0]
[null,78,null,null,{"$f":"SW!G87","v":0},null,null,null,0,null,null,null,0,0]
[null,79,null,null,{"$f":"SW!G88","v":0},null,null,null,0,null,null,null,0,0]
[null,80,null,null,{"$f":"SW!G89","v":0},null,null,null,0,null,null,null,0,0]
[null,81,null,null,{"$f":"SW!G90","v":0},null,null,null,0,null,null,null,0,0]
[null,82,null,null,{"$f":"SW!G91","v":0},null,null,null,0,null,null,null,0,0]
[null,83,null,null,{"$f":"SW!G92","v":0},null,null,null,0,null,null,null,0,0]
[null,84,null,null,{"$f":"SW!G93","v":0},null,null,null,0,null,null,null,0,0]
[null,85,null,null,{"$f":"SW!G94","v":0},null,null,null,0,null,null,null,0,0]
[null,86,null,null,{"$f":"SW!G95","v":0},null,null,null,0,null,null,null,0,0]
[null,87,null,null,{"$f":"SW!G96","v":0},null,null,null,0,null,null,null,0,0]
[null,88,null,null,{"$f":"SW!G97","v":0},null,null,null,0,null,null,null,0,0]
[null,89,null,null,{"$f":"SW!G98","v":0},null,null,null,0,null,null,null,0,0]

{"sheet":"BA","index":16,"n_rows":99,"n_cols":15,"rows_kept":99,"cut":false,"hidden":false,"merged":[[98,5,98,7],[98,9,98,11],[98,13,98,16],[96,5,96,7],[96,9,96,11],[96,13,96,16],[97,5,97,7],[97,9,97,11],[97,13,97,16],[94,5,94,7],[94,9,94,11],[94,13,94,16],[95,5,95,7],[95,9,95,11],[95,13,95,16],[92,5,92,7],[92,9,92,11],[92,13,92,16],[93,5,93,7],[93,9,93,11],[93,13,93,16],[90,5,90,7],[90,9,90,11],[90,13,90,16],[91,5,91,7],[91,9,91,11],[91,13,91,16],[88,5,88,7],[88,9,88,11],[88,13,88,16],[89,5,89,7],[89,9,89,11],[89,13,89,16],[86,5,86,7],[86,9,86,11],[86,13,86,16],[87,5,87,7],[87,9,87,11],[87,13,87,16],[84,5,84,7],[84,9,84,11],[84,13,84,16],[85,5,85,7],[85,9,85,11],[85,13,85,16],[82,5,82,7],[82,9,82,11],[82,13,82,16],[83,5,83,7],[83,9,83,11],[83,13,83,16],[80,5,80,7],[80,9,80,11],[80,13,80,16],[81,5,81,7],[81,9,81,11],[81,13,81,16],[78,5,78,7],[78,9,78,11],[78,13,78,16],[79,5,79,7],[79,9,79,11],[79,13,79,16],[76,5,76,7],[76,9,76,11],[76,13,76,16],[77,5,77,7],[77,9,77,11],[77,13,77,16],[74,5,74,7],[74,9,74,11],[74,13,74,16],[75,5,75,7],[75,9,75,11],[75,13,75,16],[72,5,72,7],[72,9,72,11],[72,13,72,16],[73,5,73,7],[73,9,73,11],[73,13,73,16],[70,5,70,7],[70,9,70,11],[70,13,70,16],[71,5,71,7],[71,9,71,11],[71,13,71,16],[68,5,68,7],[68,9,68,11],[68,13,68,16],[69,5,69,7],[69,9,69,11],[69,13,69,16],[66,5,66,7],[66,9,66,11],[66,13,66,16],[67,5,67,7],[67,9,67,11],[67,13,67,16],[64,5,64,7],[64,9,64,11],[64,13,64,16],[65,5,65,7],[65,9,65,11],[65,13,65,16],[62,5,62,7],[62,9,62,11],[62,13,62,16],[63,5,63,7],[63,9,63,11],[63,13,63,16],[60,5,60,7],[60,9,60,11],[60,13,60,16],[61,5,61,7],[61,9,61,11],[61,13,61,16],[58,5,58,7],[58,9,58,11],[58,13,58,16],[59,5,59,7],[59,9,59,11],[59,13,59,16],[56,5,56,7],[56,9,56,11],[56,13,56,16],[57,5,57,7],[57,9,57,11],[57,13,57,16],[54,5,54,7],[54,9,54,11],[54,13,54,16],[55,5,55,7],[55,9,55,11],[55,13,55,16],[52,5,52,7],[52,9,52,11],[52,13,52,16],[53,5,53,7],[53,9,53,11],[53,13,53,16],[50,5,50,7],[50,9,50,11],[50,13,50,16],[51,5,51,7],[51,9,51,11],[51,13,51,16],[48,5,48,7],[48,9,48,11],[48,13,48,16],[49,5,49,7],[49,9,49,11],[49,13,49,16],[46,5,46,7],[46,9,46,11],[46,13,46,16],[47,5,47,7],[47,9,47,11],[47,13,47,16],[44,5,44,7],[44,9,44,11],[44,13,44,16],[45,5,45,7],[45,9,45,11],[45,13,45,16],[42,5,42,7],[42,9,42,11],[42,13,42,16],[43,5,43,7],[43,9,43,11],[43,13,43,16],[40,5,40,7],[40,9,40,11],[40,13,40,16],[41,5,41,7],[41,9,41,11],[41,13,41,16],[38,5,38,7],[38,9,38,11],[38,13,38,16],[39,5,39,7],[39,9,39,11],[39,13,39,16],[36,5,36,7],[36,9,36,11],[36,13,36,16],[37,5,37,7],[37,9,37,11],[37,13,37,16],[34,5,34,7],[34,9,34,11],[34,13,34,16],[35,5,35,7],[35,9,35,11],[35,13,35,16],[32,5,32,7],[32,9,32,11],[32,13,32,16],[33,5,33,7],[33,9,33,11],[33,13,33,16],[30,5,30,7],[30,9,30,11],[30,13,30,16],[31,5,31,7],[31,9,31,11],[31,13,31,16],[28,5,28,7],[28,9,28,11],[28,13,28,16],[29,5,29,7],[29,9,29,11],[29,13,29,16],[26,5,26,7],[26,9,26,11],[26,13,26,16],[27,5,27,7],[27,9,27,11],[27,13,27,16],[24,5,24,7],[24,9,24,11],[24,13,24,16],[25,5,25,7],[25,9,25,11],[25,13,25,16],[22,5,22,7],[22,9,22,11],[22,13,22,16],[23,5,23,7],[23,9,23,11],[23,13,23,16],[20,5,20,7],[20,9,20,11],[20,13,20,16],[21,5,21,7],[21,9,21,11],[21,13,21,16],[18,5,18,7],[18,9,18,11],[18,13,18,16],[19,5,19,7],[19,9,19,11],[19,13,19,16],[16,5,16,7],[16,9,16,11],[16,13,16,16],[17,5,17,7],[17,9,17,11],[17,13,17,16],[14,5,14,7],[14,9,14,11],[14,13,14,16],[15,5,15,7],[15,9,15,11],[15,13,15,16],[12,5,12,7],[12,9,12,11],[12,13,12,16],[13,5,13,7],[13,9,13,11],[13,13,13,16],[9,9,9,11],[10,5,10,7],[10,9,10,11],[10,13,10,16],[11,5,11,7],[11,9,11,11],[11,13,11,16],[1,1,1,16],[3,6,3,12],[3,14,5,15],[4,6,4,12],[5,6,5,12],[8,1,9,1],[8,4,9,4],[8,5,8,12],[8,13,9,16],[9,5,9,7]]}
[]
[null,"D A F T A R   N I L A I"]
[]
[null,"MATA PELAJARAN",null,null,null,":","Bahasa Arab",null,null,null,null,null,null,null,"↗"]
[null,"KELAS",null,null,null,":",{"$f":"UPPER(MN!D22)","v":"VI B"}]
[null,"TAHUN PELAJARAN",null,null,null,":",{"$f":"MN!D18","v":"2019 - 2020"}]
[]
[]
[null,"No","No. Induk","NISN","Nama Siswa","NILAI",null,null,null,null,null,null,null,"JUMLAH"]
[null,null,null,null,null,"PG",null,null,0.5,"ESSAY",null,null,{"$f":"100%-I10","v":0.5}]
[null,1,null,null,{"$f":"SW!G10","v":"ACHID ATHIRIL ARDAN"},17,null,null,{"$f":"$I$10*F11","v":8.5},20,null,null,{"$f":"J11*$M$10","v":10},{"$f":"IFERROR(ROUND(AVERAGE(M11+I11),0),\"\")","v":19}]
[null,2,null,null,{"$f":"SW!G11","v":"ACHMAD SEPTIAN HAMDANI"},33,null,null,{"$f":"$I$10*F12","v":16.5},40,null,null,{"$f":"J12*$M$10","v":20},{"$f":"IFERROR(ROUND(AVERAGE(M12+I12),0),\"\")","v":37}]
[null,3,null,null,{"$f":"SW!G12","v":"ACHMAD SULAIMAN"},17,null,null,8.5,40,null,null,20,29]
[null,4,null,null,{"$f":"SW!G13","v":"AIRLANGGA DWIKA RIZQI"},23,null,null,11.5,20,null,null,10,22]
[null,5,null,null,{"$f":"SW!G14","v":"AUFAN AZKAL ABRORI"},13,null,null,6.5,40,null,null,20,27]
[null,6,null,null,{"$f":"SW!G15","v":"AZZA PRISHAL DWI PUTRA"},37,null,null,18.5,40,null,null,20,39]
[null,7,null,null,{"$f":"SW!G16","v":"EKA AULIYA` PUTRI"},13,null,null,6.5,40,null,null,20,27]
[null,8,null,null,{"$f":"SW!G17","v":"ERSA PUSPITA EKA ROSA LINDA"},17,null,null,8.5,40,null,null,20,29]
[null,9,null,null,{"$f":"SW!G18","v":"FABIYAN TRI BAKTI OKTAFIAN"},30,null,null,15,40,null,null,20,35]
[null,10,null,null,{"$f":"SW!G19","v":"FELISITA APRILIA NUR NIHAYA"},20,null,null,10,40,null,null,20,30]
[null,11,null,null,{"$f":"SW!G20","v":"FIRDA DWI ANDRIANI"},40,null,null,20,40,null,null,20,40]
[null,12,null,null,{"$f":"SW!G21","v":"GILANG AKBAR PRASETYO"},27,null,null,13.5,20,null,null,10,24]
[null,13,null,null,{"$f":"SW!G22","v":"IFTAH IZZAH EMILIA  MAHMUD"},10,null,null,5,40,null,null,20,25]
[null,14,null,null,{"$f":"SW!G23","v":"INES ARIFANI MAULINA"},30,null,null,15,40,null,null,20,35]
[null,15,null,null,{"$f":"SW!G24","v":"IYAAD  AFLAKHA RAMZII"},37,null,null,18.5,40,null,null,20,39]
[null,16,null,null,{"$f":"SW!G25","v":"JULI ANDRIYANTO"},10,null,null,5,40,null,null,20,25]
[null,17,null,null,{"$f":"SW!G26","v":"LIYA FEBRIYANI"},43,null,null,21.5,60,null,null,30,52]
[null,18,null,null,{"$f":"SW!G27","v":"LIZATUL CHAIYUNI"},23,null,null,11.5,60,null,null,30,42]
[null,19,null,null,{"$f":"SW!G28","v":"M.AL HAFIZ"},23,null,null,11.5,40,null,null,20,32]
[null,20,null,null,{"$f":"SW!G29","v":"M. RIZKY RIDWAN"},20,null,null,10,40,null,null,20,30]
[null,21,null,null,{"$f":"SW!G30","v":"MOCHAMAD RAFLI DIAN SAPUTRA"},20,null,null,10,20,null,null,10,20]
[null,22,null,null,{"$f":"SW!G31","v":"MOCHAMMAD AFAREL PUTRA RAMDHANA"},33,null,null,16.5,20,null,null,10,27]
[null,23,null,null,{"$f":"SW!G32","v":"MUHAMAD JEFRI MAULANA"},17,null,null,8.5,40,null,null,20,29]
[null,24,null,null,{"$f":"SW!G33","v":"MUHAMMAD DWI WILDAN BAGUS KURNIAWAN"},20,null,null,10,20,null,null,10,20]
[null,25,null,null,{"$f":"SW!G34","v":"MUHAMMAD FARIL FIRMANSYA"},30,null,null,15,40,null,null,20,35]
[null,26,null,null,{"$f":"SW!G35","v":"MUHAMMAD FARIZ UBAIDILLA"},20,null,null,10,20,null,null,10,20]
[null,27,null,null,{"$f":"SW!G36","v":"MUHAMMAD MAULANA ZIDANIL ILMI"},33,null,null,16.5,60,null,null,30,47]
[null,28,null,null,{"$f":"SW!G37","v":"MUHAMMAD SUTRISNO ISMAIL"},20,null,null,10,40,null,null,20,30]
[null,29,null,null,{"$f":"SW!G38","v":"NOVITA ERNIAWAN"},40,null,null,20,40,null,null,20,40]
[null,30,null,null,{"$f":"SW!G39","v":"PUTRI AULIA DWI AGUSTIN"},40,null,null,20,60,null,null,30,50]
[null,31,null,null,{"$f":"SW!G40","v":"STANY RAFIDAH RAHMANIA"},20,null,null,10,40,null,null,20,30]
[null,32,null,null,{"$f":"SW!G41","v":"USWATUN KHASANAH"},23,null,null,11.5,40,null,null,20,32]
[null,33,null,null,{"$f":"SW!G42","v":"VIKROUL KHAMILA"},27,null,null,13.5,40,null,null,20,34]
[null,34,null,null,{"$f":"SW!G43","v":0},null,null,null,0,null,null,null,0,0]
[null,35,null,null,{"$f":"SW!G44","v":0},null,null,null,0,null,null,null,0,0]
[null,36,null,null,{"$f":"SW!G45","v":0},null,null,null,0,null,null,null,0,0]
[null,37,null,null,{"$f":"SW!G46","v":0},null,null,null,0,null,null,null,0,0]
[null,38,null,null,{"$f":"SW!G47","v":0},null,null,null,0,null,null,null,0,0]
[null,39,null,null,{"$f":"SW!G48","v":0},null,null,null,0,null,null,null,0,0]
[null,40,null,null,{"$f":"SW!G49","v":0},null,null,null,0,null,null,null,0,0]
[null,41,null,null,{"$f":"SW!G50","v":0},null,null,null,0,null,null,null,0,0]
[null,42,null,null,{"$f":"SW!G51","v":0},null,null,null,0,null,null,null,0,0]
[null,43,null,null,{"$f":"SW!G52","v":0},null,null,null,0,null,null,null,0,0]
[null,44,null,null,{"$f":"SW!G53","v":0},null,null,null,0,null,null,null,0,0]
[null,45,null,null,{"$f":"SW!G54","v":0},null,null,null,0,null,null,null,0,0]
[null,46,null,null,{"$f":"SW!G55","v":0},null,null,null,0,null,null,null,0,0]
[null,47,null,null,{"$f":"SW!G56","v":0},null,null,null,0,null,null,null,0,0]
[null,48,null,null,{"$f":"SW!G57","v":0},null,null,null,0,null,null,null,0,0]
[null,49,null,null,{"$f":"SW!G58","v":0},null,null,null,0,null,null,null,0,0]
[null,50,null,null,{"$f":"SW!G59","v":0},null,null,null,0,null,null,null,0,0]
[null,51,null,null,{"$f":"SW!G60","v":0},null,null,null,0,null,null,null,0,0]
[null,52,null,null,{"$f":"SW!G61","v":0},null,null,null,0,null,null,null,0,0]
[null,53,null,null,{"$f":"SW!G62","v":0},null,null,null,0,null,null,null,0,0]
[null,54,null,null,{"$f":"SW!G63","v":0},null,null,null,0,null,null,null,0,0]
[null,55,null,null,{"$f":"SW!G64","v":0},null,null,null,0,null,null,null,0,0]
[null,56,null,null,{"$f":"SW!G65","v":0},null,null,null,0,null,null,null,0,0]
[null,57,null,null,{"$f":"SW!G66","v":0},null,null,null,0,null,null,null,0,0]
[null,58,null,null,{"$f":"SW!G67","v":0},null,null,null,0,null,null,null,0,0]
[null,59,null,null,{"$f":"SW!G68","v":0},null,null,null,0,null,null,null,0,0]
[null,60,null,null,{"$f":"SW!G69","v":0},null,null,null,0,null,null,null,0,0]
[null,61,null,null,{"$f":"SW!G70","v":0},null,null,null,0,null,null,null,0,0]
[null,62,null,null,{"$f":"SW!G71","v":0},null,null,null,0,null,null,null,0,0]
[null,63,null,null,{"$f":"SW!G72","v":0},null,null,null,0,null,null,null,0,0]
[null,64,null,null,{"$f":"SW!G73","v":0},null,null,null,0,null,null,null,0,0]
[null,65,null,null,{"$f":"SW!G74","v":0},null,null,null,0,null,null,null,0,0]
[null,66,null,null,{"$f":"SW!G75","v":0},null,null,null,{"$f":"$I$10*F76","v":0},null,null,null,{"$f":"J76*$M$10","v":0},{"$f":"IFERROR(ROUND(AVERAGE(M76+I76),0),\"\")","v":0}]
[null,67,null,null,{"$f":"SW!G76","v":0},null,null,null,0,null,null,null,0,0]
[null,68,null,null,{"$f":"SW!G77","v":0},null,null,null,0,null,null,null,0,0]
[null,69,null,null,{"$f":"SW!G78","v":0},null,null,null,0,null,null,null,0,0]
[null,70,null,null,{"$f":"SW!G79","v":0},null,null,null,0,null,null,null,0,0]
[null,71,null,null,{"$f":"SW!G80","v":0},null,null,null,0,null,null,null,0,0]
[null,72,null,null,{"$f":"SW!G81","v":0},null,null,null,0,null,null,null,0,0]
[null,73,null,null,{"$f":"SW!G82","v":0},null,null,null,0,null,null,null,0,0]
[null,74,null,null,{"$f":"SW!G83","v":0},null,null,null,0,null,null,null,0,0]
[null,75,null,null,{"$f":"SW!G84","v":0},null,null,null,0,null,null,null,0,0]
[null,76,null,null,{"$f":"SW!G85","v":0},null,null,null,0,null,null,null,0,0]
[null,77,null,null,{"$f":"SW!G86","v":0},null,null,null,0,null,null,null,0,0]
[null,78,null,null,{"$f":"SW!G87","v":0},null,null,null,0,null,null,null,0,0]
[null,79,null,null,{"$f":"SW!G88","v":0},null,null,null,0,null,null,null,0,0]
[null,80,null,null,{"$f":"SW!G89","v":0},null,null,null,0,null,null,null,0,0]
[null,81,null,null,{"$f":"SW!G90","v":0},null,null,null,0,null,null,null,0,0]
[null,82,null,null,{"$f":"SW!G91","v":0},null,null,null,0,null,null,null,0,0]
[null,83,null,null,{"$f":"SW!G92","v":0},null,null,null,0,null,null,null,0,0]
[null,84,null,null,{"$f":"SW!G93","v":0},null,null,null,0,null,null,null,0,0]
[null,85,null,null,{"$f":"SW!G94","v":0},null,null,null,0,null,null,null,0,0]
[null,86,null,null,{"$f":"SW!G95","v":0},null,null,null,0,null,null,null,0,0]
[null,87,null,null,{"$f":"SW!G96","v":0},null,null,null,0,null,null,null,0,0]
[null,88,null,null,{"$f":"SW!G97","v":0},null,null,null,0,null,null,null,0,0]
[null,89,null,null,{"$f":"SW!G98","v":0},null,null,null,0,null,null,null,0,0]

{"sheet":"MLK1","index":17,"n_rows":99,"n_cols":15,"rows_kept":99,"cut":false,"hidden":false,"merged":[[9,9,9,11],[10,5,10,7],[10,9,10,11],[10,13,10,16],[11,5,11,7],[11,9,11,11],[11,13,11,16],[1,1,1,16],[3,6,3,12],[3,14,5,15],[4,6,4,12],[5,6,5,12],[8,1,9,1],[8,4,9,4],[8,5,8,12],[8,13,9,16],[9,5,9,7],[14,5,14,7],[14,9,14,11],[14,13,14,16],[15,5,15,7],[15,9,15,11],[15,13,15,16],[12,5,12,7],[12,9,12,11],[12,13,12,16],[13,5,13,7],[13,9,13,11],[13,13,13,16],[18,5,18,7],[18,9,18,11],[18,13,18,16],[19,5,19,7],[19,9,19,11],[19,13,19,16],[16,5,16,7],[16,9,16,11],[16,13,16,16],[17,5,17,7],[17,9,17,11],[17,13,17,16],[22,5,22,7],[22,9,22,11],[22,13,22,16],[23,5,23,7],[23,9,23,11],[23,13,23,16],[20,5,20,7],[20,9,20,11],[20,13,20,16],[21,5,21,7],[21,9,21,11],[21,13,21,16],[26,5,26,7],[26,9,26,11],[26,13,26,16],[27,5,27,7],[27,9,27,11],[27,13,27,16],[24,5,24,7],[24,9,24,11],[24,13,24,16],[25,5,25,7],[25,9,25,11],[25,13,25,16],[30,5,30,7],[30,9,30,11],[30,13,30,16],[31,5,31,7],[31,9,31,11],[31,13,31,16],[28,5,28,7],[28,9,28,11],[28,13,28,16],[29,5,29,7],[29,9,29,11],[29,13,29,16],[34,5,34,7],[34,9,34,11],[34,13,34,16],[35,5,35,7],[35,9,35,11],[35,13,35,16],[32,5,32,7],[32,9,32,11],[32,13,32,16],[33,5,33,7],[33,9,33,11],[33,13,33,16],[38,5,38,7],[38,9,38,11],[38,13,38,16],[39,5,39,7],[39,9,39,11],[39,13,39,16],[36,5,36,7],[36,9,36,11],[36,13,36,16],[37,5,37,7],[37,9,37,11],[37,13,37,16],[42,5,42,7],[42,9,42,11],[42,13,42,16],[43,5,43,7],[43,9,43,11],[43,13,43,16],[40,5,40,7],[40,9,40,11],[40,13,40,16],[41,5,41,7],[41,9,41,11],[41,13,41,16],[46,5,46,7],[46,9,46,11],[46,13,46,16],[47,5,47,7],[47,9,47,11],[47,13,47,16],[44,5,44,7],[44,9,44,11],[44,13,44,16],[45,5,45,7],[45,9,45,11],[45,13,45,16],[50,5,50,7],[50,9,50,11],[50,13,50,16],[51,5,51,7],[51,9,51,11],[51,13,51,16],[48,5,48,7],[48,9,48,11],[48,13,48,16],[49,5,49,7],[49,9,49,11],[49,13,49,16],[54,5,54,7],[54,9,54,11],[54,13,54,16],[55,5,55,7],[55,9,55,11],[55,13,55,16],[52,5,52,7],[52,9,52,11],[52,13,52,16],[53,5,53,7],[53,9,53,11],[53,13,53,16],[58,5,58,7],[58,9,58,11],[58,13,58,16],[59,5,59,7],[59,9,59,11],[59,13,59,16],[56,5,56,7],[56,9,56,11],[56,13,56,16],[57,5,57,7],[57,9,57,11],[57,13,57,16],[62,5,62,7],[62,9,62,11],[62,13,62,16],[63,5,63,7],[63,9,63,11],[63,13,63,16],[60,5,60,7],[60,9,60,11],[60,13,60,16],[61,5,61,7],[61,9,61,11],[61,13,61,16],[66,5,66,7],[66,9,66,11],[66,13,66,16],[67,5,67,7],[67,9,67,11],[67,13,67,16],[64,5,64,7],[64,9,64,11],[64,13,64,16],[65,5,65,7],[65,9,65,11],[65,13,65,16],[70,5,70,7],[70,9,70,11],[70,13,70,16],[71,5,71,7],[71,9,71,11],[71,13,71,16],[68,5,68,7],[68,9,68,11],[68,13,68,16],[69,5,69,7],[69,9,69,11],[69,13,69,16],[74,5,74,7],[74,9,74,11],[74,13,74,16],[75,5,75,7],[75,9,75,11],[75,13,75,16],[72,5,72,7],[72,9,72,11],[72,13,72,16],[73,5,73,7],[73,9,73,11],[73,13,73,16],[78,5,78,7],[78,9,78,11],[78,13,78,16],[79,5,79,7],[79,9,79,11],[79,13,79,16],[76,5,76,7],[76,9,76,11],[76,13,76,16],[77,5,77,7],[77,9,77,11],[77,13,77,16],[82,5,82,7],[82,9,82,11],[82,13,82,16],[83,5,83,7],[83,9,83,11],[83,13,83,16],[80,5,80,7],[80,9,80,11],[80,13,80,16],[81,5,81,7],[81,9,81,11],[81,13,81,16],[86,5,86,7],[86,9,86,11],[86,13,86,16],[87,5,87,7],[87,9,87,11],[87,13,87,16],[84,5,84,7],[84,9,84,11],[84,13,84,16],[85,5,85,7],[85,9,85,11],[85,13,85,16],[90,5,90,7],[90,9,90,11],[90,13,90,16],[91,5,91,7],[91,9,91,11],[91,13,91,16],[88,5,88,7],[88,9,88,11],[88,13,88,16],[89,5,89,7],[89,9,89,11],[89,13,89,16],[94,5,94,7],[94,9,94,11],[94,13,94,16],[95,5,95,7],[95,9,95,11],[95,13,95,16],[92,5,92,7],[92,9,92,11],[92,13,92,16],[93,5,93,7],[93,9,93,11],[93,13,93,16],[98,5,98,7],[98,9,98,11],[98,13,98,16],[96,5,96,7],[96,9,96,11],[96,13,96,16],[97,5,97,7],[97,9,97,11],[97,13,97,16]]}
[]
[null,"D A F T A R   N I L A I"]
[]
[null,"MATA PELAJARAN",null,null,null,":","NAKHWU SOROF",null,null,null,null,null,null,null,"↗"]
[null,"KELAS",null,null,null,":",{"$f":"UPPER(MN!D22)","v":"VI B"}]
[null,"TAHUN PELAJARAN",null,null,null,":",{"$f":"MN!D18","v":"2019 - 2020"}]
[]
[]
[null,"No","No. Induk","NISN","Nama Siswa","NILAI",null,null,null,null,null,null,null,"JUMLAH"]
[null,null,null,null,null,"PG",null,null,1,"ESSAY",null,null,{"$f":"100%-I10","v":0}]
[null,1,null,null,{"$f":"SW!G10","v":"ACHID ATHIRIL ARDAN"},30,null,null,{"$f":"$I$10*F11","v":30},null,null,null,{"$f":"J11*$M$10","v":0},{"$f":"IFERROR(ROUND(AVERAGE(M11+I11),0),\"\")","v":30}]
[null,2,null,null,{"$f":"SW!G11","v":"ACHMAD SEPTIAN HAMDANI"},10,null,null,{"$f":"$I$10*F12","v":10},null,null,null,{"$f":"J12*$M$10","v":0},{"$f":"IFERROR(ROUND(AVERAGE(M12+I12),0),\"\")","v":10}]
[null,3,null,null,{"$f":"SW!G12","v":"ACHMAD SULAIMAN"},10,null,null,10,null,null,null,0,10]
[null,4,null,null,{"$f":"SW!G13","v":"AIRLANGGA DWIKA RIZQI"},10,null,null,10,null,null,null,0,10]
[null,5,null,null,{"$f":"SW!G14","v":"AUFAN AZKAL ABRORI"},30,null,null,30,null,null,null,0,30]
[null,6,null,null,{"$f":"SW!G15","v":"AZZA PRISHAL DWI PUTRA"},30,null,null,30,null,null,null,0,30]
[null,7,null,null,{"$f":"SW!G16","v":"EKA AULIYA` PUTRI"},40,null,null,40,null,null,null,0,40]
[null,8,null,null,{"$f":"SW!G17","v":"ERSA PUSPITA EKA ROSA LINDA"},65,null,null,65,null,null,null,0,65]
[null,9,null,null,{"$f":"SW!G18","v":"FABIYAN TRI BAKTI OKTAFIAN"},40,null,null,40,null,null,null,0,40]
[null,10,null,null,{"$f":"SW!G19","v":"FELISITA APRILIA NUR NIHAYA"},40,null,null,40,null,null,null,0,40]
[null,11,null,null,{"$f":"SW!G20","v":"FIRDA DWI ANDRIANI"},30,null,null,30,null,null,null,0,30]
[null,12,null,null,{"$f":"SW!G21","v":"GILANG AKBAR PRASETYO"},20,null,null,20,null,null,null,0,20]
[null,13,null,null,{"$f":"SW!G22","v":"IFTAH IZZAH EMILIA  MAHMUD"},30,null,null,30,null,null,null,0,30]
[null,14,null,null,{"$f":"SW!G23","v":"INES ARIFANI MAULINA"},80,null,null,80,null,null,null,0,80]
[null,15,null,null,{"$f":"SW!G24","v":"IYAAD  AFLAKHA RAMZII"},30,null,null,30,null,null,null,0,30]
[null,16,null,null,{"$f":"SW!G25","v":"JULI ANDRIYANTO"},30,null,null,30,null,null,null,0,30]
[null,17,null,null,{"$f":"SW!G26","v":"LIYA FEBRIYANI"},70,null,null,70,null,null,null,0,70]
[null,18,null,null,{"$f":"SW!G27","v":"LIZATUL CHAIYUNI"},60,null,null,60,null,null,null,0,60]
[null,19,null,null,{"$f":"SW!G28","v":"M.AL HAFIZ"},20,null,null,20,null,null,null,0,20]
[null,20,null,null,{"$f":"SW!G29","v":"M. RIZKY RIDWAN"},20,null,null,20,null,null,null,0,20]
[null,21,null,null,{"$f":"SW!G30","v":"MOCHAMAD RAFLI DIAN SAPUTRA"},10,null,null,10,null,null,null,0,10]
[null,22,null,null,{"$f":"SW!G31","v":"MOCHAMMAD AFAREL PUTRA RAMDHANA"},10,null,null,10,null,null,null,0,10]
[null,23,null,null,{"$f":"SW!G32","v":"MUHAMAD JEFRI MAULANA"},20,null,null,20,null,null,null,0,20]
[null,24,null,null,{"$f":"SW!G33","v":"MUHAMMAD DWI WILDAN BAGUS KURNIAWAN"},20,null,null,20,null,null,null,0,20]
[null,25,null,null,{"$f":"SW!G34","v":"MUHAMMAD FARIL FIRMANSYA"},30,null,null,30,null,null,null,0,30]
[null,26,null,null,{"$f":"SW!G35","v":"MUHAMMAD FARIZ UBAIDILLA"},20,null,null,20,null,null,null,0,20]
[null,27,null,null,{"$f":"SW!G36","v":"MUHAMMAD MAULANA ZIDANIL ILMI"},50,null,null,50,null,null,null,0,50]
[null,28,null,null,{"$f":"SW!G37","v":"MUHAMMAD SUTRISNO ISMAIL"},30,null,null,30,null,null,null,0,30]
[null,29,null,null,{"$f":"SW!G38","v":"NOVITA ERNIAWAN"},40,null,null,40,null,null,null,0,40]
[null,30,null,null,{"$f":"SW!G39","v":"PUTRI AULIA DWI AGUSTIN"},50,null,null,50,null,null,null,0,50]
[null,31,null,null,{"$f":"SW!G40","v":"STANY RAFIDAH RAHMANIA"},30,null,null,30,null,null,null,0,30]
[null,32,null,null,{"$f":"SW!G41","v":"USWATUN KHASANAH"},40,null,null,40,null,null,null,0,40]
[null,33,null,null,{"$f":"SW!G42","v":"VIKROUL KHAMILA"},40,null,null,40,null,null,null,0,40]
[null,34,null,null,{"$f":"SW!G43","v":0},null,null,null,0,null,null,null,0,0]
[null,35,null,null,{"$f":"SW!G44","v":0},null,null,null,0,null,null,null,0,0]
[null,36,null,null,{"$f":"SW!G45","v":0},null,null,null,0,null,null,null,0,0]
[null,37,null,null,{"$f":"SW!G46","v":0},null,null,null,0,null,null,null,0,0]
[null,38,null,null,{"$f":"SW!G47","v":0},null,null,null,0,null,null,null,0,0]
[null,39,null,null,{"$f":"SW!G48","v":0},null,null,null,0,null,null,null,0,0]
[null,40,null,null,{"$f":"SW!G49","v":0},null,null,null,0,null,null,null,0,0]
[null,41,null,null,{"$f":"SW!G50","v":0},null,null,null,0,null,null,null,0,0]
[null,42,null,null,{"$f":"SW!G51","v":0},null,null,null,0,null,null,null,0,0]
[null,43,null,null,{"$f":"SW!G52","v":0},null,null,null,0,null,null,null,0,0]
[null,44,null,null,{"$f":"SW!G53","v":0},null,null,null,0,null,null,null,0,0]
[null,45,null,null,{"$f":"SW!G54","v":0},null,null,null,0,null,null,null,0,0]
[null,46,null,null,{"$f":"SW!G55","v":0},null,null,null,0,null,null,null,0,0]
[null,47,null,null,{"$f":"SW!G56","v":0},null,null,null,0,null,null,null,0,0]
[null,48,null,null,{"$f":"SW!G57","v":0},null,null,null,0,null,null,null,0,0]
[null,49,null,null,{"$f":"SW!G58","v":0},null,null,null,0,null,null,null,0,0]
[null,50,null,null,{"$f":"SW!G59","v":0},null,null,null,0,null,null,null,0,0]
[null,51,null,null,{"$f":"SW!G60","v":0},null,null,null,0,null,null,null,0,0]
[null,52,null,null,{"$f":"SW!G61","v":0},null,null,null,0,null,null,null,0,0]
[null,53,null,null,{"$f":"SW!G62","v":0},null,null,null,0,null,null,null,0,0]
[null,54,null,null,{"$f":"SW!G63","v":0},null,null,null,0,null,null,null,0,0]
[null,55,null,null,{"$f":"SW!G64","v":0},null,null,null,0,null,null,null,0,0]
[null,56,null,null,{"$f":"SW!G65","v":0},null,null,null,0,null,null,null,0,0]
[null,57,null,null,{"$f":"SW!G66","v":0},null,null,null,0,null,null,null,0,0]
[null,58,null,null,{"$f":"SW!G67","v":0},null,null,null,0,null,null,null,0,0]
[null,59,null,null,{"$f":"SW!G68","v":0},null,null,null,0,null,null,null,0,0]
[null,60,null,null,{"$f":"SW!G69","v":0},null,null,null,0,null,null,null,0,0]
[null,61,null,null,{"$f":"SW!G70","v":0},null,null,null,0,null,null,null,0,0]
[null,62,null,null,{"$f":"SW!G71","v":0},null,null,null,0,null,null,null,0,0]
[null,63,null,null,{"$f":"SW!G72","v":0},null,null,null,0,null,null,null,0,0]
[null,64,null,null,{"$f":"SW!G73","v":0},null,null,null,0,null,null,null,0,0]
[null,65,null,null,{"$f":"SW!G74","v":0},null,null,null,0,null,null,null,0,0]
[null,66,null,null,{"$f":"SW!G75","v":0},null,null,null,{"$f":"$I$10*F76","v":0},null,null,null,{"$f":"J76*$M$10","v":0},{"$f":"IFERROR(ROUND(AVERAGE(M76+I76),0),\"\")","v":0}]
[null,67,null,null,{"$f":"SW!G76","v":0},null,null,null,0,null,null,null,0,0]
[null,68,null,null,{"$f":"SW!G77","v":0},null,null,null,0,null,null,null,0,0]
[null,69,null,null,{"$f":"SW!G78","v":0},null,null,null,0,null,null,null,0,0]
[null,70,null,null,{"$f":"SW!G79","v":0},null,null,null,0,null,null,null,0,0]
[null,71,null,null,{"$f":"SW!G80","v":0},null,null,null,0,null,null,null,0,0]
[null,72,null,null,{"$f":"SW!G81","v":0},null,null,null,0,null,null,null,0,0]
[null,73,null,null,{"$f":"SW!G82","v":0},null,null,null,0,null,null,null,0,0]
[null,74,null,null,{"$f":"SW!G83","v":0},null,null,null,0,null,null,null,0,0]
[null,75,null,null,{"$f":"SW!G84","v":0},null,null,null,0,null,null,null,0,0]
[null,76,null,null,{"$f":"SW!G85","v":0},null,null,null,0,null,null,null,0,0]
[null,77,null,null,{"$f":"SW!G86","v":0},null,null,null,0,null,null,null,0,0]
[null,78,null,null,{"$f":"SW!G87","v":0},null,null,null,0,null,null,null,0,0]
[null,79,null,null,{"$f":"SW!G88","v":0},null,null,null,0,null,null,null,0,0]
[null,80,null,null,{"$f":"SW!G89","v":0},null,null,null,0,null,null,null,0,0]
[null,81,null,null,{"$f":"SW!G90","v":0},null,null,null,0,null,null,null,0,0]
[null,82,null,null,{"$f":"SW!G91","v":0},null,null,null,0,null,null,null,0,0]
[null,83,null,null,{"$f":"SW!G92","v":0},null,null,null,0,null,null,null,0,0]
[null,84,null,null,{"$f":"SW!G93","v":0},null,null,null,0,null,null,null,0,0]
[null,85,null,null,{"$f":"SW!G94","v":0},null,null,null,0,null,null,null,0,0]
[null,86,null,null,{"$f":"SW!G95","v":0},null,null,null,0,null,null,null,0,0]
[null,87,null,null,{"$f":"SW!G96","v":0},null,null,null,0,null,null,null,0,0]
[null,88,null,null,{"$f":"SW!G97","v":0},null,null,null,0,null,null,null,0,0]
[null,89,null,null,{"$f":"SW!G98","v":0},null,null,null,0,null,null,null,0,0]

{"sheet":"MLK2","index":18,"n_rows":99,"n_cols":15,"rows_kept":99,"cut":false,"hidden":false,"merged":[[9,9,9,11],[10,5,10,7],[10,9,10,11],[10,13,10,16],[11,5,11,7],[11,9,11,11],[11,13,11,16],[1,1,1,16],[3,6,3,12],[3,14,5,15],[4,6,4,12],[5,6,5,12],[8,1,9,1],[8,4,9,4],[8,5,8,12],[8,13,9,16],[9,5,9,7],[14,5,14,7],[14,9,14,11],[14,13,14,16],[15,5,15,7],[15,9,15,11],[15,13,15,16],[12,5,12,7],[12,9,12,11],[12,13,12,16],[13,5,13,7],[13,9,13,11],[13,13,13,16],[18,5,18,7],[18,9,18,11],[18,13,18,16],[19,5,19,7],[19,9,19,11],[19,13,19,16],[16,5,16,7],[16,9,16,11],[16,13,16,16],[17,5,17,7],[17,9,17,11],[17,13,17,16],[22,5,22,7],[22,9,22,11],[22,13,22,16],[23,5,23,7],[23,9,23,11],[23,13,23,16],[20,5,20,7],[20,9,20,11],[20,13,20,16],[21,5,21,7],[21,9,21,11],[21,13,21,16],[26,5,26,7],[26,9,26,11],[26,13,26,16],[27,5,27,7],[27,9,27,11],[27,13,27,16],[24,5,24,7],[24,9,24,11],[24,13,24,16],[25,5,25,7],[25,9,25,11],[25,13,25,16],[30,5,30,7],[30,9,30,11],[30,13,30,16],[31,5,31,7],[31,9,31,11],[31,13,31,16],[28,5,28,7],[28,9,28,11],[28,13,28,16],[29,5,29,7],[29,9,29,11],[29,13,29,16],[34,5,34,7],[34,9,34,11],[34,13,34,16],[35,5,35,7],[35,9,35,11],[35,13,35,16],[32,5,32,7],[32,9,32,11],[32,13,32,16],[33,5,33,7],[33,9,33,11],[33,13,33,16],[38,5,38,7],[38,9,38,11],[38,13,38,16],[39,5,39,7],[39,9,39,11],[39,13,39,16],[36,5,36,7],[36,9,36,11],[36,13,36,16],[37,5,37,7],[37,9,37,11],[37,13,37,16],[42,5,42,7],[42,9,42,11],[42,13,42,16],[43,5,43,7],[43,9,43,11],[43,13,43,16],[40,5,40,7],[40,9,40,11],[40,13,40,16],[41,5,41,7],[41,9,41,11],[41,13,41,16],[46,5,46,7],[46,9,46,11],[46,13,46,16],[47,5,47,7],[47,9,47,11],[47,13,47,16],[44,5,44,7],[44,9,44,11],[44,13,44,16],[45,5,45,7],[45,9,45,11],[45,13,45,16],[50,5,50,7],[50,9,50,11],[50,13,50,16],[51,5,51,7],[51,9,51,11],[51,13,51,16],[48,5,48,7],[48,9,48,11],[48,13,48,16],[49,5,49,7],[49,9,49,11],[49,13,49,16],[54,5,54,7],[54,9,54,11],[54,13,54,16],[55,5,55,7],[55,9,55,11],[55,13,55,16],[52,5,52,7],[52,9,52,11],[52,13,52,16],[53,5,53,7],[53,9,53,11],[53,13,53,16],[58,5,58,7],[58,9,58,11],[58,13,58,16],[59,5,59,7],[59,9,59,11],[59,13,59,16],[56,5,56,7],[56,9,56,11],[56,13,56,16],[57,5,57,7],[57,9,57,11],[57,13,57,16],[62,5,62,7],[62,9,62,11],[62,13,62,16],[63,5,63,7],[63,9,63,11],[63,13,63,16],[60,5,60,7],[60,9,60,11],[60,13,60,16],[61,5,61,7],[61,9,61,11],[61,13,61,16],[66,5,66,7],[66,9,66,11],[66,13,66,16],[67,5,67,7],[67,9,67,11],[67,13,67,16],[64,5,64,7],[64,9,64,11],[64,13,64,16],[65,5,65,7],[65,9,65,11],[65,13,65,16],[70,5,70,7],[70,9,70,11],[70,13,70,16],[71,5,71,7],[71,9,71,11],[71,13,71,16],[68,5,68,7],[68,9,68,11],[68,13,68,16],[69,5,69,7],[69,9,69,11],[69,13,69,16],[74,5,74,7],[74,9,74,11],[74,13,74,16],[75,5,75,7],[75,9,75,11],[75,13,75,16],[72,5,72,7],[72,9,72,11],[72,13,72,16],[73,5,73,7],[73,9,73,11],[73,13,73,16],[78,5,78,7],[78,9,78,11],[78,13,78,16],[79,5,79,7],[79,9,79,11],[79,13,79,16],[76,5,76,7],[76,9,76,11],[76,13,76,16],[77,5,77,7],[77,9,77,11],[77,13,77,16],[82,5,82,7],[82,9,82,11],[82,13,82,16],[83,5,83,7],[83,9,83,11],[83,13,83,16],[80,5,80,7],[80,9,80,11],[80,13,80,16],[81,5,81,7],[81,9,81,11],[81,13,81,16],[86,5,86,7],[86,9,86,11],[86,13,86,16],[87,5,87,7],[87,9,87,11],[87,13,87,16],[84,5,84,7],[84,9,84,11],[84,13,84,16],[85,5,85,7],[85,9,85,11],[85,13,85,16],[90,5,90,7],[90,9,90,11],[90,13,90,16],[91,5,91,7],[91,9,91,11],[91,13,91,16],[88,5,88,7],[88,9,88,11],[88,13,88,16],[89,5,89,7],[89,9,89,11],[89,13,89,16],[94,5,94,7],[94,9,94,11],[94,13,94,16],[95,5,95,7],[95,9,95,11],[95,13,95,16],[92,5,92,7],[92,9,92,11],[92,13,92,16],[93,5,93,7],[93,9,93,11],[93,13,93,16],[98,5,98,7],[98,9,98,11],[98,13,98,16],[96,5,96,7],[96,9,96,11],[96,13,96,16],[97,5,97,7],[97,9,97,11],[97,13,97,16]]}
[]
[null,"D A F T A R   N I L A I"]
[]
[null,"MATA PELAJARAN",null,null,null,":","Mulok 2",null,null,null,null,null,null,null,"↗"]
[null,"KELAS",null,null,null,":",{"$f":"UPPER(MN!D22)","v":"VI B"}]
[null,"TAHUN PELAJARAN",null,null,null,":",{"$f":"MN!D18","v":"2019 - 2020"}]
[]
[]
[null,"No","No. Induk","NISN","Nama Siswa","NILAI",null,null,null,null,null,null,null,"JUMLAH"]
[null,null,null,null,null,"PG",null,null,1,"ESSAY",null,null,{"$f":"100%-I10","v":0}]
[null,1,null,null,{"$f":"SW!G10","v":"ACHID ATHIRIL ARDAN"},null,null,null,{"$f":"$I$10*F11","v":0},null,null,null,{"$f":"J11*$M$10","v":0},{"$f":"IFERROR(ROUND(AVERAGE(M11+I11),0),\"\")","v":0}]
[null,2,null,null,{"$f":"SW!G11","v":"ACHMAD SEPTIAN HAMDANI"},null,null,null,{"$f":"$I$10*F12","v":0},null,null,null,{"$f":"J12*$M$10","v":0},{"$f":"IFERROR(ROUND(AVERAGE(M12+I12),0),\"\")","v":0}]
[null,3,null,null,{"$f":"SW!G12","v":"ACHMAD SULAIMAN"},null,null,null,0,null,null,null,0,0]
[null,4,null,null,{"$f":"SW!G13","v":"AIRLANGGA DWIKA RIZQI"},null,null,null,0,null,null,null,0,0]
[null,5,null,null,{"$f":"SW!G14","v":"AUFAN AZKAL ABRORI"},null,null,null,0,null,null,null,0,0]
[null,6,null,null,{"$f":"SW!G15","v":"AZZA PRISHAL DWI PUTRA"},null,null,null,0,null,null,null,0,0]
[null,7,null,null,{"$f":"SW!G16","v":"EKA AULIYA` PUTRI"},null,null,null,0,null,null,null,0,0]
[null,8,null,null,{"$f":"SW!G17","v":"ERSA PUSPITA EKA ROSA LINDA"},null,null,null,0,null,null,null,0,0]
[null,9,null,null,{"$f":"SW!G18","v":"FABIYAN TRI BAKTI OKTAFIAN"},null,null,null,0,null,null,null,0,0]
[null,10,null,null,{"$f":"SW!G19","v":"FELISITA APRILIA NUR NIHAYA"},null,null,null,0,null,null,null,0,0]
[null,11,null,null,{"$f":"SW!G20","v":"FIRDA DWI ANDRIANI"},null,null,null,0,null,null,null,0,0]
[null,12,null,null,{"$f":"SW!G21","v":"GILANG AKBAR PRASETYO"},null,null,null,0,null,null,null,0,0]
[null,13,null,null,{"$f":"SW!G22","v":"IFTAH IZZAH EMILIA  MAHMUD"},null,null,null,0,null,null,null,0,0]
[null,14,null,null,{"$f":"SW!G23","v":"INES ARIFANI MAULINA"},null,null,null,0,null,null,null,0,0]
[null,15,null,null,{"$f":"SW!G24","v":"IYAAD  AFLAKHA RAMZII"},null,null,null,0,null,null,null,0,0]
[null,16,null,null,{"$f":"SW!G25","v":"JULI ANDRIYANTO"},null,null,null,0,null,null,null,0,0]
[null,17,null,null,{"$f":"SW!G26","v":"LIYA FEBRIYANI"},null,null,null,0,null,null,null,0,0]
[null,18,null,null,{"$f":"SW!G27","v":"LIZATUL CHAIYUNI"},null,null,null,0,null,null,null,0,0]
[null,19,null,null,{"$f":"SW!G28","v":"M.AL HAFIZ"},null,null,null,0,null,null,null,0,0]
[null,20,null,null,{"$f":"SW!G29","v":"M. RIZKY RIDWAN"},null,null,null,0,null,null,null,0,0]
[null,21,null,null,{"$f":"SW!G30","v":"MOCHAMAD RAFLI DIAN SAPUTRA"},null,null,null,0,null,null,null,0,0]
[null,22,null,null,{"$f":"SW!G31","v":"MOCHAMMAD AFAREL PUTRA RAMDHANA"},null,null,null,0,null,null,null,0,0]
[null,23,null,null,{"$f":"SW!G32","v":"MUHAMAD JEFRI MAULANA"},null,null,null,0,null,null,null,0,0]
[null,24,null,null,{"$f":"SW!G33","v":"MUHAMMAD DWI WILDAN BAGUS KURNIAWAN"},null,null,null,0,null,null,null,0,0]
[null,25,null,null,{"$f":"SW!G34","v":"MUHAMMAD FARIL FIRMANSYA"},null,null,null,0,null,null,null,0,0]
[null,26,null,null,{"$f":"SW!G35","v":"MUHAMMAD FARIZ UBAIDILLA"},null,null,null,0,null,null,null,0,0]
[null,27,null,null,{"$f":"SW!G36","v":"MUHAMMAD MAULANA ZIDANIL ILMI"},null,null,null,0,null,null,null,0,0]
[null,28,null,null,{"$f":"SW!G37","v":"MUHAMMAD SUTRISNO ISMAIL"},null,null,null,0,null,null,null,0,0]
[null,29,null,null,{"$f":"SW!G38","v":"NOVITA ERNIAWAN"},null,null,null,0,null,null,null,0,0]
[null,30,null,null,{"$f":"SW!G39","v":"PUTRI AULIA DWI AGUSTIN"},null,null,null,0,null,null,null,0,0]
[null,31,null,null,{"$f":"SW!G40","v":"STANY RAFIDAH RAHMANIA"},null,null,null,0,null,null,null,0,0]
[null,32,null,null,{"$f":"SW!G41","v":"USWATUN KHASANAH"},null,null,null,0,null,null,null,0,0]
[null,33,null,null,{"$f":"SW!G42","v":"VIKROUL KHAMILA"},null,null,null,0,null,null,null,0,0]
[null,34,null,null,{"$f":"SW!G43","v":0},null,null,null,0,null,null,null,0,0]
[null,35,null,null,{"$f":"SW!G44","v":0},null,null,null,0,null,null,null,0,0]
[null,36,null,null,{"$f":"SW!G45","v":0},null,null,null,0,null,null,null,0,0]
[null,37,null,null,{"$f":"SW!G46","v":0},null,null,null,0,null,null,null,0,0]
[null,38,null,null,{"$f":"SW!G47","v":0},null,null,null,0,null,null,null,0,0]
[null,39,null,null,{"$f":"SW!G48","v":0},null,null,null,0,null,null,null,0,0]
[null,40,null,null,{"$f":"SW!G49","v":0},null,null,null,0,null,null,null,0,0]
[null,41,null,null,{"$f":"SW!G50","v":0},null,null,null,0,null,null,null,0,0]
[null,42,null,null,{"$f":"SW!G51","v":0},null,null,null,0,null,null,null,0,0]
[null,43,null,null,{"$f":"SW!G52","v":0},null,null,null,0,null,null,null,0,0]
[null,44,null,null,{"$f":"SW!G53","v":0},null,null,null,0,null,null,null,0,0]
[null,45,null,null,{"$f":"SW!G54","v":0},null,null,null,0,null,null,null,0,0]
[null,46,null,null,{"$f":"SW!G55","v":0},null,null,null,0,null,null,null,0,0]
[null,47,null,null,{"$f":"SW!G56","v":0},null,null,null,0,null,null,null,0,0]
[null,48,null,null,{"$f":"SW!G57","v":0},null,null,null,0,null,null,null,0,0]
[null,49,null,null,{"$f":"SW!G58","v":0},null,null,null,0,null,null,null,0,0]
[null,50,null,null,{"$f":"SW!G59","v":0},null,null,null,0,null,null,null,0,0]
[null,51,null,null,{"$f":"SW!G60","v":0},null,null,null,0,null,null,null,0,0]
[null,52,null,null,{"$f":"SW!G61","v":0},null,null,null,0,null,null,null,0,0]
[null,53,null,null,{"$f":"SW!G62","v":0},null,null,null,0,null,null,null,0,0]
[null,54,null,null,{"$f":"SW!G63","v":0},null,null,null,0,null,null,null,0,0]
[null,55,null,null,{"$f":"SW!G64","v":0},null,null,null,0,null,null,null,0,0]
[null,56,null,null,{"$f":"SW!G65","v":0},null,null,null,0,null,null,null,0,0]
[null,57,null,null,{"$f":"SW!G66","v":0},null,null,null,0,null,null,null,0,0]
[null,58,null,null,{"$f":"SW!G67","v":0},null,null,null,0,null,null,null,0,0]
[null,59,null,null,{"$f":"SW!G68","v":0},null,null,null,0,null,null,null,0,0]
[null,60,null,null,{"$f":"SW!G69","v":0},null,null,null,0,null,null,null,0,0]
[null,61,null,null,{"$f":"SW!G70","v":0},null,null,null,0,null,null,null,0,0]
[null,62,null,null,{"$f":"SW!G71","v":0},null,null,null,0,null,null,null,0,0]
[null,63,null,null,{"$f":"SW!G72","v":0},null,null,null,0,null,null,null,0,0]
[null,64,null,null,{"$f":"SW!G73","v":0},null,null,null,0,null,null,null,0,0]
[null,65,null,null,{"$f":"SW!G74","v":0},null,null,null,0,null,null,null,0,0]
[null,66,null,null,{"$f":"SW!G75","v":0},null,null,null,{"$f":"$I$10*F76","v":0},null,null,null,{"$f":"J76*$M$10","v":0},{"$f":"IFERROR(ROUND(AVERAGE(M76+I76),0),\"\")","v":0}]
[null,67,null,null,{"$f":"SW!G76","v":0},null,null,null,0,null,null,null,0,0]
[null,68,null,null,{"$f":"SW!G77","v":0},null,null,null,0,null,null,null,0,0]
[null,69,null,null,{"$f":"SW!G78","v":0},null,null,null,0,null,null,null,0,0]
[null,70,null,null,{"$f":"SW!G79","v":0},null,null,null,0,null,null,null,0,0]
[null,71,null,null,{"$f":"SW!G80","v":0},null,null,null,0,null,null,null,0,0]
[null,72,null,null,{"$f":"SW!G81","v":0},null,null,null,0,null,null,null,0,0]
[null,73,null,null,{"$f":"SW!G82","v":0},null,null,null,0,null,null,null,0,0]
[null,74,null,null,{"$f":"SW!G83","v":0},null,null,null,0,null,null,null,0,0]
[null,75,null,null,{"$f":"SW!G84","v":0},null,null,null,0,null,null,null,0,0]
[null,76,null,null,{"$f":"SW!G85","v":0},null,null,null,0,null,null,null,0,0]
[null,77,null,null,{"$f":"SW!G86","v":0},null,null,null,0,null,null,null,0,0]
[null,78,null,null,{"$f":"SW!G87","v":0},null,null,null,0,null,null,null,0,0]
[null,79,null,null,{"$f":"SW!G88","v":0},null,null,null,0,null,null,null,0,0]
[null,80,null,null,{"$f":"SW!G89","v":0},null,null,null,0,null,null,null,0,0]
[null,81,null,null,{"$f":"SW!G90","v":0},null,null,null,0,null,null,null,0,0]
[null,82,null,null,{"$f":"SW!G91","v":0},null,null,null,0,null,null,null,0,0]
[null,83,null,null,{"$f":"SW!G92","v":0},null,null,null,0,null,null,null,0,0]
[null,84,null,null,{"$f":"SW!G93","v":0},null,null,null,0,null,null,null,0,0]
[null,85,null,null,{"$f":"SW!G94","v":0},null,null,null,0,null,null,null,0,0]
[null,86,null,null,{"$f":"SW!G95","v":0},null,null,null,0,null,null,null,0,0]
[null,87,null,null,{"$f":"SW!G96","v":0},null,null,null,0,null,null,null,0,0]
[null,88,null,null,{"$f":"SW!G97","v":0},null,null,null,0,null,null,null,0,0]
[null,89,null,null,{"$f":"SW!G98","v":0},null,null,null,0,null,null,null,0,0]

{"sheet":"MLK3","index":19,"n_rows":99,"n_cols":15,"rows_kept":99,"cut":false,"hidden":false,"merged":[[9,9,9,11],[10,5,10,7],[10,9,10,11],[10,13,10,16],[11,5,11,7],[11,9,11,11],[11,13,11,16],[1,1,1,16],[3,6,3,12],[3,14,5,15],[4,6,4,12],[5,6,5,12],[8,1,9,1],[8,4,9,4],[8,5,8,12],[8,13,9,16],[9,5,9,7],[14,5,14,7],[14,9,14,11],[14,13,14,16],[15,5,15,7],[15,9,15,11],[15,13,15,16],[12,5,12,7],[12,9,12,11],[12,13,12,16],[13,5,13,7],[13,9,13,11],[13,13,13,16],[18,5,18,7],[18,9,18,11],[18,13,18,16],[19,5,19,7],[19,9,19,11],[19,13,19,16],[16,5,16,7],[16,9,16,11],[16,13,16,16],[17,5,17,7],[17,9,17,11],[17,13,17,16],[22,5,22,7],[22,9,22,11],[22,13,22,16],[23,5,23,7],[23,9,23,11],[23,13,23,16],[20,5,20,7],[20,9,20,11],[20,13,20,16],[21,5,21,7],[21,9,21,11],[21,13,21,16],[26,5,26,7],[26,9,26,11],[26,13,26,16],[27,5,27,7],[27,9,27,11],[27,13,27,16],[24,5,24,7],[24,9,24,11],[24,13,24,16],[25,5,25,7],[25,9,25,11],[25,13,25,16],[30,5,30,7],[30,9,30,11],[30,13,30,16],[31,5,31,7],[31,9,31,11],[31,13,31,16],[28,5,28,7],[28,9,28,11],[28,13,28,16],[29,5,29,7],[29,9,29,11],[29,13,29,16],[34,5,34,7],[34,9,34,11],[34,13,34,16],[35,5,35,7],[35,9,35,11],[35,13,35,16],[32,5,32,7],[32,9,32,11],[32,13,32,16],[33,5,33,7],[33,9,33,11],[33,13,33,16],[38,5,38,7],[38,9,38,11],[38,13,38,16],[39,5,39,7],[39,9,39,11],[39,13,39,16],[36,5,36,7],[36,9,36,11],[36,13,36,16],[37,5,37,7],[37,9,37,11],[37,13,37,16],[42,5,42,7],[42,9,42,11],[42,13,42,16],[43,5,43,7],[43,9,43,11],[43,13,43,16],[40,5,40,7],[40,9,40,11],[40,13,40,16],[41,5,41,7],[41,9,41,11],[41,13,41,16],[46,5,46,7],[46,9,46,11],[46,13,46,16],[47,5,47,7],[47,9,47,11],[47,13,47,16],[44,5,44,7],[44,9,44,11],[44,13,44,16],[45,5,45,7],[45,9,45,11],[45,13,45,16],[50,5,50,7],[50,9,50,11],[50,13,50,16],[51,5,51,7],[51,9,51,11],[51,13,51,16],[48,5,48,7],[48,9,48,11],[48,13,48,16],[49,5,49,7],[49,9,49,11],[49,13,49,16],[54,5,54,7],[54,9,54,11],[54,13,54,16],[55,5,55,7],[55,9,55,11],[55,13,55,16],[52,5,52,7],[52,9,52,11],[52,13,52,16],[53,5,53,7],[53,9,53,11],[53,13,53,16],[58,5,58,7],[58,9,58,11],[58,13,58,16],[59,5,59,7],[59,9,59,11],[59,13,59,16],[56,5,56,7],[56,9,56,11],[56,13,56,16],[57,5,57,7],[57,9,57,11],[57,13,57,16],[62,5,62,7],[62,9,62,11],[62,13,62,16],[63,5,63,7],[63,9,63,11],[63,13,63,16],[60,5,60,7],[60,9,60,11],[60,13,60,16],[61,5,61,7],[61,9,61,11],[61,13,61,16],[66,5,66,7],[66,9,66,11],[66,13,66,16],[67,5,67,7],[67,9,67,11],[67,13,67,16],[64,5,64,7],[64,9,64,11],[64,13,64,16],[65,5,65,7],[65,9,65,11],[65,13,65,16],[70,5,70,7],[70,9,70,11],[70,13,70,16],[71,5,71,7],[71,9,71,11],[71,13,71,16],[68,5,68,7],[68,9,68,11],[68,13,68,16],[69,5,69,7],[69,9,69,11],[69,13,69,16],[74,5,74,7],[74,9,74,11],[74,13,74,16],[75,5,75,7],[75,9,75,11],[75,13,75,16],[72,5,72,7],[72,9,72,11],[72,13,72,16],[73,5,73,7],[73,9,73,11],[73,13,73,16],[78,5,78,7],[78,9,78,11],[78,13,78,16],[79,5,79,7],[79,9,79,11],[79,13,79,16],[76,5,76,7],[76,9,76,11],[76,13,76,16],[77,5,77,7],[77,9,77,11],[77,13,77,16],[82,5,82,7],[82,9,82,11],[82,13,82,16],[83,5,83,7],[83,9,83,11],[83,13,83,16],[80,5,80,7],[80,9,80,11],[80,13,80,16],[81,5,81,7],[81,9,81,11],[81,13,81,16],[86,5,86,7],[86,9,86,11],[86,13,86,16],[87,5,87,7],[87,9,87,11],[87,13,87,16],[84,5,84,7],[84,9,84,11],[84,13,84,16],[85,5,85,7],[85,9,85,11],[85,13,85,16],[90,5,90,7],[90,9,90,11],[90,13,90,16],[91,5,91,7],[91,9,91,11],[91,13,91,16],[88,5,88,7],[88,9,88,11],[88,13,88,16],[89,5,89,7],[89,9,89,11],[89,13,89,16],[94,5,94,7],[94,9,94,11],[94,13,94,16],[95,5,95,7],[95,9,95,11],[95,13,95,16],[92,5,92,7],[92,9,92,11],[92,13,92,16],[93,5,93,7],[93,9,93,11],[93,13,93,16],[98,5,98,7],[98,9,98,11],[98,13,98,16],[96,5,96,7],[96,9,96,11],[96,13,96,16],[97,5,97,7],[97,9,97,11],[97,13,97,16]]}
[]
[null,"D A F T A R   N I L A I"]
[]
[null,"MATA PELAJARAN",null,null,null,":","Mulok 3",null,null,null,null,null,null,null,"↗"]
[null,"KELAS",null,null,null,":",{"$f":"UPPER(MN!D22)","v":"VI B"}]
[null,"TAHUN PELAJARAN",null,null,null,":",{"$f":"MN!D18","v":"2019 - 2020"}]
[]
[]
[null,"No","No. Induk","NISN","Nama Siswa","NILAI",null,null,null,null,null,null,null,"JUMLAH"]
[null,null,null,null,null,"PG",null,null,1,"ESSAY",null,null,{"$f":"100%-I10","v":0}]
[null,1,null,null,{"$f":"SW!G10","v":"ACHID ATHIRIL ARDAN"},null,null,null,{"$f":"$I$10*F11","v":0},null,null,null,{"$f":"J11*$M$10","v":0},{"$f":"IFERROR(ROUND(AVERAGE(M11+I11),0),\"\")","v":0}]
[null,2,null,null,{"$f":"SW!G11","v":"ACHMAD SEPTIAN HAMDANI"},null,null,null,{"$f":"$I$10*F12","v":0},null,null,null,{"$f":"J12*$M$10","v":0},{"$f":"IFERROR(ROUND(AVERAGE(M12+I12),0),\"\")","v":0}]
[null,3,null,null,{"$f":"SW!G12","v":"ACHMAD SULAIMAN"},null,null,null,0,null,null,null,0,0]
[null,4,null,null,{"$f":"SW!G13","v":"AIRLANGGA DWIKA RIZQI"},null,null,null,0,null,null,null,0,0]
[null,5,null,null,{"$f":"SW!G14","v":"AUFAN AZKAL ABRORI"},null,null,null,0,null,null,null,0,0]
[null,6,null,null,{"$f":"SW!G15","v":"AZZA PRISHAL DWI PUTRA"},null,null,null,0,null,null,null,0,0]
[null,7,null,null,{"$f":"SW!G16","v":"EKA AULIYA` PUTRI"},null,null,null,0,null,null,null,0,0]
[null,8,null,null,{"$f":"SW!G17","v":"ERSA PUSPITA EKA ROSA LINDA"},null,null,null,0,null,null,null,0,0]
[null,9,null,null,{"$f":"SW!G18","v":"FABIYAN TRI BAKTI OKTAFIAN"},null,null,null,0,null,null,null,0,0]
[null,10,null,null,{"$f":"SW!G19","v":"FELISITA APRILIA NUR NIHAYA"},null,null,null,0,null,null,null,0,0]
[null,11,null,null,{"$f":"SW!G20","v":"FIRDA DWI ANDRIANI"},null,null,null,0,null,null,null,0,0]
[null,12,null,null,{"$f":"SW!G21","v":"GILANG AKBAR PRASETYO"},null,null,null,0,null,null,null,0,0]
[null,13,null,null,{"$f":"SW!G22","v":"IFTAH IZZAH EMILIA  MAHMUD"},null,null,null,0,null,null,null,0,0]
[null,14,null,null,{"$f":"SW!G23","v":"INES ARIFANI MAULINA"},null,null,null,0,null,null,null,0,0]
[null,15,null,null,{"$f":"SW!G24","v":"IYAAD  AFLAKHA RAMZII"},null,null,null,0,null,null,null,0,0]
[null,16,null,null,{"$f":"SW!G25","v":"JULI ANDRIYANTO"},null,null,null,0,null,null,null,0,0]
[null,17,null,null,{"$f":"SW!G26","v":"LIYA FEBRIYANI"},null,null,null,0,null,null,null,0,0]
[null,18,null,null,{"$f":"SW!G27","v":"LIZATUL CHAIYUNI"},null,null,null,0,null,null,null,0,0]
[null,19,null,null,{"$f":"SW!G28","v":"M.AL HAFIZ"},null,null,null,0,null,null,null,0,0]
[null,20,null,null,{"$f":"SW!G29","v":"M. RIZKY RIDWAN"},null,null,null,0,null,null,null,0,0]
[null,21,null,null,{"$f":"SW!G30","v":"MOCHAMAD RAFLI DIAN SAPUTRA"},null,null,null,0,null,null,null,0,0]
[null,22,null,null,{"$f":"SW!G31","v":"MOCHAMMAD AFAREL PUTRA RAMDHANA"},null,null,null,0,null,null,null,0,0]
[null,23,null,null,{"$f":"SW!G32","v":"MUHAMAD JEFRI MAULANA"},null,null,null,0,null,null,null,0,0]
[null,24,null,null,{"$f":"SW!G33","v":"MUHAMMAD DWI WILDAN BAGUS KURNIAWAN"},null,null,null,0,null,null,null,0,0]
[null,25,null,null,{"$f":"SW!G34","v":"MUHAMMAD FARIL FIRMANSYA"},null,null,null,0,null,null,null,0,0]
[null,26,null,null,{"$f":"SW!G35","v":"MUHAMMAD FARIZ UBAIDILLA"},null,null,null,0,null,null,null,0,0]
[null,27,null,null,{"$f":"SW!G36","v":"MUHAMMAD MAULANA ZIDANIL ILMI"},null,null,null,0,null,null,null,0,0]
[null,28,null,null,{"$f":"SW!G37","v":"MUHAMMAD SUTRISNO ISMAIL"},null,null,null,0,null,null,null,0,0]
[null,29,null,null,{"$f":"SW!G38","v":"NOVITA ERNIAWAN"},null,null,null,0,null,null,null,0,0]
[null,30,null,null,{"$f":"SW!G39","v":"PUTRI AULIA DWI AGUSTIN"},null,null,null,0,null,null,null,0,0]
[null,31,null,null,{"$f":"SW!G40","v":"STANY RAFIDAH RAHMANIA"},null,null,null,0,null,null,null,0,0]
[null,32,null,null,{"$f":"SW!G41","v":"USWATUN KHASANAH"},null,null,null,0,null,null,null,0,0]
[null,33,null,null,{"$f":"SW!G42","v":"VIKROUL KHAMILA"},null,null,null,0,null,null,null,0,0]
[null,34,null,null,{"$f":"SW!G43","v":0},null,null,null,0,null,null,null,0,0]
[null,35,null,null,{"$f":"SW!G44","v":0},null,null,null,0,null,null,null,0,0]
[null,36,null,null,{"$f":"SW!G45","v":0},null,null,null,0,null,null,null,0,0]
[null,37,null,null,{"$f":"SW!G46","v":0},null,null,null,0,null,null,null,0,0]
[null,38,null,null,{"$f":"SW!G47","v":0},null,null,null,0,null,null,null,0,0]
[null,39,null,null,{"$f":"SW!G48","v":0},null,null,null,0,null,null,null,0,0]
[null,40,null,null,{"$f":"SW!G49","v":0},null,null,null,0,null,null,null,0,0]
[null,41,null,null,{"$f":"SW!G50","v":0},null,null,null,0,null,null,null,0,0]
[null,42,null,null,{"$f":"SW!G51","v":0},null,null,null,0,null,null,null,0,0]
[null,43,null,null,{"$f":"SW!G52","v":0},null,null,null,0,null,null,null,0,0]
[null,44,null,null,{"$f":"SW!G53","v":0},null,null,null,0,null,null,null,0,0]
[null,45,null,null,{"$f":"SW!G54","v":0},null,null,null,0,null,null,null,0,0]
[null,46,null,null,{"$f":"SW!G55","v":0},null,null,null,0,null,null,null,0,0]
[null,47,null,null,{"$f":"SW!G56","v":0},null,null,null,0,null,null,null,0,0]
[null,48,null,null,{"$f":"SW!G57","v":0},null,null,null,0,null,null,null,0,0]
[null,49,null,null,{"$f":"SW!G58","v":0},null,null,null,0,null,null,null,0,0]
[null,50,null,null,{"$f":"SW!G59","v":0},null,null,null,0,null,null,null,0,0]
[null,51,null,null,{"$f":"SW!G60","v":0},null,null,null,0,null,null,null,0,0]
[null,52,null,null,{"$f":"SW!G61","v":0},null,null,null,0,null,null,null,0,0]
[null,53,null,null,{"$f":"SW!G62","v":0},null,null,null,0,null,null,null,0,0]
[null,54,null,null,{"$f":"SW!G63","v":0},null,null,null,0,null,null,null,0,0]
[null,55,null,null,{"$f":"SW!G64","v":0},null,null,null,0,null,null,null,0,0]
[null,56,null,null,{"$f":"SW!G65","v":0},null,null,null,0,null,null,null,0,0]
[null,57,null,null,{"$f":"SW!G66","v":0},null,null,null,0,null,null,null,0,0]
[null,58,null,null,{"$f":"SW!G67","v":0},null,null,null,0,null,null,null,0,0]
[null,59,null,null,{"$f":"SW!G68","v":0},null,null,null,0,null,null,null,0,0]
[null,60,null,null,{"$f":"SW!G69","v":0},null,null,null,0,null,null,null,0,0]
[null,61,null,null,{"$f":"SW!G70","v":0},null,null,null,0,null,null,null,0,0]
[null,62,null,null,{"$f":"SW!G71","v":0},null,null,null,0,null,null,null,0,0]
[null,63,null,null,{"$f":"SW!G72","v":0},null,null,null,0,null,null,null,0,0]
[null,64,null,null,{"$f":"SW!G73","v":0},null,null,null,0,null,null,null,0,0]
[null,65,null,null,{"$f":"SW!G74","v":0},null,null,null,0,null,null,null,0,0]
[null,66,null,null,{"$f":"SW!G75","v":0},null,null,null,{"$f":"$I$10*F76","v":0},null,null,null,{"$f":"J76*$M$10","v":0},{"$f":"IFERROR(ROUND(AVERAGE(M76+I76),0),\"\")","v":0}]
[null,67,null,null,{"$f":"SW!G76","v":0},null,null,null,0,null,null,null,0,0]
[null,68,null,null,{"$f":"SW!G77","v":0},null,null,null,0,null,null,null,0,0]
[null,69,null,null,{"$f":"SW!G78","v":0},null,null,null,0,null,null,null,0,0]
[null,70,null,null,{"$f":"SW!G79","v":0},null,null,null,0,null,null,null,0,0]
[null,71,null,null,{"$f":"SW!G80","v":0},null,null,null,0,null,null,null,0,0]
[null,72,null,null,{"$f":"SW!G81","v":0},null,null,null,0,null,null,null,0,0]
[null,73,null,null,{"$f":"SW!G82","v":0},null,null,null,0,null,null,null,0,0]
[null,74,null,null,{"$f":"SW!G83","v":0},null,null,null,0,null,null,null,0,0]
[null,75,null,null,{"$f":"SW!G84","v":0},null,null,null,0,null,null,null,0,0]
[null,76,null,null,{"$f":"SW!G85","v":0},null,null,null,0,null,null,null,0,0]
[null,77,null,null,{"$f":"SW!G86","v":0},null,null,null,0,null,null,null,0,0]
[null,78,null,null,{"$f":"SW!G87","v":0},null,null,null,0,null,null,null,0,0]
[null,79,null,null,{"$f":"SW!G88","v":0},null,null,null,0,null,null,null,0,0]
[null,80,null,null,{"$f":"SW!G89","v":0},null,null,null,0,null,null,null,0,0]
[null,81,null,null,{"$f":"SW!G90","v":0},null,null,null,0,null,null,null,0,0]
[null,82,null,null,{"$f":"SW!G91","v":0},null,null,null,0,null,null,null,0,0]
[null,83,null,null,{"$f":"SW!G92","v":0},null,null,null,0,null,null,null,0,0]
[null,84,null,null,{"$f":"SW!G93","v":0},null,null,null,0,null,null,null,0,0]
[null,85,null,null,{"$f":"SW!G94","v":0},null,null,null,0,null,null,null,0,0]
[null,86,null,null,{"$f":"SW!G95","v":0},null,null,null,0,null,null,null,0,0]
[null,87,null,null,{"$f":"SW!G96","v":0},null,null,null,0,null,null,null,0,0]
[null,88,null,null,{"$f":"SW!G97","v":0},null,null,null,0,null,null,null,0,0]
[null,89,null,null,{"$f":"SW!G98","v":0},null,null,null,0,null,null,null,0,0]

{"sheet":"REKAP","index":20,"n_rows":122,"n_cols":34,"rows_kept":122,"cut":false,"hidden":false,"merged":[[15,33,17,33],[2,6,2,22],[3,6,3,22],[4,6,4,22],[5,6,5,22],[2,2,4,4],[5,2,5,4],[2,24,4,27],[5,24,5,27],[10,30,12,31],[11,14,13,27],[12,6,12,11],[13,6,13,11],[15,2,17,2],[15,3,17,3],[15,4,17,4],[16,7,16,11],[8,2,8,27],[107,25,110,27],[107,2,107,6],[108,2,108,6],[109,2,109,6],[110,2,110,6],[16,12,16,18],[10,2,10,4],[11,2,11,4],[12,2,12,4],[13,2,13,4],[15,5,17,6],[15,7,15,24],[10,6,10,11],[11,6,11,11],[24,5,24,6],[25,5,25,6],[26,5,26,6],[27,5,27,6],[28,5,28,6],[29,5,29,6],[18,5,18,6],[19,5,19,6],[20,5,20,6],[21,5,21,6],[22,5,22,6],[23,5,23,6],[36,5,36,6],[37,5,37,6],[38,5,38,6],[39,5,39,6],[40,5,40,6],[41,5,41,6],[30,5,30,6],[31,5,31,6],[32,5,32,6],[33,5,33,6],[34,5,34,6],[35,5,35,6],[48,5,48,6],[49,5,49,6],[50,5,50,6],[51,5,51,6],[52,5,52,6],[53,5,53,6],[42,5,42,6],[43,5,43,6],[44,5,44,6],[45,5,45,6],[46,5,46,6],[47,5,47,6],[61,5,61,6],[62,5,62,6],[63,5,63,6],[64,5,64,6],[65,5,65,6],[54,5,54,6],[55,5,55,6],[56,5,56,6],[57,5,57,6],[58,5,58,6],[59,5,59,6],[105,5,105,6],[106,5,106,6],[16,19,16,24],[96,5,96,6],[97,5,97,6],[98,5,98,6],[99,5,99,6],[100,5,100,6],[101,5,101,6],[90,5,90,6],[91,5,91,6],[92,5,92,6],[93,5,93,6],[94,5,94,6],[95,5,95,6],[84,5,84,6],[85,5,85,6],[86,5,86,6],[87,5,87,6],[88,5,88,6],[89,5,89,6],[78,5,78,6],[79,5,79,6],[80,5,80,6],[112,22,112,25],[113,22,113,25],[15,25,17,25],[15,26,17,26],[15,27,17,27],[102,5,102,6],[103,5,103,6],[104,5,104,6],[81,5,81,6],[82,5,82,6],[83,5,83,6],[72,5,72,6],[73,5,73,6],[74,5,74,6],[75,5,75,6],[76,5,76,6],[77,5,77,6],[66,5,66,6],[67,5,67,6],[68,5,68,6],[69,5,69,6],[70,5,70,6],[71,5,71,6],[60,5,60,6]]}
[]
[]
[null,null,null,null,null,null,"LEMBAGA PENDIDIKAN MA'ARIF NU CABANG KABUPATEN LUMAJANG"]
[null,null,null,null,null,null,{"$f":"UPPER(\"madrasah ibtidaiyah swasta \"&MN!D6)","v":"MADRASAH IBTIDAIYAH SWASTA NURUL ISLAM LABRUK KIDUL"}]
[null,null,null,null,null,null,{"$f":"UPPER(\"TERAKREDITASI \"&MN!D30)","v":"TERAKREDITASI A"}]
[null,null,null,null,null,null,{"$f":"\"Jl. \"&MN!D16","v":"Jl. Raya Labruk Kidul No.65 Labruk Kidul"},null,null,null,null,null,null,null,null,null,null,null,null,null,null,null,null,null,"KEMENAG RI"]
[]
[]
[null,null,"R E K A P I T U L A S I   P E N I L A I A N   T E N G A H   S E M E S T E R"]
[]
[null,null,"Kelas",null,null,":",{"$f":"MN!D22","v":"VI B"},null,null,null,null,null,null,null,null,null,null,null,null,null,null,null,null,null,null,null,null,null,null,null,"↗"]
[null,null,"Semester",null,null,":",{"$f":"MN!D20","v":"Ganjil"},null,null,null,null,null,null,null,{"$f":"MN!H22","v":"EXELLENT QURANIC SCHOOL"}]
[null,null,"Tahun Pelajaran",null,null,":",{"$f":"MN!D18","v":"2019 - 2020"}]
[null,null,"Satuan Pendidikan",null,null,":",{"$f":"UPPER(\"MIS. \"&MN!D6)","v":"MIS. NURUL ISLAM LABRUK KIDUL"}]
[]
[null,null,"No","No. Induk","NISN","Nama Siswa",null,"Mata pelajaran",null,null,null,null,null,null,null,null,null,null,null,null,null,null,null,null,null,"JUMLAH","RATA-RATA","RANGKING",null,null,"view",null,null,{"$f":"\"PESAN WALI KELAS / GURU KELAS \"&MN!D22","v":"PESAN WALI KELAS / GURU KELAS VI B"}]
[null,null,null,null,null,null,null,"Agama",null,null,null,null,"Umum",null,null,null,null,null,null,"Muatan Lokal"]
[null,null,null,null,null,null,null,"Al-Qur'an Hadist","Aqidah akhlaq","Fiqih","SKI","Bhs. Arab","Bhs. Indonesia","Matematika","IPA","PPKn","IPS","SBDP","PJOK","Bhs. Daerah","Bhs. Inggris","Aswaja",{"$f":"PROPER(MN!J12)","v":"Nakhwu Sorof"},{"$f":"PROPER(MN!J14)","v":"Mulok 2"},{"$f":"PROPER(MN!J16)","v":"Mulok 3"},null,null,null,null,null,"cetak"]
[null,1,{"$f":"SW!C10","v":"1"},{"$f":"SW!D10","v":4330},{"$f":"SW!F10","v":0},{"$f":"SW!G10","v":"ACHID ATHIRIL ARDAN"},null,{"$f":"AH!N11","v":46},{"$f":"AA!N11","v":75},{"$f":"FQ!N11","v":84},{"$f":"SKI!N11","v":45},{"$f":"BA!N11","v":19},{"$f":"RTM!AP11","v":58},{"$f":"MTK!O11","v":43},{"$f":"RTM!AR11","v":58},{"$f":"RTM!AS11","v":58},{"$f":"RTM!AT11","v":49},{"$f":"RTM!AU11","v":49},{"$f":"PJOK!N11","v":39},{"$f":"BD!N11","v":47},{"$f":"BIG!N11","v":50},{"$f":"ASWJ!N11","v":65},{"$f":"'MLK1'!N11","v":30},{"$f":"'MLK2'!N11","v":0},{"$f":"'MLK3'!N11","v":0},{"$f":"SUM(H19:Y19)","v":815},{"$f":"AVERAGE(H19:W19)","v":50.9375},{"$f":"RANK(Z19,$Z$19:$Z$107)","v":20},null,null,{"$f":"IF(C19=\"\",0,\"cetak\")","v":"cetak"},null,null,"Jangan pernah putus asa tingkatkan  semangat belajarmu!"]
[null,2,{"$f":"SW!C11","v":"2"},{"$f":"SW!D11","v":4361},{"$f":"SW!F11","v":0},{"$f":"SW!G11","v":"ACHMAD SEPTIAN HAMDANI"},null,{"$f":"AH!N12","v":75},{"$f":"AA!N12","v":75},{"$f":"FQ!N12","v":86},{"$f":"SKI!N12","v":45},{"$f":"BA!N12","v":37},{"$f":"RTM!AP12","v":68},{"$f":"MTK!O12","v":38},{"$f":"RTM!AR12","v":68},{"$f":"RTM!AS12","v":68},{"$f":"RTM!AT12","v":58},{"$f":"RTM!AU12","v":58},{"$f":"PJOK!N12","v":64},{"$f":"BD!N12","v":69},{"$f":"BIG!N12","v":83},{"$f":"ASWJ!N12","v":55},{"$f":"'MLK1'!N12","v":10},{"$f":"'MLK2'!N12","v":0},{"$f":"'MLK3'!N12","v":0},{"$f":"SUM(H20:Y20)","v":957},{"$f":"AVERAGE(H20:W20)","v":59.8125},{"$f":"RANK(Z20,$Z$19:$Z$107)","v":9},null,null,{"$f":"IF(C20=\"\",0,\"cetak\")","v":"cetak"},null,null,"Jangan pernah putus asa tingkatkan  semangat belajarmu!"]
[null,3,{"$f":"SW!C12","v":"3"},{"$f":"SW!D12","v":4362},{"$f":"SW!F12","v":0},{"$f":"SW!G12","v":"ACHMAD SULAIMAN"},null,{"$f":"AH!N13","v":44},{"$f":"AA!N13","v":55},{"$f":"FQ!N13","v":43},{"$f":"SKI!N13","v":32},{"$f":"BA!N13","v":29},{"$f":"RTM!AP13","v":30},{"$f":"MTK!O13","v":15},{"$f":"RTM!AR13","v":30},{"$f":"RTM!AS13","v":30},{"$f":"RTM!AT13","v":36},{"$f":"RTM!AU13","v":36},{"$f":"PJOK!N13","v":47},{"$f":"BD!N13","v":41},{"$f":"BIG!N13","v":25},{"$f":"ASWJ!N13","v":54},{"$f":"'MLK1'!N13","v":10},{"$f":"'MLK2'!N13","v":0},{"$f":"'MLK3'!N13","v":0},557,34.8125,33,null,null,"cetak",null,null,"Jangan pernah putus asa tingkatkan  semangat belajarmu!"]
[null,4,{"$f":"SW!C13","v":"4"},{"$f":"SW!D13","v":4364},{"$f":"SW!F13","v":0},{"$f":"SW!G13","v":"AIRLANGGA DWIKA RIZQI"},null,{"$f":"AH!N14","v":43},{"$f":"AA!N14","v":49},{"$f":"FQ!N14","v":74},{"$f":"SKI!N14","v":27},{"$f":"BA!N14","v":22},{"$f":"RTM!AP14","v":52},{"$f":"MTK!O14","v":38},{"$f":"RTM!AR14","v":52},{"$f":"RTM!AS14","v":52},{"$f":"RTM!AT14","v":45},{"$f":"RTM!AU14","v":45},{"$f":"PJOK!N14","v":29},{"$f":"BD!N14","v":23},{"$f":"BIG!N14","v":88},{"$f":"ASWJ!N14","v":55},{"$f":"'MLK1'!N14","v":10},{"$f":"'MLK2'!N14","v":0},{"$f":"'MLK3'!N14","v":0},704,44,29,null,null,"cetak",null,null,"Jangan pernah putus asa tingkatkan  semangat belajarmu!"]
[null,5,{"$f":"SW!C14","v":"5"},{"$f":"SW!D14","v":4365},{"$f":"SW!F14","v":0},{"$f":"SW!G14","v":"AUFAN AZKAL ABRORI"},null,{"$f":"AH!N15","v":51},{"$f":"AA!N15","v":49},{"$f":"FQ!N15","v":58},{"$f":"SKI!N15","v":44},{"$f":"BA!N15","v":27},{"$f":"RTM!AP15","v":49},{"$f":"MTK!O15","v":47},{"$f":"RTM!AR15","v":49},{"$f":"RTM!AS15","v":49},{"$f":"RTM!AT15","v":51},{"$f":"RTM!AU15","v":51},{"$f":"PJOK!N15","v":58},{"$f":"BD!N15","v":25},{"$f":"BIG!N15","v":47},{"$f":"ASWJ!N15","v":70},{"$f":"'MLK1'!N15","v":30},{"$f":"'MLK2'!N15","v":0},{"$f":"'MLK3'!N15","v":0},755,47.1875,24,null,null,"cetak",null,null,"Jangan pernah putus asa tingkatkan  semangat belajarmu!"]
[null,6,{"$f":"SW!C15","v":"6"},{"$f":"SW!D15","v":4465},{"$f":"SW!F15","v":0},{"$f":"SW!G15","v":"AZZA PRISHAL DWI PUTRA"},null,{"$f":"AH!N16","v":54},{"$f":"AA!N16","v":54},{"$f":"FQ!N16","v":56},{"$f":"SKI!N16","v":35},{"$f":"BA!N16","v":39},{"$f":"RTM!AP16","v":49},{"$f":"MTK!O16","v":59},{"$f":"RTM!AR16","v":49},{"$f":"RTM!AS16","v":49},{"$f":"RTM!AT16","v":45},{"$f":"RTM!AU16","v":45},{"$f":"PJOK!N16","v":54},{"$f":"BD!N16","v":45},{"$f":"BIG!N16","v":62},{"$f":"ASWJ!N16","v":49},{"$f":"'MLK1'!N16","v":30},{"$f":"'MLK2'!N16","v":0},{"$f":"'MLK3'!N16","v":0},774,48.375,23,null,null,"cetak",null,null,"Jangan pernah putus asa tingkatkan  semangat belajarmu!"]
[null,7,{"$f":"SW!C16","v":"7"},{"$f":"SW!D16","v":4368},{"$f":"SW!F16","v":0},{"$f":"SW!G16","v":"EKA AULIYA` PUTRI"},null,{"$f":"AH!N17","v":70},{"$f":"AA!N17","v":68},{"$f":"FQ!N17","v":90},{"$f":"SKI!N17","v":60},{"$f":"BA!N17","v":27},{"$f":"RTM!AP17","v":82},{"$f":"MTK!O17","v":34},{"$f":"RTM!AR17","v":82},{"$f":"RTM!AS17","v":82},{"$f":"RTM!AT17","v":61},{"$f":"RTM!AU17","v":61},{"$f":"PJOK!N17","v":55},{"$f":"BD!N17","v":74},{"$f":"BIG!N17","v":64},{"$f":"ASWJ!N17","v":70},{"$f":"'MLK1'!N17","v":40},{"$f":"'MLK2'!N17","v":0},{"$f":"'MLK3'!N17","v":0},1020,63.75,4,null,null,"cetak",null,null,"Jangan pernah putus asa tingkatkan  semangat belajarmu!"]
[null,8,{"$f":"SW!C17","v":"8"},{"$f":"SW!D17","v":4341},{"$f":"SW!F17","v":0},{"$f":"SW!G17","v":"ERSA PUSPITA EKA ROSA LINDA"},null,{"$f":"AH!N18","v":85},{"$f":"AA!N18","v":76},{"$f":"FQ!N18","v":81},{"$f":"SKI!N18","v":55},{"$f":"BA!N18","v":29},{"$f":"RTM!AP18","v":64},{"$f":"MTK!O18","v":34},{"$f":"RTM!AR18","v":64},{"$f":"RTM!AS18","v":64},{"$f":"RTM!AT18","v":50},{"$f":"RTM!AU18","v":50},{"$f":"PJOK!N18","v":52},{"$f":"BD!N18","v":66},{"$f":"BIG!N18","v":54},{"$f":"ASWJ!N18","v":76},{"$f":"'MLK1'!N18","v":65},{"$f":"'MLK2'!N18","v":0},{"$f":"'MLK3'!N18","v":0},965,60.3125,8,null,null,"cetak",null,null,"Jangan pernah putus asa tingkatkan  semangat belajarmu!"]
[null,9,{"$f":"SW!C18","v":"9"},{"$f":"SW!D18","v":4369},{"$f":"SW!F18","v":0},{"$f":"SW!G18","v":"FABIYAN TRI BAKTI OKTAFIAN"},null,{"$f":"AH!N19","v":79},{"$f":"AA!N19","v":47},{"$f":"FQ!N19","v":79},{"$f":"SKI!N19","v":42},{"$f":"BA!N19","v":35},{"$f":"RTM!AP19","v":62},{"$f":"MTK!O19","v":56},{"$f":"RTM!AR19","v":62},{"$f":"RTM!AS19","v":62},{"$f":"RTM!AT19","v":58},{"$f":"RTM!AU19","v":58},{"$f":"PJOK!N19","v":62},{"$f":"BD!N19","v":59},{"$f":"BIG!N19","v":57},{"$f":"ASWJ!N19","v":59},{"$f":"'MLK1'!N19","v":40},{"$f":"'MLK2'!N19","v":0},{"$f":"'MLK3'!N19","v":0},917,57.3125,13,null,null,"cetak",null,null,"Jangan pernah putus asa tingkatkan  semangat belajarmu!"]
[null,10,{"$f":"SW!C19","v":"10"},{"$f":"SW!D19","v":4343},{"$f":"SW!F19","v":0},{"$f":"SW!G19","v":"FELISITA APRILIA NUR NIHAYA"},null,{"$f":"AH!N20","v":69},{"$f":"AA!N20","v":77},{"$f":"FQ!N20","v":69},{"$f":"SKI!N20","v":59},{"$f":"BA!N20","v":30},{"$f":"RTM!AP20","v":65},{"$f":"MTK!O20","v":29},{"$f":"RTM!AR20","v":65},{"$f":"RTM!AS20","v":65},{"$f":"RTM!AT20","v":45},{"$f":"RTM!AU20","v":45},{"$f":"PJOK!N20","v":57},{"$f":"BD!N20","v":58},{"$f":"BIG!N20","v":59},{"$f":"ASWJ!N20","v":69},{"$f":"'MLK1'!N20","v":40},{"$f":"'MLK2'!N20","v":0},{"$f":"'MLK3'!N20","v":0},901,56.3125,15,null,null,"cetak",null,null,"Jangan pernah putus asa tingkatkan  semangat belajarmu!"]
[null,11,{"$f":"SW!C20","v":"11"},{"$f":"SW!D20","v":4344},{"$f":"SW!F20","v":0},{"$f":"SW!G20","v":"FIRDA DWI ANDRIANI"},null,{"$f":"AH!N21","v":48},{"$f":"AA!N21","v":59},{"$f":"FQ!N21","v":76},{"$f":"SKI!N21","v":40},{"$f":"BA!N21","v":40},{"$f":"RTM!AP21","v":57},{"$f":"MTK!O21","v":59},{"$f":"RTM!AR21","v":57},{"$f":"RTM!AS21","v":57},{"$f":"RTM!AT21","v":49},{"$f":"RTM!AU21","v":49},{"$f":"PJOK!N21","v":44},{"$f":"BD!N21","v":33},{"$f":"BIG!N21","v":30},{"$f":"ASWJ!N21","v":65},{"$f":"'MLK1'!N21","v":30},{"$f":"'MLK2'!N21","v":0},{"$f":"'MLK3'!N21","v":0},793,49.5625,22,null,null,"cetak",null,null,"Jangan pernah putus asa tingkatkan  semangat belajarmu!"]
[null,12,{"$f":"SW!C21","v":"12"},{"$f":"SW!D21","v":4372},{"$f":"SW!F21","v":0},{"$f":"SW!G21","v":"GILANG AKBAR PRASETYO"},null,{"$f":"AH!N22","v":56},{"$f":"AA!N22","v":47},{"$f":"FQ!N22","v":60},{"$f":"SKI!N22","v":39},{"$f":"BA!N22","v":24},{"$f":"RTM!AP22","v":55},{"$f":"MTK!O22","v":29},{"$f":"RTM!AR22","v":55},{"$f":"RTM!AS22","v":55},{"$f":"RTM!AT22","v":50},{"$f":"RTM!AU22","v":50},{"$f":"PJOK!N22","v":38},{"$f":"BD!N22","v":25},{"$f":"BIG!N22","v":85},{"$f":"ASWJ!N22","v":60},{"$f":"'MLK1'!N22","v":20},{"$f":"'MLK2'!N22","v":0},{"$f":"'MLK3'!N22","v":0},748,46.75,25,null,null,"cetak",null,null,"Jangan pernah putus asa tingkatkan  semangat belajarmu!"]
[null,13,{"$f":"SW!C22","v":"13"},{"$f":"SW!D22","v":4373},{"$f":"SW!F22","v":0},{"$f":"SW!G22","v":"IFTAH IZZAH EMILIA  MAHMUD"},null,{"$f":"AH!N23","v":64},{"$f":"AA!N23","v":71},{"$f":"FQ!N23","v":68},{"$f":"SKI!N23","v":47},{"$f":"BA!N23","v":25},{"$f":"RTM!AP23","v":62},{"$f":"MTK!O23","v":51},{"$f":"RTM!AR23","v":62},{"$f":"RTM!AS23","v":62},{"$f":"RTM!AT23","v":60},{"$f":"RTM!AU23","v":60},{"$f":"PJOK!N23","v":52},{"$f":"BD!N23","v":38},{"$f":"BIG!N23","v":34},{"$f":"ASWJ!N23","v":67},{"$f":"'MLK1'!N23","v":30},{"$f":"'MLK2'!N23","v":0},{"$f":"'MLK3'!N23","v":0},853,53.3125,16,null,null,"cetak",null,null,"Jangan pernah putus asa tingkatkan  semangat belajarmu!"]
[null,14,{"$f":"SW!C23","v":"14"},{"$f":"SW!D23","v":4602},{"$f":"SW!F23","v":0},{"$f":"SW!G23","v":"INES ARIFANI MAULINA"},null,{"$f":"AH!N24","v":72},{"$f":"AA!N24","v":69},{"$f":"FQ!N24","v":64},{"$f":"SKI!N24","v":57},{"$f":"BA!N24","v":35},{"$f":"RTM!AP24","v":69},{"$f":"MTK!O24","v":47},{"$f":"RTM!AR24","v":69},{"$f":"RTM!AS24","v":69},{"$f":"RTM!AT24","v":59},{"$f":"RTM!AU24","v":59},{"$f":"PJOK!N24","v":55},{"$f":"BD!N24","v":70},{"$f":"BIG!N24","v":66},{"$f":"ASWJ!N24","v":59},{"$f":"'MLK1'!N24","v":80},{"$f":"'MLK2'!N24","v":0},{"$f":"'MLK3'!N24","v":0},999,62.4375,5,null,null,"cetak",null,null,"Jangan pernah putus asa tingkatkan  semangat belajarmu!"]
[null,15,{"$f":"SW!C24","v":"15"},{"$f":"SW!D24","v":4374},{"$f":"SW!F24","v":0},{"$f":"SW!G24","v":"IYAAD  AFLAKHA RAMZII"},null,{"$f":"AH!N25","v":60},{"$f":"AA!N25","v":67},{"$f":"FQ!N25","v":89},{"$f":"SKI!N25","v":55},{"$f":"BA!N25","v":39},{"$f":"RTM!AP25","v":64},{"$f":"MTK!O25","v":34},{"$f":"RTM!AR25","v":64},{"$f":"RTM!AS25","v":64},{"$f":"RTM!AT25","v":54},{"$f":"RTM!AU25","v":54},{"$f":"PJOK!N25","v":53},{"$f":"BD!N25","v":26},{"$f":"BIG!N25","v":36},{"$f":"ASWJ!N25","v":53},{"$f":"'MLK1'!N25","v":30},{"$f":"'MLK2'!N25","v":0},{"$f":"'MLK3'!N25","v":0},842,52.625,19,null,null,"cetak",null,null,"Jangan pernah putus asa tingkatkan  semangat belajarmu!"]
[null,16,{"$f":"SW!C25","v":"16"},{"$f":"SW!D25","v":4305},{"$f":"SW!F25","v":0},{"$f":"SW!G25","v":"JULI ANDRIYANTO"},null,{"$f":"AH!N26","v":49},{"$f":"AA!N26","v":54},{"$f":"FQ!N26","v":82},{"$f":"SKI!N26","v":44},{"$f":"BA!N26","v":25},{"$f":"RTM!AP26","v":47},{"$f":"MTK!O26","v":41},{"$f":"RTM!AR26","v":47},{"$f":"RTM!AS26","v":47},{"$f":"RTM!AT26","v":41},{"$f":"RTM!AU26","v":41},{"$f":"PJOK!N26","v":52},{"$f":"BD!N26","v":23},{"$f":"BIG!N26","v":30},{"$f":"ASWJ!N26","v":62},{"$f":"'MLK1'!N26","v":30},{"$f":"'MLK2'!N26","v":0},{"$f":"'MLK3'!N26","v":0},715,44.6875,28,null,null,"cetak",null,null,"Jangan pernah putus asa tingkatkan  semangat belajarmu!"]
[null,17,{"$f":"SW!C26","v":"17"},{"$f":"SW!D26","v":4347},{"$f":"SW!F26","v":0},{"$f":"SW!G26","v":"LIYA FEBRIYANI"},null,{"$f":"AH!N27","v":69},{"$f":"AA!N27","v":80},{"$f":"FQ!N27","v":83},{"$f":"SKI!N27","v":69},{"$f":"BA!N27","v":52},{"$f":"RTM!AP27","v":80},{"$f":"MTK!O27","v":66},{"$f":"RTM!AR27","v":80},{"$f":"RTM!AS27","v":80},{"$f":"RTM!AT27","v":58},{"$f":"RTM!AU27","v":58},{"$f":"PJOK!N27","v":67},{"$f":"BD!N27","v":76},{"$f":"BIG!N27","v":66},{"$f":"ASWJ!N27","v":79},{"$f":"'MLK1'!N27","v":70},{"$f":"'MLK2'!N27","v":0},{"$f":"'MLK3'!N27","v":0},1133,70.8125,1,null,null,"cetak",null,null,"pertahankan prestasimu dan teruslah belajar"]
[null,18,{"$f":"SW!C27","v":"18"},{"$f":"SW!D27","v":4348},{"$f":"SW!F27","v":0},{"$f":"SW!G27","v":"LIZATUL CHAIYUNI"},null,{"$f":"AH!N28","v":84},{"$f":"AA!N28","v":72},{"$f":"FQ!N28","v":72},{"$f":"SKI!N28","v":59},{"$f":"BA!N28","v":42},{"$f":"RTM!AP28","v":70},{"$f":"MTK!O28","v":50},{"$f":"RTM!AR28","v":70},{"$f":"RTM!AS28","v":70},{"$f":"RTM!AT28","v":46},{"$f":"RTM!AU28","v":46},{"$f":"PJOK!N28","v":49},{"$f":"BD!N28","v":70},{"$f":"BIG!N28","v":57},{"$f":"ASWJ!N28","v":74},{"$f":"'MLK1'!N28","v":60},{"$f":"'MLK2'!N28","v":0},{"$f":"'MLK3'!N28","v":0},991,61.9375,7,null,null,"cetak",null,null,"Jangan pernah putus asa tingkatkan  semangat belajarmu!"]
[null,19,{"$f":"SW!C28","v":"19"},{"$f":"SW!D28","v":4531},{"$f":"SW!F28","v":0},{"$f":"SW!G28","v":"M.AL HAFIZ"},null,{"$f":"AH!N29","v":48},{"$f":"AA!N29","v":67},{"$f":"FQ!N29","v":80},{"$f":"SKI!N29","v":50},{"$f":"BA!N29","v":32},{"$f":"RTM!AP29","v":70},{"$f":"MTK!O29","v":19},{"$f":"RTM!AR29","v":70},{"$f":"RTM!AS29","v":70},{"$f":"RTM!AT29","v":52},{"$f":"RTM!AU29","v":52},{"$f":"PJOK!N29","v":50},{"$f":"BD!N29","v":44},{"$f":"BIG!N29","v":57},{"$f":"ASWJ!N29","v":62},{"$f":"'MLK1'!N29","v":20},{"$f":"'MLK2'!N29","v":0},{"$f":"'MLK3'!N29","v":0},843,52.6875,18,null,null,"cetak",null,null,"Jangan pernah putus asa tingkatkan  semangat belajarmu!"]
[null,20,{"$f":"SW!C29","v":"20"},{"$f":"SW!D29","v":4530},{"$f":"SW!F29","v":0},{"$f":"SW!G29","v":"M. RIZKY RIDWAN"},null,{"$f":"AH!N30","v":59},{"$f":"AA!N30","v":63},{"$f":"FQ!N30","v":69},{"$f":"SKI!N30","v":29},{"$f":"BA!N30","v":30},{"$f":"RTM!AP30","v":50},{"$f":"MTK!O30","v":41},{"$f":"RTM!AR30","v":50},{"$f":"RTM!AS30","v":50},{"$f":"RTM!AT30","v":43},{"$f":"RTM!AU30","v":43},{"$f":"PJOK!N30","v":65},{"$f":"BD!N30","v":28},{"$f":"BIG!N30","v":25},{"$f":"ASWJ!N30","v":55},{"$f":"'MLK1'!N30","v":20},{"$f":"'MLK2'!N30","v":0},{"$f":"'MLK3'!N30","v":0},720,45,27,null,null,"cetak",null,null,"Jangan pernah putus asa tingkatkan  semangat belajarmu!"]
[null,21,{"$f":"SW!C30","v":"21"},{"$f":"SW!D30","v":4351},null,{"$f":"SW!G30","v":"MOCHAMAD RAFLI DIAN SAPUTRA"},null,{"$f":"AH!N31","v":49},{"$f":"AA!N31","v":63},{"$f":"FQ!N31","v":58},{"$f":"SKI!N31","v":40},{"$f":"BA!N31","v":20},{"$f":"RTM!AP31","v":62},{"$f":"MTK!O31","v":46},{"$f":"RTM!AR31","v":62},{"$f":"RTM!AS31","v":62},{"$f":"RTM!AT31","v":53},{"$f":"RTM!AU31","v":53},{"$f":"PJOK!N31","v":69},{"$f":"BD!N31","v":13},{"$f":"BIG!N31","v":85},{"$f":"ASWJ!N31","v":62},{"$f":"'MLK1'!N31","v":10},{"$f":"'MLK2'!N31","v":0},{"$f":"'MLK3'!N31","v":0},807,50.4375,21,null,null,"cetak",null,null,"Jangan pernah putus asa tingkatkan  semangat belajarmu!"]
[null,22,{"$f":"SW!C31","v":"22"},{"$f":"SW!D31","v":4352},null,{"$f":"SW!G31","v":"MOCHAMMAD AFAREL PUTRA RAMDHANA"},null,{"$f":"AH!N32","v":68},{"$f":"AA!N32","v":67},{"$f":"FQ!N32","v":85},{"$f":"SKI!N32","v":42},{"$f":"BA!N32","v":27},{"$f":"RTM!AP32","v":84},{"$f":"MTK!O32","v":75},{"$f":"RTM!AR32","v":84},{"$f":"RTM!AS32","v":84},{"$f":"RTM!AT32","v":59},{"$f":"RTM!AU32","v":59},{"$f":"PJOK!N32","v":56},{"$f":"BD!N32","v":55},{"$f":"BIG!N32","v":20},{"$f":"ASWJ!N32","v":67},{"$f":"'MLK1'!N32","v":10},{"$f":"'MLK2'!N32","v":0},{"$f":"'MLK3'!N32","v":0},942,58.875,10,null,null,"cetak",null,null,"Jangan pernah putus asa tingkatkan  semangat belajarmu!"]
[null,23,{"$f":"SW!C32","v":"23"},{"$f":"SW!D32","v":4355},null,{"$f":"SW!G32","v":"MUHAMAD JEFRI MAULANA"},null,{"$f":"AH!N33","v":73},{"$f":"AA!N33","v":61},{"$f":"FQ!N33","v":84},{"$f":"SKI!N33","v":54},{"$f":"BA!N33","v":29},{"$f":"RTM!AP33","v":65},{"$f":"MTK!O33","v":59},{"$f":"RTM!AR33","v":65},{"$f":"RTM!AS33","v":65},{"$f":"RTM!AT33","v":55},{"$f":"RTM!AU33","v":55},{"$f":"PJOK!N33","v":70},{"$f":"BD!N33","v":66},{"$f":"BIG!N33","v":55},{"$f":"ASWJ!N33","v":65},{"$f":"'MLK1'!N33","v":20},{"$f":"'MLK2'!N33","v":0},{"$f":"'MLK3'!N33","v":0},941,58.8125,11,null,null,"cetak",null,null,"Jangan pernah putus asa tingkatkan  semangat belajarmu!"]
[null,24,{"$f":"SW!C33","v":"24"},{"$f":"SW!D33","v":4376},null,{"$f":"SW!G33","v":"MUHAMMAD DWI WILDAN BAGUS KURNIAWAN"},null,{"$f":"AH!N34","v":29},{"$f":"AA!N34","v":49},{"$f":"FQ!N34","v":59},{"$f":"SKI!N34","v":47},{"$f":"BA!N34","v":20},{"$f":"RTM!AP34","v":45},{"$f":"MTK!O34","v":22},{"$f":"RTM!AR34","v":45},{"$f":"RTM!AS34","v":45},{"$f":"RTM!AT34","v":43},{"$f":"RTM!AU34","v":43},{"$f":"PJOK!N34","v":39},{"$f":"BD!N34","v":56},{"$f":"BIG!N34","v":79},{"$f":"ASWJ!N34","v":62},{"$f":"'MLK1'!N34","v":20},{"$f":"'MLK2'!N34","v":0},{"$f":"'MLK3'!N34","v":0},703,43.9375,30,null,null,"cetak",null,null,"Jangan pernah putus asa tingkatkan  semangat belajarmu!"]
[null,25,{"$f":"SW!C34","v":"25"},{"$f":"SW!D34","v":4377},null,{"$f":"SW!G34","v":"MUHAMMAD FARIL FIRMANSYA"},null,{"$f":"AH!N35","v":63},{"$f":"AA!N35","v":50},{"$f":"FQ!N35","v":77},{"$f":"SKI!N35","v":40},{"$f":"BA!N35","v":35},{"$f":"RTM!AP35","v":49},{"$f":"MTK!O35","v":28},{"$f":"RTM!AR35","v":49},{"$f":"RTM!AS35","v":49},{"$f":"RTM!AT35","v":50},{"$f":"RTM!AU35","v":50},{"$f":"PJOK!N35","v":41},{"$f":"BD!N35","v":44},{"$f":"BIG!N35","v":25},{"$f":"ASWJ!N35","v":59},{"$f":"'MLK1'!N35","v":30},{"$f":"'MLK2'!N35","v":0},{"$f":"'MLK3'!N35","v":0},739,46.1875,26,null,null,"cetak",null,null,"Jangan pernah putus asa tingkatkan  semangat belajarmu!"]
[null,26,{"$f":"SW!C35","v":"26"},{"$f":"SW!D35","v":4349},null,{"$f":"SW!G35","v":"MUHAMMAD FARIZ UBAIDILLA"},null,{"$f":"AH!N36","v":71},{"$f":"AA!N36","v":56},{"$f":"FQ!N36","v":84},{"$f":"SKI!N36","v":52},{"$f":"BA!N36","v":20},{"$f":"RTM!AP36","v":65},{"$f":"MTK!O36","v":69},{"$f":"RTM!AR36","v":65},{"$f":"RTM!AS36","v":65},{"$f":"RTM!AT36","v":62},{"$f":"RTM!AU36","v":62},{"$f":"PJOK!N36","v":62},{"$f":"BD!N36","v":55},{"$f":"BIG!N36","v":34},{"$f":"ASWJ!N36","v":68},{"$f":"'MLK1'!N36","v":20},{"$f":"'MLK2'!N36","v":0},{"$f":"'MLK3'!N36","v":0},910,56.875,14,null,null,"cetak",null,null,"Jangan pernah putus asa tingkatkan  semangat belajarmu!"]
[null,27,{"$f":"SW!C36","v":"27"},{"$f":"SW!D36","v":4356},null,{"$f":"SW!G36","v":"MUHAMMAD MAULANA ZIDANIL ILMI"},null,{"$f":"AH!N37","v":73},{"$f":"AA!N37","v":83},{"$f":"FQ!N37","v":70},{"$f":"SKI!N37","v":59},{"$f":"BA!N37","v":47},{"$f":"RTM!AP37","v":81},{"$f":"MTK!O37","v":47},{"$f":"RTM!AR37","v":81},{"$f":"RTM!AS37","v":81},{"$f":"RTM!AT37","v":55},{"$f":"RTM!AU37","v":55},{"$f":"PJOK!N37","v":59},{"$f":"BD!N37","v":58},{"$f":"BIG!N37","v":57},{"$f":"ASWJ!N37","v":80},{"$f":"'MLK1'!N37","v":50},{"$f":"'MLK2'!N37","v":0},{"$f":"'MLK3'!N37","v":0},1036,64.75,3,null,null,"cetak",null,null,"pertahankan prestasimu dan teruslah belajar"]
[null,28,{"$f":"SW!C37","v":"28"},{"$f":"SW!D37","v":4357},null,{"$f":"SW!G37","v":"MUHAMMAD SUTRISNO ISMAIL"},null,{"$f":"AH!N38","v":39},{"$f":"AA!N38","v":70},{"$f":"FQ!N38","v":57},{"$f":"SKI!N38","v":42},{"$f":"BA!N38","v":30},{"$f":"RTM!AP38","v":41},{"$f":"MTK!O38","v":30},{"$f":"RTM!AR38","v":41},{"$f":"RTM!AS38","v":41},{"$f":"RTM!AT38","v":47},{"$f":"RTM!AU38","v":47},{"$f":"PJOK!N38","v":28},{"$f":"BD!N38","v":38},{"$f":"BIG!N38","v":49},{"$f":"ASWJ!N38","v":57},{"$f":"'MLK1'!N38","v":30},{"$f":"'MLK2'!N38","v":0},{"$f":"'MLK3'!N38","v":0},687,42.9375,31,null,null,"cetak",null,null,"Jangan pernah putus asa tingkatkan  semangat belajarmu!"]
[null,29,{"$f":"SW!C38","v":"29"},{"$f":"SW!D38","v":4381},null,{"$f":"SW!G38","v":"NOVITA ERNIAWAN"},null,{"$f":"AH!N39","v":69},{"$f":"AA!N39","v":79},{"$f":"FQ!N39","v":79},{"$f":"SKI!N39","v":54},{"$f":"BA!N39","v":40},{"$f":"RTM!AP39","v":73},{"$f":"MTK!O39","v":62},{"$f":"RTM!AR39","v":73},{"$f":"RTM!AS39","v":73},{"$f":"RTM!AT39","v":66},{"$f":"RTM!AU39","v":66},{"$f":"PJOK!N39","v":57},{"$f":"BD!N39","v":77},{"$f":"BIG!N39","v":74},{"$f":"ASWJ!N39","v":69},{"$f":"'MLK1'!N39","v":40},{"$f":"'MLK2'!N39","v":0},{"$f":"'MLK3'!N39","v":0},1051,65.6875,2,null,null,"cetak",null,null,"Jangan pernah putus asa tingkatkan  semangat belajarmu!"]
[null,30,{"$f":"SW!C39","v":"30"},{"$f":"SW!D39","v":4383},null,{"$f":"SW!G39","v":"PUTRI AULIA DWI AGUSTIN"},null,{"$f":"AH!N40","v":85},{"$f":"AA!N40","v":62},{"$f":"FQ!N40","v":85},{"$f":"SKI!N40","v":47},{"$f":"BA!N40","v":50},{"$f":"RTM!AP40","v":75},{"$f":"MTK!O40","v":33},{"$f":"RTM!AR40","v":75},{"$f":"RTM!AS40","v":75},{"$f":"RTM!AT40","v":57},{"$f":"RTM!AU40","v":57},{"$f":"PJOK!N40","v":61},{"$f":"BD!N40","v":69},{"$f":"BIG!N40","v":43},{"$f":"ASWJ!N40","v":75},{"$f":"'MLK1'!N40","v":50},{"$f":"'MLK2'!N40","v":0},{"$f":"'MLK3'!N40","v":0},999,62.4375,5,null,null,"cetak",null,null,"Jangan pernah putus asa tingkatkan  semangat belajarmu!"]
[null,31,{"$f":"SW!C40","v":"31"},{"$f":"SW!D40","v":4385},null,{"$f":"SW!G40","v":"STANY RAFIDAH RAHMANIA"},null,{"$f":"AH!N41","v":49},{"$f":"AA!N41","v":52},{"$f":"FQ!N41","v":54},{"$f":"SKI!N41","v":37},{"$f":"BA!N41","v":30},{"$f":"RTM!AP41","v":44},{"$f":"MTK!O41","v":34},{"$f":"RTM!AR41","v":44},{"$f":"RTM!AS41","v":44},{"$f":"RTM!AT41","v":43},{"$f":"RTM!AU41","v":43},{"$f":"PJOK!N41","v":50},{"$f":"BD!N41","v":21},{"$f":"BIG!N41","v":37},{"$f":"ASWJ!N41","v":60},{"$f":"'MLK1'!N41","v":30},{"$f":"'MLK2'!N41","v":0},{"$f":"'MLK3'!N41","v":0},672,42,32,null,null,"cetak",null,null,"Jangan pernah putus asa tingkatkan  semangat belajarmu!"]
[null,32,{"$f":"SW!C41","v":"32"},{"$f":"SW!D41","v":4387},null,{"$f":"SW!G41","v":"USWATUN KHASANAH"},null,{"$f":"AH!N42","v":67},{"$f":"AA!N42","v":80},{"$f":"FQ!N42","v":71},{"$f":"SKI!N42","v":42},{"$f":"BA!N42","v":32},{"$f":"RTM!AP42","v":65},{"$f":"MTK!O42","v":25},{"$f":"RTM!AR42","v":65},{"$f":"RTM!AS42","v":65},{"$f":"RTM!AT42","v":52},{"$f":"RTM!AU42","v":52},{"$f":"PJOK!N42","v":49},{"$f":"BD!N42","v":48},{"$f":"BIG!N42","v":30},{"$f":"ASWJ!N42","v":64},{"$f":"'MLK1'!N42","v":40},{"$f":"'MLK2'!N42","v":0},{"$f":"'MLK3'!N42","v":0},847,52.9375,17,null,null,"cetak",null,null,"Jangan pernah putus asa tingkatkan  semangat belajarmu!"]
[null,33,{"$f":"SW!C42","v":"33"},{"$f":"SW!D42","v":4389},null,{"$f":"SW!G42","v":"VIKROUL KHAMILA"},null,{"$f":"AH!N43","v":77},{"$f":"AA!N43","v":63},{"$f":"FQ!N43","v":71},{"$f":"SKI!N43","v":45},{"$f":"BA!N43","v":34},{"$f":"RTM!AP43","v":72},{"$f":"MTK!O43","v":77},{"$f":"RTM!AR43","v":72},{"$f":"RTM!AS43","v":72},{"$f":"RTM!AT43","v":56},{"$f":"RTM!AU43","v":56},{"$f":"PJOK!N43","v":40},{"$f":"BD!N43","v":48},{"$f":"BIG!N43","v":30},{"$f":"ASWJ!N43","v":69},{"$f":"'MLK1'!N43","v":40},{"$f":"'MLK2'!N43","v":0},{"$f":"'MLK3'!N43","v":0},922,57.625,12,null,null,"cetak",null,null,"Jangan pernah putus asa tingkatkan  semangat belajarmu!"]
[null,34,{"$f":"SW!C43","v":""},null,null,{"$f":"SW!G43","v":0},null,{"$f":"AH!N44","v":0},{"$f":"AA!N44","v":0},{"$f":"FQ!N44","v":0},{"$f":"SKI!N44","v":0},{"$f":"BA!N44","v":0},{"$f":"RTM!AP44","v":""},{"$f":"MTK!O44","v":""},{"$f":"RTM!AR44","v":""},{"$f":"RTM!AS44","v":""},{"$f":"RTM!AT44","v":""},{"$f":"RTM!AU44","v":""},{"$f":"PJOK!N44","v":0},{"$f":"BD!N44","v":0},{"$f":"BIG!N44","v":0},{"$f":"ASWJ!N44","v":0},{"$f":"'MLK1'!N44","v":0},{"$f":"'MLK2'!N44","v":0},{"$f":"'MLK3'!N44","v":0},0,0,null,null,null,0]
[null,35,{"$f":"SW!C44","v":""},null,null,{"$f":"SW!G44","v":0},null,{"$f":"AH!N45","v":0},{"$f":"AA!N45","v":0},{"$f":"FQ!N45","v":0},{"$f":"SKI!N45","v":0},{"$f":"BA!N45","v":0},{"$f":"RTM!AP45","v":""},{"$f":"MTK!O45","v":""},{"$f":"RTM!AR45","v":""},{"$f":"RTM!AS45","v":""},{"$f":"RTM!AT45","v":""},{"$f":"RTM!AU45","v":""},{"$f":"PJOK!N45","v":0},{"$f":"BD!N45","v":0},{"$f":"BIG!N45","v":0},{"$f":"ASWJ!N45","v":0},{"$f":"'MLK1'!N45","v":0},{"$f":"'MLK2'!N45","v":0},{"$f":"'MLK3'!N45","v":0},0,0,null,null,null,0]
[null,36,{"$f":"SW!C45","v":""},null,null,{"$f":"SW!G45","v":0},null,{"$f":"AH!N46","v":0},{"$f":"AA!N46","v":0},{"$f":"FQ!N46","v":0},{"$f":"SKI!N46","v":0},{"$f":"BA!N46","v":0},{"$f":"RTM!AP46","v":""},{"$f":"MTK!O46","v":""},{"$f":"RTM!AR46","v":""},{"$f":"RTM!AS46","v":""},{"$f":"RTM!AT46","v":""},{"$f":"RTM!AU46","v":""},{"$f":"PJOK!N46","v":0},{"$f":"BD!N46","v":0},{"$f":"BIG!N46","v":0},{"$f":"ASWJ!N46","v":0},{"$f":"'MLK1'!N46","v":0},{"$f":"'MLK2'!N46","v":0},{"$f":"'MLK3'!N46","v":0},0,0,null,null,null,0]
[null,37,{"$f":"SW!C46","v":""},null,null,{"$f":"SW!G46","v":0},null,{"$f":"AH!N47","v":0},{"$f":"AA!N47","v":0},{"$f":"FQ!N47","v":0},{"$f":"SKI!N47","v":0},{"$f":"BA!N47","v":0},{"$f":"RTM!AP47","v":""},{"$f":"MTK!O47","v":""},{"$f":"RTM!AR47","v":""},{"$f":"RTM!AS47","v":""},{"$f":"RTM!AT47","v":""},{"$f":"RTM!AU47","v":""},{"$f":"PJOK!N47","v":0},{"$f":"BD!N47","v":0},{"$f":"BIG!N47","v":0},{"$f":"ASWJ!N47","v":0},{"$f":"'MLK1'!N47","v":0},{"$f":"'MLK2'!N47","v":0},{"$f":"'MLK3'!N47","v":0},0,0,null,null,null,0]
[null,38,{"$f":"SW!C47","v":""},null,null,{"$f":"SW!G47","v":0},null,{"$f":"AH!N48","v":0},{"$f":"AA!N48","v":0},{"$f":"FQ!N48","v":0},{"$f":"SKI!N48","v":0},{"$f":"BA!N48","v":0},{"$f":"RTM!AP48","v":""},{"$f":"MTK!O48","v":""},{"$f":"RTM!AR48","v":""},{"$f":"RTM!AS48","v":""},{"$f":"RTM!AT48","v":""},{"$f":"RTM!AU48","v":""},{"$f":"PJOK!N48","v":0},{"$f":"BD!N48","v":0},{"$f":"BIG!N48","v":0},{"$f":"ASWJ!N48","v":0},{"$f":"'MLK1'!N48","v":0},{"$f":"'MLK2'!N48","v":0},{"$f":"'MLK3'!N48","v":0},0,0,null,null,null,0]
[null,39,{"$f":"SW!C48","v":""},null,null,{"$f":"SW!G48","v":0},null,{"$f":"AH!N49","v":0},{"$f":"AA!N49","v":0},{"$f":"FQ!N49","v":0},{"$f":"SKI!N49","v":0},{"$f":"BA!N49","v":0},{"$f":"RTM!AP49","v":""},{"$f":"MTK!O49","v":""},{"$f":"RTM!AR49","v":""},{"$f":"RTM!AS49","v":""},{"$f":"RTM!AT49","v":""},{"$f":"RTM!AU49","v":""},{"$f":"PJOK!N49","v":0},{"$f":"BD!N49","v":0},{"$f":"BIG!N49","v":0},{"$f":"ASWJ!N49","v":0},{"$f":"'MLK1'!N49","v":0},{"$f":"'MLK2'!N49","v":0},{"$f":"'MLK3'!N49","v":0},0,0,null,null,null,0]
[null,40,{"$f":"SW!C49","v":""},null,null,{"$f":"SW!G49","v":0},null,{"$f":"AH!N50","v":0},{"$f":"AA!N50","v":0},{"$f":"FQ!N50","v":0},{"$f":"SKI!N50","v":0},{"$f":"BA!N50","v":0},{"$f":"RTM!AP50","v":""},{"$f":"MTK!O50","v":""},{"$f":"RTM!AR50","v":""},{"$f":"RTM!AS50","v":""},{"$f":"RTM!AT50","v":""},{"$f":"RTM!AU50","v":""},{"$f":"PJOK!N50","v":0},{"$f":"BD!N50","v":0},{"$f":"BIG!N50","v":0},{"$f":"ASWJ!N50","v":0},{"$f":"'MLK1'!N50","v":0},{"$f":"'MLK2'!N50","v":0},{"$f":"'MLK3'!N50","v":0},0,0,null,null,null,0]
[null,41,{"$f":"SW!C50","v":""},null,null,{"$f":"SW!G50","v":0},null,{"$f":"AH!N51","v":0},{"$f":"AA!N51","v":0},{"$f":"FQ!N51","v":0},{"$f":"SKI!N51","v":0},{"$f":"BA!N51","v":0},{"$f":"RTM!AP51","v":""},{"$f":"MTK!O51","v":""},{"$f":"RTM!AR51","v":""},{"$f":"RTM!AS51","v":""},{"$f":"RTM!AT51","v":""},{"$f":"RTM!AU51","v":""},{"$f":"PJOK!N51","v":0},{"$f":"BD!N51","v":0},{"$f":"BIG!N51","v":0},{"$f":"ASWJ!N51","v":0},{"$f":"'MLK1'!N51","v":0},{"$f":"'MLK2'!N51","v":0},{"$f":"'MLK3'!N51","v":0},0,0,null,null,null,0]
[null,42,{"$f":"SW!C51","v":""},null,null,{"$f":"SW!G51","v":0},null,{"$f":"AH!N52","v":0},{"$f":"AA!N52","v":0},{"$f":"FQ!N52","v":0},{"$f":"SKI!N52","v":0},{"$f":"BA!N52","v":0},{"$f":"RTM!AP52","v":""},{"$f":"MTK!O52","v":""},{"$f":"RTM!AR52","v":""},{"$f":"RTM!AS52","v":""},{"$f":"RTM!AT52","v":""},{"$f":"RTM!AU52","v":""},{"$f":"PJOK!N52","v":0},{"$f":"BD!N52","v":0},{"$f":"BIG!N52","v":0},{"$f":"ASWJ!N52","v":0},{"$f":"'MLK1'!N52","v":0},{"$f":"'MLK2'!N52","v":0},{"$f":"'MLK3'!N52","v":0},0,0,null,null,null,0]
[null,43,{"$f":"SW!C52","v":""},null,null,{"$f":"SW!G52","v":0},null,{"$f":"AH!N53","v":0},{"$f":"AA!N53","v":0},{"$f":"FQ!N53","v":0},{"$f":"SKI!N53","v":0},{"$f":"BA!N53","v":0},{"$f":"RTM!AP53","v":""},{"$f":"MTK!O53","v":""},{"$f":"RTM!AR53","v":""},{"$f":"RTM!AS53","v":""},{"$f":"RTM!AT53","v":""},{"$f":"RTM!AU53","v":""},{"$f":"PJOK!N53","v":0},{"$f":"BD!N53","v":0},{"$f":"BIG!N53","v":0},{"$f":"ASWJ!N53","v":0},{"$f":"'MLK1'!N53","v":0},{"$f":"'MLK2'!N53","v":0},{"$f":"'MLK3'!N53","v":0},0,0,null,null,null,0]
[null,44,{"$f":"SW!C53","v":""},null,null,{"$f":"SW!G53","v":0},null,{"$f":"AH!N54","v":0},{"$f":"AA!N54","v":0},{"$f":"FQ!N54","v":0},{"$f":"SKI!N54","v":0},{"$f":"BA!N54","v":0},{"$f":"RTM!AP54","v":""},{"$f":"MTK!O54","v":""},{"$f":"RTM!AR54","v":""},{"$f":"RTM!AS54","v":""},{"$f":"RTM!AT54","v":""},{"$f":"RTM!AU54","v":""},{"$f":"PJOK!N54","v":0},{"$f":"BD!N54","v":0},{"$f":"BIG!N54","v":0},{"$f":"ASWJ!N54","v":0},{"$f":"'MLK1'!N54","v":0},{"$f":"'MLK2'!N54","v":0},{"$f":"'MLK3'!N54","v":0},0,0,null,null,null,0]
[null,45,{"$f":"SW!C54","v":""},null,null,{"$f":"SW!G54","v":0},null,{"$f":"AH!N55","v":0},{"$f":"AA!N55","v":0},{"$f":"FQ!N55","v":0},{"$f":"SKI!N55","v":0},{"$f":"BA!N55","v":0},{"$f":"RTM!AP55","v":""},{"$f":"MTK!O55","v":""},{"$f":"RTM!AR55","v":""},{"$f":"RTM!AS55","v":""},{"$f":"RTM!AT55","v":""},{"$f":"RTM!AU55","v":""},{"$f":"PJOK!N55","v":0},{"$f":"BD!N55","v":0},{"$f":"BIG!N55","v":0},{"$f":"ASWJ!N55","v":0},{"$f":"'MLK1'!N55","v":0},{"$f":"'MLK2'!N55","v":0},{"$f":"'MLK3'!N55","v":0},0,0,null,null,null,0]
[null,46,{"$f":"SW!C55","v":""},null,null,{"$f":"SW!G55","v":0},null,{"$f":"AH!N56","v":0},{"$f":"AA!N56","v":0},{"$f":"FQ!N56","v":0},{"$f":"SKI!N56","v":0},{"$f":"BA!N56","v":0},{"$f":"RTM!AP56","v":""},{"$f":"MTK!O56","v":""},{"$f":"RTM!AR56","v":""},{"$f":"RTM!AS56","v":""},{"$f":"RTM!AT56","v":""},{"$f":"RTM!AU56","v":""},{"$f":"PJOK!N56","v":0},{"$f":"BD!N56","v":0},{"$f":"BIG!N56","v":0},{"$f":"ASWJ!N56","v":0},{"$f":"'MLK1'!N56","v":0},{"$f":"'MLK2'!N56","v":0},{"$f":"'MLK3'!N56","v":0},0,0,null,null,null,0]
[null,47,{"$f":"SW!C56","v":""},null,null,{"$f":"SW!G56","v":0},null,{"$f":"AH!N57","v":0},{"$f":"AA!N57","v":0},{"$f":"FQ!N57","v":0},{"$f":"SKI!N57","v":0},{"$f":"BA!N57","v":0},{"$f":"RTM!AP57","v":""},{"$f":"MTK!O57","v":""},{"$f":"RTM!AR57","v":""},{"$f":"RTM!AS57","v":""},{"$f":"RTM!AT57","v":""},{"$f":"RTM!AU57","v":""},{"$f":"PJOK!N57","v":0},{"$f":"BD!N57","v":0},{"$f":"BIG!N57","v":0},{"$f":"ASWJ!N57","v":0},{"$f":"'MLK1'!N57","v":0},{"$f":"'MLK2'!N57","v":0},{"$f":"'MLK3'!N57","v":0},0,0,null,null,null,0]
[null,48,{"$f":"SW!C57","v":""},null,null,{"$f":"SW!G57","v":0},null,{"$f":"AH!N58","v":0},{"$f":"AA!N58","v":0},{"$f":"FQ!N58","v":0},{"$f":"SKI!N58","v":0},{"$f":"BA!N58","v":0},{"$f":"RTM!AP58","v":""},{"$f":"MTK!O58","v":""},{"$f":"RTM!AR58","v":""},{"$f":"RTM!AS58","v":""},{"$f":"RTM!AT58","v":""},{"$f":"RTM!AU58","v":""},{"$f":"PJOK!N58","v":0},{"$f":"BD!N58","v":0},{"$f":"BIG!N58","v":0},{"$f":"ASWJ!N58","v":0},{"$f":"'MLK1'!N58","v":0},{"$f":"'MLK2'!N58","v":0},{"$f":"'MLK3'!N58","v":0},0,0,null,null,null,0]
[null,49,{"$f":"SW!C58","v":""},null,null,{"$f":"SW!G58","v":0},null,{"$f":"AH!N59","v":0},{"$f":"AA!N59","v":0},{"$f":"FQ!N59","v":0},{"$f":"SKI!N59","v":0},{"$f":"BA!N59","v":0},{"$f":"RTM!AP59","v":""},{"$f":"MTK!O59","v":""},{"$f":"RTM!AR59","v":""},{"$f":"RTM!AS59","v":""},{"$f":"RTM!AT59","v":""},{"$f":"RTM!AU59","v":""},{"$f":"PJOK!N59","v":0},{"$f":"BD!N59","v":0},{"$f":"BIG!N59","v":0},{"$f":"ASWJ!N59","v":0},{"$f":"'MLK1'!N59","v":0},{"$f":"'MLK2'!N59","v":0},{"$f":"'MLK3'!N59","v":0},0,0,null,null,null,0]
[null,50,{"$f":"SW!C59","v":""},null,null,{"$f":"SW!G59","v":0},null,{"$f":"AH!N60","v":0},{"$f":"AA!N60","v":0},{"$f":"FQ!N60","v":0},{"$f":"SKI!N60","v":0},{"$f":"BA!N60","v":0},{"$f":"RTM!AP60","v":""},{"$f":"MTK!O60","v":""},{"$f":"RTM!AR60","v":""},{"$f":"RTM!AS60","v":""},{"$f":"RTM!AT60","v":""},{"$f":"RTM!AU60","v":""},{"$f":"PJOK!N60","v":0},{"$f":"BD!N60","v":0},{"$f":"BIG!N60","v":0},{"$f":"ASWJ!N60","v":0},{"$f":"'MLK1'!N60","v":0},{"$f":"'MLK2'!N60","v":0},{"$f":"'MLK3'!N60","v":0},0,0,null,null,null,0]
[null,51,{"$f":"SW!C60","v":""},null,null,{"$f":"SW!G60","v":0},null,{"$f":"AH!N61","v":0},{"$f":"AA!N61","v":0},{"$f":"FQ!N61","v":0},{"$f":"SKI!N61","v":0},{"$f":"BA!N61","v":0},{"$f":"RTM!AP61","v":""},{"$f":"MTK!O61","v":""},{"$f":"RTM!AR61","v":""},{"$f":"RTM!AS61","v":""},{"$f":"RTM!AT61","v":""},{"$f":"RTM!AU61","v":""},{"$f":"PJOK!N61","v":0},{"$f":"BD!N61","v":0},{"$f":"BIG!N61","v":0},{"$f":"ASWJ!N61","v":0},{"$f":"'MLK1'!N61","v":0},{"$f":"'MLK2'!N61","v":0},{"$f":"'MLK3'!N61","v":0},0,0,null,null,null,0]
[null,52,{"$f":"SW!C61","v":""},null,null,{"$f":"SW!G61","v":0},null,{"$f":"AH!N62","v":0},{"$f":"AA!N62","v":0},{"$f":"FQ!N62","v":0},{"$f":"SKI!N62","v":0},{"$f":"BA!N62","v":0},{"$f":"RTM!AP62","v":""},{"$f":"MTK!O62","v":""},{"$f":"RTM!AR62","v":""},{"$f":"RTM!AS62","v":""},{"$f":"RTM!AT62","v":""},{"$f":"RTM!AU62","v":""},{"$f":"PJOK!N62","v":0},{"$f":"BD!N62","v":0},{"$f":"BIG!N62","v":0},{"$f":"ASWJ!N62","v":0},{"$f":"'MLK1'!N62","v":0},{"$f":"'MLK2'!N62","v":0},{"$f":"'MLK3'!N62","v":0},0,0,null,null,null,0]
[null,53,{"$f":"SW!C62","v":""},null,null,{"$f":"SW!G62","v":0},null,{"$f":"AH!N63","v":0},{"$f":"AA!N63","v":0},{"$f":"FQ!N63","v":0},{"$f":"SKI!N63","v":0},{"$f":"BA!N63","v":0},{"$f":"RTM!AP63","v":""},{"$f":"MTK!O63","v":""},{"$f":"RTM!AR63","v":""},{"$f":"RTM!AS63","v":""},{"$f":"RTM!AT63","v":""},{"$f":"RTM!AU63","v":""},{"$f":"PJOK!N63","v":0},{"$f":"BD!N63","v":0},{"$f":"BIG!N63","v":0},{"$f":"ASWJ!N63","v":0},{"$f":"'MLK1'!N63","v":0},{"$f":"'MLK2'!N63","v":0},{"$f":"'MLK3'!N63","v":0},0,0,null,null,null,0]
[null,54,{"$f":"SW!C63","v":""},null,null,{"$f":"SW!G63","v":0},null,{"$f":"AH!N64","v":0},{"$f":"AA!N64","v":0},{"$f":"FQ!N64","v":0},{"$f":"SKI!N64","v":0},{"$f":"BA!N64","v":0},{"$f":"RTM!AP64","v":""},{"$f":"MTK!O64","v":""},{"$f":"RTM!AR64","v":""},{"$f":"RTM!AS64","v":""},{"$f":"RTM!AT64","v":""},{"$f":"RTM!AU64","v":""},{"$f":"PJOK!N64","v":0},{"$f":"BD!N64","v":0},{"$f":"BIG!N64","v":0},{"$f":"ASWJ!N64","v":0},{"$f":"'MLK1'!N64","v":0},{"$f":"'MLK2'!N64","v":0},{"$f":"'MLK3'!N64","v":0},0,0,null,null,null,0]
[null,55,{"$f":"SW!C64","v":""},null,null,{"$f":"SW!G64","v":0},null,{"$f":"AH!N65","v":0},{"$f":"AA!N65","v":0},{"$f":"FQ!N65","v":0},{"$f":"SKI!N65","v":0},{"$f":"BA!N65","v":0},{"$f":"RTM!AP65","v":""},{"$f":"MTK!O65","v":""},{"$f":"RTM!AR65","v":""},{"$f":"RTM!AS65","v":""},{"$f":"RTM!AT65","v":""},{"$f":"RTM!AU65","v":""},{"$f":"PJOK!N65","v":0},{"$f":"BD!N65","v":0},{"$f":"BIG!N65","v":0},{"$f":"ASWJ!N65","v":0},{"$f":"'MLK1'!N65","v":0},{"$f":"'MLK2'!N65","v":0},{"$f":"'MLK3'!N65","v":0},0,0,null,null,null,0]
[null,56,{"$f":"SW!C65","v":""},null,null,{"$f":"SW!G65","v":0},null,{"$f":"AH!N66","v":0},{"$f":"AA!N66","v":0},{"$f":"FQ!N66","v":0},{"$f":"SKI!N66","v":0},{"$f":"BA!N66","v":0},{"$f":"RTM!AP66","v":""},{"$f":"MTK!O66","v":""},{"$f":"RTM!AR66","v":""},{"$f":"RTM!AS66","v":""},{"$f":"RTM!AT66","v":""},{"$f":"RTM!AU66","v":""},{"$f":"PJOK!N66","v":0},{"$f":"BD!N66","v":0},{"$f":"BIG!N66","v":0},{"$f":"ASWJ!N66","v":0},{"$f":"'MLK1'!N66","v":0},{"$f":"'MLK2'!N66","v":0},{"$f":"'MLK3'!N66","v":0},0,0,null,null,null,0]
[null,57,{"$f":"SW!C66","v":""},null,null,{"$f":"SW!G66","v":0},null,{"$f":"AH!N67","v":0},{"$f":"AA!N67","v":0},{"$f":"FQ!N67","v":0},{"$f":"SKI!N67","v":0},{"$f":"BA!N67","v":0},{"$f":"RTM!AP67","v":""},{"$f":"MTK!O67","v":""},{"$f":"RTM!AR67","v":""},{"$f":"RTM!AS67","v":""},{"$f":"RTM!AT67","v":""},{"$f":"RTM!AU67","v":""},{"$f":"PJOK!N67","v":0},{"$f":"BD!N67","v":0},{"$f":"BIG!N67","v":0},{"$f":"ASWJ!N67","v":0},{"$f":"'MLK1'!N67","v":0},{"$f":"'MLK2'!N67","v":0},{"$f":"'MLK3'!N67","v":0},0,0,null,null,null,0]
[null,58,{"$f":"SW!C67","v":""},null,null,{"$f":"SW!G67","v":0},null,{"$f":"AH!N68","v":0},{"$f":"AA!N68","v":0},{"$f":"FQ!N68","v":0},{"$f":"SKI!N68","v":0},{"$f":"BA!N68","v":0},{"$f":"RTM!AP68","v":""},{"$f":"MTK!O68","v":""},{"$f":"RTM!AR68","v":""},{"$f":"RTM!AS68","v":""},{"$f":"RTM!AT68","v":""},{"$f":"RTM!AU68","v":""},{"$f":"PJOK!N68","v":0},{"$f":"BD!N68","v":0},{"$f":"BIG!N68","v":0},{"$f":"ASWJ!N68","v":0},{"$f":"'MLK1'!N68","v":0},{"$f":"'MLK2'!N68","v":0},{"$f":"'MLK3'!N68","v":0},0,0,null,null,null,0]
[null,59,{"$f":"SW!C68","v":""},null,null,{"$f":"SW!G68","v":0},null,{"$f":"AH!N69","v":0},{"$f":"AA!N69","v":0},{"$f":"FQ!N69","v":0},{"$f":"SKI!N69","v":0},{"$f":"BA!N69","v":0},{"$f":"RTM!AP69","v":""},{"$f":"MTK!O69","v":""},{"$f":"RTM!AR69","v":""},{"$f":"RTM!AS69","v":""},{"$f":"RTM!AT69","v":""},{"$f":"RTM!AU69","v":""},{"$f":"PJOK!N69","v":0},{"$f":"BD!N69","v":0},{"$f":"BIG!N69","v":0},{"$f":"ASWJ!N69","v":0},{"$f":"'MLK1'!N69","v":0},{"$f":"'MLK2'!N69","v":0},{"$f":"'MLK3'!N69","v":0},0,0,null,null,null,0]
[null,60,{"$f":"SW!C69","v":""},null,null,{"$f":"SW!G69","v":0},null,{"$f":"AH!N70","v":0},{"$f":"AA!N70","v":0},{"$f":"FQ!N70","v":0},{"$f":"SKI!N70","v":0},{"$f":"BA!N70","v":0},{"$f":"RTM!AP70","v":""},{"$f":"MTK!O70","v":""},{"$f":"RTM!AR70","v":""},{"$f":"RTM!AS70","v":""},{"$f":"RTM!AT70","v":""},{"$f":"RTM!AU70","v":""},{"$f":"PJOK!N70","v":0},{"$f":"BD!N70","v":0},{"$f":"BIG!N70","v":0},{"$f":"ASWJ!N70","v":0},{"$f":"'MLK1'!N70","v":0},{"$f":"'MLK2'!N70","v":0},{"$f":"'MLK3'!N70","v":0},0,0,null,null,null,0]
[null,61,{"$f":"SW!C70","v":""},null,null,{"$f":"SW!G70","v":0},null,{"$f":"AH!N71","v":0},{"$f":"AA!N71","v":0},{"$f":"FQ!N71","v":0},{"$f":"SKI!N71","v":0},{"$f":"BA!N71","v":0},{"$f":"RTM!AP71","v":""},{"$f":"MTK!O71","v":""},{"$f":"RTM!AR71","v":""},{"$f":"RTM!AS71","v":""},{"$f":"RTM!AT71","v":""},{"$f":"RTM!AU71","v":""},{"$f":"PJOK!N71","v":0},{"$f":"BD!N71","v":0},{"$f":"BIG!N71","v":0},{"$f":"ASWJ!N71","v":0},{"$f":"'MLK1'!N71","v":0},{"$f":"'MLK2'!N71","v":0},{"$f":"'MLK3'!N71","v":0},0,0,null,null,null,0]
[null,62,{"$f":"SW!C71","v":""},null,null,{"$f":"SW!G71","v":0},null,{"$f":"AH!N72","v":0},{"$f":"AA!N72","v":0},{"$f":"FQ!N72","v":0},{"$f":"SKI!N72","v":0},{"$f":"BA!N72","v":0},{"$f":"RTM!AP72","v":""},{"$f":"MTK!O72","v":""},{"$f":"RTM!AR72","v":""},{"$f":"RTM!AS72","v":""},{"$f":"RTM!AT72","v":""},{"$f":"RTM!AU72","v":""},{"$f":"PJOK!N72","v":0},{"$f":"BD!N72","v":0},{"$f":"BIG!N72","v":0},{"$f":"ASWJ!N72","v":0},{"$f":"'MLK1'!N72","v":0},{"$f":"'MLK2'!N72","v":0},{"$f":"'MLK3'!N72","v":0},0,0,null,null,null,0]
[null,63,{"$f":"SW!C72","v":""},null,null,{"$f":"SW!G72","v":0},null,{"$f":"AH!N73","v":0},{"$f":"AA!N73","v":0},{"$f":"FQ!N73","v":0},{"$f":"SKI!N73","v":0},{"$f":"BA!N73","v":0},{"$f":"RTM!AP73","v":""},{"$f":"MTK!O73","v":""},{"$f":"RTM!AR73","v":""},{"$f":"RTM!AS73","v":""},{"$f":"RTM!AT73","v":""},{"$f":"RTM!AU73","v":""},{"$f":"PJOK!N73","v":0},{"$f":"BD!N73","v":0},{"$f":"BIG!N73","v":0},{"$f":"ASWJ!N73","v":0},{"$f":"'MLK1'!N73","v":0},{"$f":"'MLK2'!N73","v":0},{"$f":"'MLK3'!N73","v":0},0,0,null,null,null,0]
[null,64,{"$f":"SW!C73","v":""},null,null,{"$f":"SW!G73","v":0},null,{"$f":"AH!N74","v":0},{"$f":"AA!N74","v":0},{"$f":"FQ!N74","v":0},{"$f":"SKI!N74","v":0},{"$f":"BA!N74","v":0},{"$f":"RTM!AP74","v":""},{"$f":"MTK!O74","v":""},{"$f":"RTM!AR74","v":""},{"$f":"RTM!AS74","v":""},{"$f":"RTM!AT74","v":""},{"$f":"RTM!AU74","v":""},{"$f":"PJOK!N74","v":0},{"$f":"BD!N74","v":0},{"$f":"BIG!N74","v":0},{"$f":"ASWJ!N74","v":0},{"$f":"'MLK1'!N74","v":0},{"$f":"'MLK2'!N74","v":0},{"$f":"'MLK3'!N74","v":0},0,0,null,null,null,0]
[null,65,{"$f":"SW!C74","v":""},null,null,{"$f":"SW!G74","v":0},null,{"$f":"AH!N75","v":0},{"$f":"AA!N75","v":0},{"$f":"FQ!N75","v":0},{"$f":"SKI!N75","v":0},{"$f":"BA!N75","v":0},{"$f":"RTM!AP75","v":""},{"$f":"MTK!O75","v":""},{"$f":"RTM!AR75","v":""},{"$f":"RTM!AS75","v":""},{"$f":"RTM!AT75","v":""},{"$f":"RTM!AU75","v":""},{"$f":"PJOK!N75","v":0},{"$f":"BD!N75","v":0},{"$f":"BIG!N75","v":0},{"$f":"ASWJ!N75","v":0},{"$f":"'MLK1'!N75","v":0},{"$f":"'MLK2'!N75","v":0},{"$f":"'MLK3'!N75","v":0},0,0,null,null,null,0]
[null,66,{"$f":"SW!C75","v":""},null,null,{"$f":"SW!G75","v":0},null,{"$f":"AH!N76","v":0},{"$f":"AA!N76","v":0},{"$f":"FQ!N76","v":0},{"$f":"SKI!N76","v":0},{"$f":"BA!N76","v":0},{"$f":"RTM!AP76","v":""},{"$f":"MTK!O76","v":""},{"$f":"RTM!AR76","v":""},{"$f":"RTM!AS76","v":""},{"$f":"RTM!AT76","v":""},{"$f":"RTM!AU76","v":""},{"$f":"PJOK!N76","v":0},{"$f":"BD!N76","v":0},{"$f":"BIG!N76","v":0},{"$f":"ASWJ!N76","v":0},{"$f":"'MLK1'!N76","v":0},{"$f":"'MLK2'!N76","v":0},{"$f":"'MLK3'!N76","v":0},{"$f":"SUM(H84:Y84)","v":0},{"$f":"AVERAGE(H84:W84)","v":0},null,null,null,{"$f":"IF(C84=\"\",0,\"cetak\")","v":0}]
[null,67,{"$f":"SW!C76","v":""},null,null,{"$f":"SW!G76","v":0},null,{"$f":"AH!N77","v":0},{"$f":"AA!N77","v":0},{"$f":"FQ!N77","v":0},{"$f":"SKI!N77","v":0},{"$f":"BA!N77","v":0},{"$f":"RTM!AP77","v":""},{"$f":"MTK!O77","v":""},{"$f":"RTM!AR77","v":""},{"$f":"RTM!AS77","v":""},{"$f":"RTM!AT77","v":""},{"$f":"RTM!AU77","v":""},{"$f":"PJOK!N77","v":0},{"$f":"BD!N77","v":0},{"$f":"BIG!N77","v":0},{"$f":"ASWJ!N77","v":0},{"$f":"'MLK1'!N77","v":0},{"$f":"'MLK2'!N77","v":0},{"$f":"'MLK3'!N77","v":0},0,0,null,null,null,0]
[null,68,{"$f":"SW!C77","v":""},null,null,{"$f":"SW!G77","v":0},null,{"$f":"AH!N78","v":0},{"$f":"AA!N78","v":0},{"$f":"FQ!N78","v":0},{"$f":"SKI!N78","v":0},{"$f":"BA!N78","v":0},{"$f":"RTM!AP78","v":""},{"$f":"MTK!O78","v":""},{"$f":"RTM!AR78","v":""},{"$f":"RTM!AS78","v":""},{"$f":"RTM!AT78","v":""},{"$f":"RTM!AU78","v":""},{"$f":"PJOK!N78","v":0},{"$f":"BD!N78","v":0},{"$f":"BIG!N78","v":0},{"$f":"ASWJ!N78","v":0},{"$f":"'MLK1'!N78","v":0},{"$f":"'MLK2'!N78","v":0},{"$f":"'MLK3'!N78","v":0},0,0,null,null,null,0]
[null,69,{"$f":"SW!C78","v":""},null,null,{"$f":"SW!G78","v":0},null,{"$f":"AH!N79","v":0},{"$f":"AA!N79","v":0},{"$f":"FQ!N79","v":0},{"$f":"SKI!N79","v":0},{"$f":"BA!N79","v":0},{"$f":"RTM!AP79","v":""},{"$f":"MTK!O79","v":""},{"$f":"RTM!AR79","v":""},{"$f":"RTM!AS79","v":""},{"$f":"RTM!AT79","v":""},{"$f":"RTM!AU79","v":""},{"$f":"PJOK!N79","v":0},{"$f":"BD!N79","v":0},{"$f":"BIG!N79","v":0},{"$f":"ASWJ!N79","v":0},{"$f":"'MLK1'!N79","v":0},{"$f":"'MLK2'!N79","v":0},{"$f":"'MLK3'!N79","v":0},0,0,null,null,null,0]
[null,70,{"$f":"SW!C79","v":""},null,null,{"$f":"SW!G79","v":0},null,{"$f":"AH!N80","v":0},{"$f":"AA!N80","v":0},{"$f":"FQ!N80","v":0},{"$f":"SKI!N80","v":0},{"$f":"BA!N80","v":0},{"$f":"RTM!AP80","v":""},{"$f":"MTK!O80","v":""},{"$f":"RTM!AR80","v":""},{"$f":"RTM!AS80","v":""},{"$f":"RTM!AT80","v":""},{"$f":"RTM!AU80","v":""},{"$f":"PJOK!N80","v":0},{"$f":"BD!N80","v":0},{"$f":"BIG!N80","v":0},{"$f":"ASWJ!N80","v":0},{"$f":"'MLK1'!N80","v":0},{"$f":"'MLK2'!N80","v":0},{"$f":"'MLK3'!N80","v":0},0,0,null,null,null,0]
[null,71,{"$f":"SW!C80","v":""},null,null,{"$f":"SW!G80","v":0},null,{"$f":"AH!N81","v":0},{"$f":"AA!N81","v":0},{"$f":"FQ!N81","v":0},{"$f":"SKI!N81","v":0},{"$f":"BA!N81","v":0},{"$f":"RTM!AP81","v":""},{"$f":"MTK!O81","v":""},{"$f":"RTM!AR81","v":""},{"$f":"RTM!AS81","v":""},{"$f":"RTM!AT81","v":""},{"$f":"RTM!AU81","v":""},{"$f":"PJOK!N81","v":0},{"$f":"BD!N81","v":0},{"$f":"BIG!N81","v":0},{"$f":"ASWJ!N81","v":0},{"$f":"'MLK1'!N81","v":0},{"$f":"'MLK2'!N81","v":0},{"$f":"'MLK3'!N81","v":0},0,0,null,null,null,0]
[null,72,{"$f":"SW!C81","v":""},null,null,{"$f":"SW!G81","v":0},null,{"$f":"AH!N82","v":0},{"$f":"AA!N82","v":0},{"$f":"FQ!N82","v":0},{"$f":"SKI!N82","v":0},{"$f":"BA!N82","v":0},{"$f":"RTM!AP82","v":""},{"$f":"MTK!O82","v":""},{"$f":"RTM!AR82","v":""},{"$f":"RTM!AS82","v":""},{"$f":"RTM!AT82","v":""},{"$f":"RTM!AU82","v":""},{"$f":"PJOK!N82","v":0},{"$f":"BD!N82","v":0},{"$f":"BIG!N82","v":0},{"$f":"ASWJ!N82","v":0},{"$f":"'MLK1'!N82","v":0},{"$f":"'MLK2'!N82","v":0},{"$f":"'MLK3'!N82","v":0},0,0,null,null,null,0]
[null,73,{"$f":"SW!C82","v":""},null,null,{"$f":"SW!G82","v":0},null,{"$f":"AH!N83","v":0},{"$f":"AA!N83","v":0},{"$f":"FQ!N83","v":0},{"$f":"SKI!N83","v":0},{"$f":"BA!N83","v":0},{"$f":"RTM!AP83","v":""},{"$f":"MTK!O83","v":""},{"$f":"RTM!AR83","v":""},{"$f":"RTM!AS83","v":""},{"$f":"RTM!AT83","v":""},{"$f":"RTM!AU83","v":""},{"$f":"PJOK!N83","v":0},{"$f":"BD!N83","v":0},{"$f":"BIG!N83","v":0},{"$f":"ASWJ!N83","v":0},{"$f":"'MLK1'!N83","v":0},{"$f":"'MLK2'!N83","v":0},{"$f":"'MLK3'!N83","v":0},0,0,null,null,null,0]
[null,74,{"$f":"SW!C83","v":""},null,null,{"$f":"SW!G83","v":0},null,{"$f":"AH!N84","v":0},{"$f":"AA!N84","v":0},{"$f":"FQ!N84","v":0},{"$f":"SKI!N84","v":0},{"$f":"BA!N84","v":0},{"$f":"RTM!AP84","v":""},{"$f":"MTK!O84","v":""},{"$f":"RTM!AR84","v":""},{"$f":"RTM!AS84","v":""},{"$f":"RTM!AT84","v":""},{"$f":"RTM!AU84","v":""},{"$f":"PJOK!N84","v":0},{"$f":"BD!N84","v":0},{"$f":"BIG!N84","v":0},{"$f":"ASWJ!N84","v":0},{"$f":"'MLK1'!N84","v":0},{"$f":"'MLK2'!N84","v":0},{"$f":"'MLK3'!N84","v":0},0,0,null,null,null,0]
[null,75,{"$f":"SW!C84","v":""},null,null,{"$f":"SW!G84","v":0},null,{"$f":"AH!N85","v":0},{"$f":"AA!N85","v":0},{"$f":"FQ!N85","v":0},{"$f":"SKI!N85","v":0},{"$f":"BA!N85","v":0},{"$f":"RTM!AP85","v":""},{"$f":"MTK!O85","v":""},{"$f":"RTM!AR85","v":""},{"$f":"RTM!AS85","v":""},{"$f":"RTM!AT85","v":""},{"$f":"RTM!AU85","v":""},{"$f":"PJOK!N85","v":0},{"$f":"BD!N85","v":0},{"$f":"BIG!N85","v":0},{"$f":"ASWJ!N85","v":0},{"$f":"'MLK1'!N85","v":0},{"$f":"'MLK2'!N85","v":0},{"$f":"'MLK3'!N85","v":0},0,0,null,null,null,0]
[null,76,{"$f":"SW!C85","v":""},null,null,{"$f":"SW!G85","v":0},null,{"$f":"AH!N86","v":0},{"$f":"AA!N86","v":0},{"$f":"FQ!N86","v":0},{"$f":"SKI!N86","v":0},{"$f":"BA!N86","v":0},{"$f":"RTM!AP86","v":""},{"$f":"MTK!O86","v":""},{"$f":"RTM!AR86","v":""},{"$f":"RTM!AS86","v":""},{"$f":"RTM!AT86","v":""},{"$f":"RTM!AU86","v":""},{"$f":"PJOK!N86","v":0},{"$f":"BD!N86","v":0},{"$f":"BIG!N86","v":0},{"$f":"ASWJ!N86","v":0},{"$f":"'MLK1'!N86","v":0},{"$f":"'MLK2'!N86","v":0},{"$f":"'MLK3'!N86","v":0},0,0,null,null,null,0]
[null,77,{"$f":"SW!C86","v":""},null,null,{"$f":"SW!G86","v":0},null,{"$f":"AH!N87","v":0},{"$f":"AA!N87","v":0},{"$f":"FQ!N87","v":0},{"$f":"SKI!N87","v":0},{"$f":"BA!N87","v":0},{"$f":"RTM!AP87","v":""},{"$f":"MTK!O87","v":""},{"$f":"RTM!AR87","v":""},{"$f":"RTM!AS87","v":""},{"$f":"RTM!AT87","v":""},{"$f":"RTM!AU87","v":""},{"$f":"PJOK!N87","v":0},{"$f":"BD!N87","v":0},{"$f":"BIG!N87","v":0},{"$f":"ASWJ!N87","v":0},{"$f":"'MLK1'!N87","v":0},{"$f":"'MLK2'!N87","v":0},{"$f":"'MLK3'!N87","v":0},0,0,null,null,null,0]
[null,78,{"$f":"SW!C87","v":""},null,null,{"$f":"SW!G87","v":0},null,{"$f":"AH!N88","v":0},{"$f":"AA!N88","v":0},{"$f":"FQ!N88","v":0},{"$f":"SKI!N88","v":0},{"$f":"BA!N88","v":0},{"$f":"RTM!AP88","v":""},{"$f":"MTK!O88","v":""},{"$f":"RTM!AR88","v":""},{"$f":"RTM!AS88","v":""},{"$f":"RTM!AT88","v":""},{"$f":"RTM!AU88","v":""},{"$f":"PJOK!N88","v":0},{"$f":"BD!N88","v":0},{"$f":"BIG!N88","v":0},{"$f":"ASWJ!N88","v":0},{"$f":"'MLK1'!N88","v":0},{"$f":"'MLK2'!N88","v":0},{"$f":"'MLK3'!N88","v":0},0,0,null,null,null,0]
[null,79,{"$f":"SW!C88","v":""},null,null,{"$f":"SW!G88","v":0},null,{"$f":"AH!N89","v":0},{"$f":"AA!N89","v":0},{"$f":"FQ!N89","v":0},{"$f":"SKI!N89","v":0},{"$f":"BA!N89","v":0},{"$f":"RTM!AP89","v":""},{"$f":"MTK!O89","v":""},{"$f":"RTM!AR89","v":""},{"$f":"RTM!AS89","v":""},{"$f":"RTM!AT89","v":""},{"$f":"RTM!AU89","v":""},{"$f":"PJOK!N89","v":0},{"$f":"BD!N89","v":0},{"$f":"BIG!N89","v":0},{"$f":"ASWJ!N89","v":0},{"$f":"'MLK1'!N89","v":0},{"$f":"'MLK2'!N89","v":0},{"$f":"'MLK3'!N89","v":0},0,0,null,null,null,0]
[null,80,{"$f":"SW!C89","v":""},null,null,{"$f":"SW!G89","v":0},null,{"$f":"AH!N90","v":0},{"$f":"AA!N90","v":0},{"$f":"FQ!N90","v":0},{"$f":"SKI!N90","v":0},{"$f":"BA!N90","v":0},{"$f":"RTM!AP90","v":""},{"$f":"MTK!O90","v":""},{"$f":"RTM!AR90","v":""},{"$f":"RTM!AS90","v":""},{"$f":"RTM!AT90","v":""},{"$f":"RTM!AU90","v":""},{"$f":"PJOK!N90","v":0},{"$f":"BD!N90","v":0},{"$f":"BIG!N90","v":0},{"$f":"ASWJ!N90","v":0},{"$f":"'MLK1'!N90","v":0},{"$f":"'MLK2'!N90","v":0},{"$f":"'MLK3'!N90","v":0},0,0,null,null,null,0]
[null,81,{"$f":"SW!C90","v":""},null,null,{"$f":"SW!G90","v":0},null,{"$f":"AH!N91","v":0},{"$f":"AA!N91","v":0},{"$f":"FQ!N91","v":0},{"$f":"SKI!N91","v":0},{"$f":"BA!N91","v":0},{"$f":"RTM!AP91","v":""},{"$f":"MTK!O91","v":""},{"$f":"RTM!AR91","v":""},{"$f":"RTM!AS91","v":""},{"$f":"RTM!AT91","v":""},{"$f":"RTM!AU91","v":""},{"$f":"PJOK!N91","v":0},{"$f":"BD!N91","v":0},{"$f":"BIG!N91","v":0},{"$f":"ASWJ!N91","v":0},{"$f":"'MLK1'!N91","v":0},{"$f":"'MLK2'!N91","v":0},{"$f":"'MLK3'!N91","v":0},0,0,null,null,null,0]
[null,82,{"$f":"SW!C91","v":""},null,null,{"$f":"SW!G91","v":0},null,{"$f":"AH!N92","v":0},{"$f":"AA!N92","v":0},{"$f":"FQ!N92","v":0},{"$f":"SKI!N92","v":0},{"$f":"BA!N92","v":0},{"$f":"RTM!AP92","v":""},{"$f":"MTK!O92","v":""},{"$f":"RTM!AR92","v":""},{"$f":"RTM!AS92","v":""},{"$f":"RTM!AT92","v":""},{"$f":"RTM!AU92","v":""},{"$f":"PJOK!N92","v":0},{"$f":"BD!N92","v":0},{"$f":"BIG!N92","v":0},{"$f":"ASWJ!N92","v":0},{"$f":"'MLK1'!N92","v":0},{"$f":"'MLK2'!N92","v":0},{"$f":"'MLK3'!N92","v":0},0,0,null,null,null,0]
[null,83,{"$f":"SW!C92","v":""},null,null,{"$f":"SW!G92","v":0},null,{"$f":"AH!N93","v":0},{"$f":"AA!N93","v":0},{"$f":"FQ!N93","v":0},{"$f":"SKI!N93","v":0},{"$f":"BA!N93","v":0},{"$f":"RTM!AP93","v":""},{"$f":"MTK!O93","v":""},{"$f":"RTM!AR93","v":""},{"$f":"RTM!AS93","v":""},{"$f":"RTM!AT93","v":""},{"$f":"RTM!AU93","v":""},{"$f":"PJOK!N93","v":0},{"$f":"BD!N93","v":0},{"$f":"BIG!N93","v":0},{"$f":"ASWJ!N93","v":0},{"$f":"'MLK1'!N93","v":0},{"$f":"'MLK2'!N93","v":0},{"$f":"'MLK3'!N93","v":0},0,0,null,null,null,0]
[null,84,{"$f":"SW!C93","v":""},null,null,{"$f":"SW!G93","v":0},null,{"$f":"AH!N94","v":0},{"$f":"AA!N94","v":0},{"$f":"FQ!N94","v":0},{"$f":"SKI!N94","v":0},{"$f":"BA!N94","v":0},{"$f":"RTM!AP94","v":""},{"$f":"MTK!O94","v":""},{"$f":"RTM!AR94","v":""},{"$f":"RTM!AS94","v":""},{"$f":"RTM!AT94","v":""},{"$f":"RTM!AU94","v":""},{"$f":"PJOK!N94","v":0},{"$f":"BD!N94","v":0},{"$f":"BIG!N94","v":0},{"$f":"ASWJ!N94","v":0},{"$f":"'MLK1'!N94","v":0},{"$f":"'MLK2'!N94","v":0},{"$f":"'MLK3'!N94","v":0},0,0,null,null,null,0]
[null,85,{"$f":"SW!C94","v":""},null,null,{"$f":"SW!G94","v":0},null,{"$f":"AH!N95","v":0},{"$f":"AA!N95","v":0},{"$f":"FQ!N95","v":0},{"$f":"SKI!N95","v":0},{"$f":"BA!N95","v":0},{"$f":"RTM!AP95","v":""},{"$f":"MTK!O95","v":""},{"$f":"RTM!AR95","v":""},{"$f":"RTM!AS95","v":""},{"$f":"RTM!AT95","v":""},{"$f":"RTM!AU95","v":""},{"$f":"PJOK!N95","v":0},{"$f":"BD!N95","v":0},{"$f":"BIG!N95","v":0},{"$f":"ASWJ!N95","v":0},{"$f":"'MLK1'!N95","v":0},{"$f":"'MLK2'!N95","v":0},{"$f":"'MLK3'!N95","v":0},0,0,null,null,null,0]
[null,86,{"$f":"SW!C95","v":""},null,null,{"$f":"SW!G95","v":0},null,{"$f":"AH!N96","v":0},{"$f":"AA!N96","v":0},{"$f":"FQ!N96","v":0},{"$f":"SKI!N96","v":0},{"$f":"BA!N96","v":0},{"$f":"RTM!AP96","v":""},{"$f":"MTK!O96","v":""},{"$f":"RTM!AR96","v":""},{"$f":"RTM!AS96","v":""},{"$f":"RTM!AT96","v":""},{"$f":"RTM!AU96","v":""},{"$f":"PJOK!N96","v":0},{"$f":"BD!N96","v":0},{"$f":"BIG!N96","v":0},{"$f":"ASWJ!N96","v":0},{"$f":"'MLK1'!N96","v":0},{"$f":"'MLK2'!N96","v":0},{"$f":"'MLK3'!N96","v":0},0,0,null,null,null,0]
[null,87,{"$f":"SW!C96","v":""},null,null,{"$f":"SW!G96","v":0},null,{"$f":"AH!N97","v":0},{"$f":"AA!N97","v":0},{"$f":"FQ!N97","v":0},{"$f":"SKI!N97","v":0},{"$f":"BA!N97","v":0},{"$f":"RTM!AP97","v":""},{"$f":"MTK!O97","v":""},{"$f":"RTM!AR97","v":""},{"$f":"RTM!AS97","v":""},{"$f":"RTM!AT97","v":""},{"$f":"RTM!AU97","v":""},{"$f":"PJOK!N97","v":0},{"$f":"BD!N97","v":0},{"$f":"BIG!N97","v":0},{"$f":"ASWJ!N97","v":0},{"$f":"'MLK1'!N97","v":0},{"$f":"'MLK2'!N97","v":0},{"$f":"'MLK3'!N97","v":0},0,0,null,null,null,0]
[null,88,{"$f":"SW!C97","v":""},null,null,{"$f":"SW!G97","v":0},null,{"$f":"AH!N98","v":0},{"$f":"AA!N98","v":0},{"$f":"FQ!N98","v":0},{"$f":"SKI!N98","v":0},{"$f":"BA!N98","v":0},{"$f":"RTM!AP98","v":""},{"$f":"MTK!O98","v":""},{"$f":"RTM!AR98","v":""},{"$f":"RTM!AS98","v":""},{"$f":"RTM!AT98","v":""},{"$f":"RTM!AU98","v":""},{"$f":"PJOK!N98","v":0},{"$f":"BD!N98","v":0},{"$f":"BIG!N98","v":0},{"$f":"ASWJ!N98","v":0},{"$f":"'MLK1'!N98","v":0},{"$f":"'MLK2'!N98","v":0},{"$f":"'MLK3'!N98","v":0},0,0,null,null,null,0]
[null,89,{"$f":"SW!C98","v":""},null,null,{"$f":"SW!G98","v":0},null,{"$f":"AH!N99","v":0},{"$f":"AA!N99","v":0},{"$f":"FQ!N99","v":0},{"$f":"SKI!N99","v":0},{"$f":"BA!N99","v":0},{"$f":"RTM!AP99","v":""},{"$f":"MTK!O99","v":""},{"$f":"RTM!AR99","v":""},{"$f":"RTM!AS99","v":""},{"$f":"RTM!AT99","v":""},{"$f":"RTM!AU99","v":""},{"$f":"PJOK!N99","v":0},{"$f":"BD!N99","v":0},{"$f":"BIG!N99","v":0},{"$f":"ASWJ!N99","v":0},{"$f":"'MLK1'!N99","v":0},{"$f":"'MLK2'!N99","v":0},{"$f":"'MLK3'!N99","v":0},0,0,null,null,null,0]
[null,null,"JUMLAH",null,null,null,null,{"$f":"SUM(H19:H107)","v":2037},{"$f":"SUM(I19:I107)","v":2109},2397,1534,1052,2024,1437,{"$f":"SUM(O19:O107)","v":2024},{"$f":"SUM(P19:P107)","v":2024},1708,1708,1723,1588,{"$f":"SUM(U19:U107)","v":1693},{"$f":"SUM(V19:V107)","v":2115},{"$f":"SUM(W19:W107)","v":1085},0,0,"-"]
[null,null,"RATA-RATA",null,null,null,null,{"$f":"IFERROR(ROUND(AVERAGE(H19:H107),0),\"\")","v":23},{"$f":"IFERROR(ROUND(AVERAGE(I19:I107),0),\"\")","v":24},27,17,12,61,44,61,61,52,52,19,18,{"$f":"IFERROR(ROUND(AVERAGE(U19:U107),0),\"\")","v":19},{"$f":"IFERROR(ROUND(AVERAGE(V19:V107),0),\"\")","v":24},12,0,0]
[null,null,"NILAI TERTINGGI",null,null,null,null,{"$f":"MAX(H19:H107)","v":85},{"$f":"MAX(I19:I107)","v":83},90,69,52,84,77,84,84,66,66,70,77,88,80,80,0,0]
[null,null,"NILAI TERENDAH",null,null,null,null,{"$f":"MIN(H19:H107)","v":0},{"$f":"MIN(I19:I107)","v":0},0,0,0,30,15,30,30,36,36,0,0,0,0,0,0,0]
[]
[null,null,null,null,null,null,null,null,null,null,null,null,null,null,null,null,null,null,null,null,"Lumajang,",null,{"$f":"MN!H24","v":"8 Nopember 2019"}]
[null,null,null,null,null,null,null,null,null,null,null,null,null,null,null,null,null,null,null,null,null,null,{"$f":"MN!J24","v":"10 Rabiul awal 1440 H"}]
[null,null,null,"Mengetahui,"]
[null,null,null,"Kepala Madrasah",null,null,null,null,null,null,null,null,null,null,null,null,null,null,null,null,{"$f":"\"Wali Kelas \"&UPPER(MN!D22)","v":"Wali Kelas VI B"}]
[]
[]
[]
[]
[null,null,null,{"$f":"MN!D8","v":"SAHRONI, S.Pd.I"},null,null,null,null,null,null,null,null,null,null,null,null,null,null,null,null,{"$f":"MN!D24","v":"NUR RATNA PRIHATININGSIH, S.Pd."}]
[null,null,null,{"$f":"\"NIP. \"&MN!D10","v":"NIP. -"},null,null,null,null,null,null,null,null,null,null,null,null,null,null,null,null,{"$f":"\"NIP. \"&MN!D26","v":"NIP. -"}]

{"sheet":"SW","index":21,"n_rows":98,"n_cols":11,"rows_kept":98,"cut":false,"hidden":false,"merged":[[94,4,94,5],[95,4,95,5],[96,4,96,5],[97,4,97,5],[89,4,89,5],[90,4,90,5],[91,4,91,5],[92,4,92,5],[93,4,93,5],[84,4,84,5],[85,4,85,5],[86,4,86,5],[87,4,87,5],[88,4,88,5],[79,4,79,5],[80,4,80,5],[81,4,81,5],[82,4,82,5],[83,4,83,5],[74,4,74,5],[75,4,75,5],[76,4,76,5],[77,4,77,5],[78,4,78,5],[69,4,69,5],[70,4,70,5],[71,4,71,5],[72,4,72,5],[73,4,73,5],[64,4,64,5],[65,4,65,5],[66,4,66,5],[67,4,67,5],[68,4,68,5],[59,4,59,5],[60,4,60,5],[61,4,61,5],[62,4,62,5],[63,4,63,5],[54,4,54,5],[55,4,55,5],[56,4,56,5],[57,4,57,5],[58,4,58,5],[49,4,49,5],[50,4,50,5],[51,4,51,5],[52,4,52,5],[53,4,53,5],[44,4,44,5],[45,4,45,5],[46,4,46,5],[47,4,47,5],[48,4,48,5],[39,4,39,5],[40,4,40,5],[41,4,41,5],[42,4,42,5],[43,4,43,5],[34,4,34,5],[35,4,35,5],[36,4,36,5],[37,4,37,5],[38,4,38,5],[29,4,29,5],[30,4,30,5],[31,4,31,5],[32,4,32,5],[33,4,33,5],[24,4,24,5],[25,4,25,5],[26,4,26,5],[27,4,27,5],[28,4,28,5],[19,4,19,5],[20,4,20,5],[21,4,21,5],[22,4,22,5],[23,4,23,5],[14,4,14,5],[15,4,15,5],[16,4,16,5],[17,4,17,5],[18,4,18,5],[9,4,9,5],[10,4,10,5],[11,4,11,5],[12,4,12,5],[13,4,13,5],[6,2,8,2],[6,3,8,3],[6,6,8,6],[6,10,8,10],[6,8,8,9],[6,4,8,5],[3,9,4,9],[1,2,1,10],[3,2,3,3],[4,2,4,3],[3,5,3,6],[4,5,4,6],[6,7,8,7]]}
[]
[null,null,"D A F T A R   S I S W A"]
[]
[null,null,"KELAS",null,":",{"$f":"UPPER(MN!D22)","v":"VI B"},null,null,null,"↗"]
[null,null,"TAPEL",null,":",{"$f":"MN!D18","v":"2019 - 2020"}]
[]
[null,null,"No","No. Induk","NISN",null,"Nama Siswa","Jenis Kelamin","TTL",null,"Nama Ortu"]
[]
[]
[1,0,{"$f":"IF(G10<>\"\",B10+1&\"\",\"\")","v":"1"},4330,"0084736422",null,"ACHID ATHIRIL ARDAN","Laki-laki","Lumajang","2008-08-01","IMAM KHAMBALI"]
[2,null,{"$f":"IF(G11<>\"\",C10+1&\"\",\"\")","v":"2"},4361,"0075656390",null,"ACHMAD SEPTIAN HAMDANI","Laki-laki","LUMAJANG","2007-09-10","SYAIFUL ARIS"]
[3,null,{"$f":"IF(G12<>\"\",C11+1&\"\",\"\")","v":"3"},4362,"0071796138",null,"ACHMAD SULAIMAN","Laki-laki","LUMAJANG","2007-07-26","AGUS SULAIMAN"]
[4,null,"4",4364,"0079667684",null,"AIRLANGGA DWIKA RIZQI","Laki-laki","LUMAJANG","2007-12-17","ERIEK ISROFIL"]
[5,null,"5",4365,"0089321127",null,"AUFAN AZKAL ABRORI","Laki-laki","LUMAJANG","2008-05-16","AHMAD AJMAIN"]
[6,null,"6",4465,"0071776593",null,"AZZA PRISHAL DWI PUTRA","Laki-laki","LUMAJANG","2007-08-14","MOHAMMAD SHOLEH"]
[7,null,"7",4368,"0074569410",null,"EKA AULIYA` PUTRI","Perempuan","LUMAJANG","2007-12-07","BASHORI ALWI"]
[8,null,"8",4341,"0083684457",null,"ERSA PUSPITA EKA ROSA LINDA","Perempuan","Lumajang","2008-03-01","SOLIKIN"]
[9,null,"9",4369,"0078481731",null,"FABIYAN TRI BAKTI OKTAFIAN","Laki-laki","LUMAJANG","2007-10-26","FADLOLI"]
[10,null,"10",4343,null,null,"FELISITA APRILIA NUR NIHAYA","Perempuan","Lumajang","2007-04-24","EDI SISWANTO"]
[11,null,"11",4344,null,null,"FIRDA DWI ANDRIANI","Perempuan","LUMAJANG","2007-11-23","MISNATUN"]
[12,null,"12",4372,"0087636520",null,"GILANG AKBAR PRASETYO","Laki-laki","LUMAJANG","2008-01-09","-"]
[13,null,"13",4373,"0087373224",null,"IFTAH IZZAH EMILIA  MAHMUD","Perempuan","LUMAJANG","2008-04-07","AMAR MAKHMUD"]
[14,null,"14",4602,"0081758949",null,"INES ARIFANI MAULINA","Perempuan","LUMAJANG","2008-04-04","MOHAMAD BADRI"]
[15,null,"15",4374,"0073409469",null,"IYAAD  AFLAKHA RAMZII","Laki-laki","LUMAJANG","2007-08-10","ATHO'ILLAH"]
[16,null,"16",4305,"0068258891",null,"JULI ANDRIYANTO","Laki-laki","LUMAJANG","2006-07-11","SIAMAN"]
[17,null,"17",4347,"0076367763",null,"LIYA FEBRIYANI","Perempuan","Lumajang","2007-02-03","MALIK"]
[18,null,"18",4348,"0083034332",null,"LIZATUL CHAIYUNI","Perempuan","Lumajang","2008-04-22","MUCHAMAD BAHRUJI"]
[19,null,"19",4531,null,null,"M.AL HAFIZ","Laki-laki","Lumajang","2009-03-17","RAMLI"]
[20,null,"20",4530,null,null,"M. RIZKY RIDWAN","Laki-laki","Lumajang","2007-11-25","ACHMAD SYAIKHU"]
[21,null,"21",4351,"0076361559",null,"MOCHAMAD RAFLI DIAN SAPUTRA","Laki-laki","Lumajang","2007-07-28","SAMSUL ARIFIN"]
[22,null,"22",4352,"0075591405",null,"MOCHAMMAD AFAREL PUTRA RAMDHANA","Laki-laki","Lumajang","2007-10-10","MOCH MISKI"]
[23,null,"23",4355,"0075363258",null,"MUHAMAD JEFRI MAULANA","Laki-laki","Lumajang","2007-03-10","RODEK SUGIANTORO"]
[24,null,"24",4376,"0072066741",null,"MUHAMMAD DWI WILDAN BAGUS KURNIAWAN","Laki-laki","LUMAJANG","2007-07-11","MOCH SAREH"]
[25,null,"25",4377,"0071459044",null,"MUHAMMAD FARIL FIRMANSYA","Laki-laki","LUMAJANG","2007-08-01","ANDIK SUHARTONO"]
[26,null,"26",4349,"0074206034",null,"MUHAMMAD FARIZ UBAIDILLA","Laki-laki","Lumajang","2007-09-05","MUHAMMAD HERI PRIBADI"]
[27,null,"27",4356,"0077937892",null,"MUHAMMAD MAULANA ZIDANIL ILMI","Laki-laki","Lumajang","2007-11-28","ABDUL ROZAQ"]
[28,null,"28",4357,"0078608527",null,"MUHAMMAD SUTRISNO ISMAIL","Laki-laki","Lumajang","2007-07-15","GATOT ISMAIL"]
[29,null,"29",4381,"0072209435",null,"NOVITA ERNIAWAN","Perempuan","LUMAJANG","2007-11-10","SABAR SETIAWAN"]
[30,null,"30",4383,"0077439834",null,"PUTRI AULIA DWI AGUSTIN","Perempuan","LUMAJANG","2007-08-07","SAHURI"]
[31,null,"31",4385,"0073137310",null,"STANY RAFIDAH RAHMANIA","Perempuan","LUMAJANG","2007-07-26","SUNARIYADI"]
[32,null,"32",4387,"0077336427",null,"USWATUN KHASANAH","Perempuan","LUMAJANG","2007-07-17","SATUKAN"]
[33,null,"33",4389,"0078407631",null,"VIKROUL KHAMILA","Perempuan","LUMAJANG","2007-04-19","AKHMADIYONO"]
[34,null,""]
[35,null,""]
[36,null,""]
[37,null,""]
[38,null,""]
[39,null,""]
[40,null,""]
[41,null,""]
[42,null,""]
[43,null,""]
[44,null,""]
[45,null,""]
[46,null,""]
[47,null,""]
[48,null,""]
[49,null,""]
[50,null,""]
[51,null,""]
[52,null,""]
[53,null,""]
[54,null,""]
[55,null,""]
[56,null,""]
[57,null,""]
[58,null,""]
[59,null,""]
[60,null,""]
[61,null,""]
[62,null,""]
[63,null,""]
[64,null,""]
[65,null,""]
[66,null,""]
[67,null,{"$f":"IF(G76<>\"\",C75+1&\"\",\"\")","v":""}]
[68,null,""]
[69,null,""]
[70,null,""]
[71,null,""]
[72,null,""]
[73,null,""]
[74,null,""]
[75,null,""]
[76,null,""]
[77,null,""]
[78,null,""]
[79,null,""]
[80,null,""]
[81,null,""]
[82,null,""]
[83,null,""]
[84,null,""]
[85,null,""]
[86,null,""]
[87,null,""]
[88,null,""]
[89,null,""]

{"sheet":"RAPORT","index":22,"n_rows":65,"n_cols":16,"rows_kept":65,"cut":false,"hidden":false,"merged":[[55,9,55,11],[47,2,47,5],[49,2,49,5],[43,8,43,9],[44,8,44,9],[45,8,45,9],[54,7,54,8],[54,9,54,11],[44,2,44,7],[44,11,45,11],[45,2,45,7],[37,2,43,2],[51,2,52,11],[38,8,38,9],[39,8,39,9],[40,8,40,9],[41,8,41,9],[42,8,42,9],[32,8,32,9],[34,8,34,9],[35,8,35,9],[36,8,36,9],[37,8,37,9],[33,8,33,9],[27,8,27,9],[28,8,28,9],[29,8,29,9],[30,8,30,9],[31,8,31,9],[14,2,14,5],[24,8,24,9],[15,2,15,5],[16,2,16,5],[17,2,17,5],[20,2,20,5],[19,2,19,5],[23,2,28,2],[25,8,25,9],[26,8,26,9],[15,7,15,8],[16,7,16,8],[17,7,17,8],[18,7,18,8],[19,7,19,8],[20,7,20,8],[10,15,11,15],[6,14,8,15],[11,7,11,8],[12,7,12,8],[12,2,12,5],[11,11,12,11],[11,2,11,5],[29,2,36,2],[4,5,4,10],[3,5,3,10],[6,5,6,10],[5,5,5,10],[18,2,18,5],[9,2,9,11],[10,2,10,11],[22,8,22,9],[23,8,23,9],[3,2,5,4],[6,2,6,4],[14,7,14,8],[22,3,22,7],[13,7,13,8],[13,2,13,5]]}
[]
[]
[]
[null,null,null,null,null,"LEMBAGA PENDIDIKAN MA'ARIF NU CABANG KABUPATEN LUMAJANG"]
[null,null,null,null,null,{"$f":"UPPER(MN!D28&\". \"&MN!D6)","v":"MIS. NURUL ISLAM LABRUK KIDUL"}]
[null,null,null,null,null,{"$f":"UPPER(\"(TERAKREDITASI \"&MN!D30&\")\")","v":"(TERAKREDITASI A)"}]
[null,null,null,null,null,{"$f":"\"Jl. \"&MN!D16","v":"Jl. Raya Labruk Kidul No.65 Labruk Kidul"},null,null,null,null,null,"KEMENAG RI",null,null,"↗"]
[]
[]
[null,null,"L A P O R A N   H A S I L   P E N I L A I A N   T E N G A H   S E M E S T E R"]
[null,null,null,null,null,null,null,null,null,null,null,null,null,null,null,4]
[null,null,"Nama Siswa",null,null,null,":",{"$f":"UPPER(VLOOKUP(P11,SW!A10:K98,7,FALSE))","v":"AIRLANGGA DWIKA RIZQI"},null,null,null,"PAS FOTO"]
[null,null,"Jenis Kelamin",null,null,null,":",{"$f":"UPPER(VLOOKUP(P11,SW!A10:K98,8,FALSE))","v":"LAKI-LAKI"}]
[null,null,"Kelas",null,null,null,":",{"$f":"UPPER(MN!D22)","v":"VI B"}]
[null,null,"Tempat, Tanggal Lahir",null,null,null,":",{"$f":"PROPER(VLOOKUP(P11,SW!A10:K98,9,FALSE))&\", \"&TEXT(VLOOKUP(P11,SW!A10:K98,10,FALSE),\"DD MMMM YYYY\")","v":"Lumajang, 17 Desember 2007"}]
[null,null,"Nomor Induk",null,null,null,":",{"$f":"VLOOKUP(P11,SW!A10:K98,4,FALSE)","v":4364}]
[null,null,"NISN",null,null,null,":",{"$f":"VLOOKUP(P11,SW!A10:K98,5,FALSE)","v":"0079667684"}]
[null,null,"Nama Orang Tua",null,null,null,":",{"$f":"UPPER(VLOOKUP(P11,SW!A10:K98,11,FALSE))","v":"ERIEK ISROFIL"}]
[null,null,"Semester",null,null,null,":",{"$f":"UPPER(MN!D20)","v":"GANJIL"}]
[null,null,"Tahun Pelajaran",null,null,null,":",{"$f":"MN!D18","v":"2019 - 2020"}]
[null,null,"Satuan Pendidikan",null,null,null,":",{"$f":"UPPER(MN!D28&\". \"&MN!D6)","v":"MIS. NURUL ISLAM LABRUK KIDUL"}]
[]
[null,null,"NO","MATA PELAJARAN",null,null,null,null,"KKM",null,"NILAI","KETERANGAN",null,null,"view"]
[null,null,1,"Pendidikan Agama",null,null,null,null,"-",null,"-","-"]
[null,null,null,"a.","Al-Qur'an hadits",null,null,null,75,null,{"$f":"VLOOKUP(P11,REKAP!B19:AB107,7,FALSE)","v":43},{"$f":"IF(K25>=I25,\"TUNTAS\",IF(K25<I25,\"TIDAK TUNTAS\"))","v":"TIDAK TUNTAS"},null,null,{"$f":"IF(I25=\"\",0,\"cetak\")","v":"cetak"}]
[null,null,null,"b.","Aqidah Akhlaq",null,null,null,75,null,{"$f":"VLOOKUP(P11,REKAP!B19:AB107,8,FALSE)","v":49},{"$f":"IF(K26>=I26,\"TUNTAS\",IF(K26<I26,\"TIDAK TUNTAS\"))","v":"TIDAK TUNTAS"},null,null,{"$f":"IF(I26=\"\",0,\"cetak\")","v":"cetak"}]
[null,null,null,"c.","Fiqih",null,null,null,75,null,{"$f":"VLOOKUP(P11,REKAP!B19:AB107,9,FALSE)","v":74},"TIDAK TUNTAS",null,null,"cetak"]
[null,null,null,"d.","Sejarah Kebudayaan Islam (SKI)",null,null,null,72,null,{"$f":"VLOOKUP(P11,REKAP!B19:AB107,10,FALSE)","v":27},"TIDAK TUNTAS",null,null,"cetak"]
[null,null,null,"e.","Bahasa Arab",null,null,null,70,null,{"$f":"VLOOKUP(P11,REKAP!B19:AB107,11,FALSE)","v":22},{"$f":"IF(K29>=I29,\"TUNTAS\",IF(K29<I29,\"TIDAK TUNTAS\"))","v":"TIDAK TUNTAS"},null,null,"cetak"]
[null,null,2,"Pendidikan Umum",null,null,null,null,"-",null,"-","-",null,null,"cetak"]
[null,null,null,"a.","Bahasa Indonesia",null,null,null,70,null,{"$f":"VLOOKUP(P11,REKAP!B19:AB107,12,FALSE)","v":52},{"$f":"IF(K31>=I31,\"TUNTAS\",IF(K31<I31,\"TIDAK TUNTAS\"))","v":"TIDAK TUNTAS"},null,null,"cetak"]
[null,null,null,"b.","Matematika",null,null,null,70,null,{"$f":"VLOOKUP(P11,REKAP!B19:AB107,13,FALSE)","v":38},{"$f":"IF(K32>=I32,\"TUNTAS\",IF(K32<I32,\"TIDAK TUNTAS\"))","v":"TIDAK TUNTAS"},null,null,"cetak"]
[null,null,null,"c.","Ilmu Pengetahuan Alam (IPA)",null,null,null,70,null,{"$f":"VLOOKUP(P11,REKAP!B19:AB107,14,FALSE)","v":52},"TIDAK TUNTAS",null,null,"cetak"]
[null,null,null,"d.","Pendidikan Pancasila dan Kewarganegaraan (PPKn)",null,null,null,70,null,{"$f":"VLOOKUP(P11,REKAP!B19:AB107,15,FALSE)","v":52},"TIDAK TUNTAS",null,null,"cetak"]
[null,null,null,"e.","Ilmu Pengetahuan Sosial (IPS)",null,null,null,70,null,{"$f":"VLOOKUP(P11,REKAP!B19:AB107,16,FALSE)","v":45},"TIDAK TUNTAS",null,null,"cetak"]
[null,null,null,"f.","Sosial Budaya dan Prakarya (SBdP)",null,null,null,75,null,{"$f":"VLOOKUP(P11,REKAP!B19:AB107,17,FALSE)","v":45},"TIDAK TUNTAS",null,null,"cetak"]
[null,null,null,"g.","Pendidikan Jasmani, Olahraga dan Kesehatan (PJOK)",null,null,null,75,null,{"$f":"VLOOKUP(P11,REKAP!B19:AB107,18,FALSE)","v":29},"TIDAK TUNTAS",null,null,"cetak"]
[null,null,3,"Muatan Lokal",null,null,null,null,"-",null,"-","-",null,null,"cetak"]
[null,null,null,"a.","Bahasa Daerah",null,null,null,67,null,{"$f":"VLOOKUP(P11,REKAP!B19:AB107,19,FALSE)","v":23},"TIDAK TUNTAS",null,null,"cetak"]
[null,null,null,"b.","Bahasa Inggris",null,null,null,65,null,{"$f":"VLOOKUP(P11,REKAP!B19:AB107,20,FALSE)","v":88},"TUNTAS",null,null,"cetak"]
[null,null,null,"c.","Aswaja (Ke-NU-An)",null,null,null,67,null,{"$f":"VLOOKUP(P11,REKAP!B19:AB107,21,FALSE)","v":55},"TIDAK TUNTAS",null,null,"cetak"]
[null,null,null,"d.",{"$f":"PROPER(MN!J12)","v":"Nakhwu Sorof"},null,null,null,60,null,{"$f":"VLOOKUP(P11,REKAP!B19:AB107,22,FALSE)","v":10},"TIDAK TUNTAS",null,null,"cetak"]
[null,null,null,"e.",{"$f":"PROPER(MN!J14)","v":"Mulok 2"},null,null,null,null,null,{"$f":"VLOOKUP(P11,REKAP!B19:AB107,23,FALSE)","v":0},null,null,null,0]
[null,null,null,"f.",{"$f":"PROPER(MN!J16)","v":"Mulok 3"},null,null,null,null,null,{"$f":"VLOOKUP(P11,REKAP!B19:AB107,24,FALSE)","v":0},null,null,null,0]
[null,null,"JUMLAH",null,null,null,null,null,{"$f":"SUM(I25:J44)","v":1126},null,{"$f":"VLOOKUP(P11,REKAP!B19:AB107,25,FALSE)","v":704},{"$f":"VLOOKUP(P11,REKAP!B19:AB107,27,FALSE)","v":29}]
[null,null,"RATA - RATA",null,null,null,null,null,{"$f":"IFERROR(ROUND(AVERAGE(I25:J44),0),\"\")","v":70},null,{"$f":"VLOOKUP(P11,REKAP!B19:AB107,26,FALSE)","v":44}]
[]
[null,null,"Peringkat kelas ke-",null,null,null,":",{"$f":"VLOOKUP(P11,REKAP!B19:AB107,27,FALSE)","v":29},"Dari",":",{"$f":"MN!H26","v":33},"Siswa"]
[]
[null,null,"Pesan Wali Kelas",null,null,null,":"]
[]
[null,null,{"$f":"PROPER(VLOOKUP(P11,REKAP!B19:AH107,33,FALSE))","v":"Jangan Pernah Putus Asa Tingkatkan  Semangat Belajarmu!"}]
[]
[]
[null,null,null,null,null,null,null,"Lumajang,",null,{"$f":"MN!H24","v":"8 Nopember 2019"}]
[null,null,null,null,null,null,null,null,null,{"$f":"MN!J24","v":"10 Rabiul awal 1440 H"}]
[]
[null,null,"Mengetahui,"]
[null,null,"Kepala Madrasah",null,null,null,null,{"$f":"\"Wali Kelas \"&UPPER(MN!D22)","v":"Wali Kelas VI B"},null,null,"Wali Murid"]
[]
[]
[]
[]
[null,null,{"$f":"MN!D8","v":"SAHRONI, S.Pd.I"},null,null,null,null,{"$f":"MN!D24","v":"NUR RATNA PRIHATININGSIH, S.Pd."},null,null,"………………………………"]
[null,null,{"$f":"\"NIP. \"&MN!D10","v":"NIP. -"},null,null,null,null,{"$f":"\"NIP. \"&MN!D26","v":"NIP. -"}]

{"sheet":"MN","index":23,"n_rows":30,"n_cols":10,"rows_kept":30,"cut":false,"hidden":false,"merged":[[27,5,29,9],[3,1,3,3],[5,5,5,9],[1,1,1,9],[9,7,11,7],[21,7,21,9],[23,7,23,8],[17,5,17,9],[25,7,25,8],[3,5,3,9]]}
[]
[null,{"$f":"UPPER(\"PENGOLAHAN PENILAIAN TENGAH SEMESTER \"&D20&\" TAHUN PELAJARAN \"&D18)","v":"PENGOLAHAN PENILAIAN TENGAH SEMESTER GANJIL TAHUN PELAJARAN 2019 - 2020"}]
[]
[null,"IDENTITAS MADRASAH",null,null,null,"DATA SISWA"]
[]
[null,"NAMA MADRASAH",":","NURUL ISLAM LABRUK KIDUL",null,"MATA PELAJARAN"]
[]
[null,"NAMA KEPALA MADRASAH",":","SAHRONI, S.Pd.I",null,"AA",null,"MTK",null,"PJOK"]
[]
[null,"NIP KEPALA MADRASAH",":","-",null,"AH",null,"TEMA",null,"BD"]
[]
[null,"KECAMATAN",":","SUMBERSUKO",null,"FQH",null,null,null,{"$f":"UPPER('MLK1'!G4)","v":"NAKHWU SOROF"}]
[]
[null,"KABUPATEN",":","LUMAJANG",null,"SKI",null,"BIG",null,{"$f":"UPPER('MLK2'!G4)","v":"MULOK 2"}]
[]
[null,"ALAMAT MADRASAH",":","Raya Labruk Kidul No.65 Labruk Kidul",null,"BA",null,"ASWJ",null,{"$f":"UPPER('MLK3'!G4)","v":"MULOK 3"}]
[]
[null,"TAHUN PELAJARAN",":","2019 - 2020",null,"DATA OUT"]
[]
[null,"SEMESTER",":","Ganjil",null,"REKAPITULASI",null,"RAPORT",null,"ABOUT"]
[]
[null,"KELAS",":","VI B",null,"SLOGAN",":","EXELLENT QURANIC SCHOOL"]
[]
[null,"NAMA WALI KELAS",":","NUR RATNA PRIHATININGSIH, S.Pd.",null,"TANGGAL RAPORT",":","8 Nopember 2019",null,"10 Rabiul awal 1440 H"]
[]
[null,"NIP WALI KELAS",":","-",null,"JUMLAH SISWA",":",33,null,"SISWA"]
[]
[null,"TIPE MADRASAH",":","MIS",null,{"$f":"UPPER(D28&\". \"&D6)","v":"MIS. NURUL ISLAM LABRUK KIDUL"}]
[]
[null,"AKREDITASI",":","A"]

{"sheet":"AB","index":24,"n_rows":12,"n_cols":6,"rows_kept":12,"cut":false,"hidden":false,"merged":[[1,1,1,3],[3,5,11,5]]}
[]
[null,"MY ID PERSON",null,null,null,"Pas Foto"]
[]
[null,"Nama",":","NUR RATNA PRIHATININGSIH, S.Pd"]
[]
[null,"Tempat, Tanggal Lahir",":","Lumajang, 09 Januari 1987"]
[]
[null,"Alamat",":","Jl. KH. Musthofa No.10 Petahunan Kecamatan Sumbersuko Kabupaten Lumajang Propinsi Jawa Timur"]
[]
[null,"Pendidikan",":","S1 Pendidikan Bahasa Indonesia"]
[]
[null,"No. Telp.",":","082330430092"]