{"text_format":"1","workbook":"xlsx","n_sheets":7,"sheets":["DATASK","RUMUS","DTPERSON1718","SK1718 1th","SK1718","LPT1718","LPJ1718"],"not_rendered":{"charts":0,"images":1,"macros":1,"external_links":1,"defined_names":6,"comments":0,"pivot_tables":0},"unopened":[],"bounds":{"document_bytes":16777216,"sheet_cells":100000,"rows_first":2000,"rows_last":500,"rows_between":2000,"halvings":0,"cell_chars":16384,"cell_head_chars":4096},"cells_cut":0,"cells_raw":0,"read":"whole","date_system":"1900"}

{"sheet":"DATASK","index":0,"n_rows":28,"n_cols":5,"rows_kept":28,"cut":false,"hidden":false,"merged":[]}
["Tahun Pelajaran",":","2017/2018"]
[]
["Nama Sekolah",null,"MI NURUL ISLAM LABRUK KIDUL"]
[]
["Nama KS",null,"SAHRONI,S.Pd.I"]
[]
["JABATAN YANG DI SK",null,"Kepala Tata Usaha","No. SK","004/MINI.L-Kid/ 30.02.02/SK/VII/2017"]
[]
[null,null,"Staff Tata Usaha",null,"004/MINI.L-Kid/ 30.02.02/SK/VII/2017"]
[]
[null,null,"PKM. Kurikulum",null,"004/MINI.L-Kid/ 30.02.02/SK/VII/2017"]
[]
[null,null,"Bendahara Madrasah",null,"004/MINI.L-Kid/ 30.02.02/SK/VII/2017"]
[]
[null,null,"PKM. Kesiswaan",null,"004/MINI.L-Kid/ 30.02.02/SK/VII/2017"]
[]
[null,null,"PKM. Sarana dan Prasarana",null,"004/MINI.L-Kid/ 30.02.02/SK/VII/2017"]
[]
[null,null,"PKM. Humas",null,"004/MINI.L-Kid/ 30.02.02/SK/VII/2017"]
[]
[null,null,"Guru Tetap Yayasan",null,"004/MINI.L-Kid/ 30.02.02/SK/VII/2017"]
[]
[null,null,"Koordinator Tilawati",null,"004/MINI.L-Kid/ 30.02.02/SK/VII/2017"]
[]
["tanggal SK",null,"2017-07-17"]
["TMT SK",null,"2017-07-17"]
["berlaku sd",null,"2018-07-16"]
["ditetapkan di",null,"Labruk Kidul"]

{"sheet":"RUMUS","index":1,"n_rows":38,"n_cols":9,"rows_kept":38,"cut":false,"hidden":false,"merged":[[2,2,2,4]]}
[]
[]
[null,null,"TAHUN PELAJARAN",null,null,null,null,"Guru","Kegiatan Belajar Mengajar "]
[null,null,"2007","2008",{"$f":"C4&\"/\"&D4","v":"2007/2008"},null,null,"Operator","Administrasi Daring dalam Kegiatan Belajar Mengajar "]
[null,null,"2008","2009",{"$f":"C5&\"/\"&D5","v":"2008/2009"},null,null,"Kepala TU","Administrasi Seluruh Kegiatan Belajar Mengajar "]
[null,null,"2009","2010","2009/2010",null,null,"Staff TU","Membantu Administrasi Kegiatan Belajar Mengajar "]
[null,null,"2010","2011","2010/2011",null,null,"PKM. Kurikulum","Merancang Kegiatan Belajar Mengajar "]
[null,null,"2011","2012","2011/2012",null,null,"PKM. Sarana Prasarana","Melengkapi Sarana dan Prasarana Belajar Mengajar "]
[null,null,"2012","2013","2012/2013",null,null,"PKM. Kesiswaan","Ketertiban dan kedisiplinan Belajar Mengajar "]
[null,null,"2013","2014","2013/2014",null,null,"PKM. Keuangan","pengelolahan Keuangan BOS Madrasah"]
[null,null,"2014","2015","2014/2015",null,null,"PKM. Humas","Hubungan Kegiatan Madrasah dan Masyarakat "]
[null,null,"2015","2016","2015/2016",null,null,"Koordinator Tilawati","Kegiatan Belajar Mengajar Alquran Metode tilawati "]
[null,null,"2016","2017","2016/2017",null,null,"Pembina Pramuka","Membina tentang kegiatan kepramukaan"]
[null,null,"2017","2018","2017/2018",null,null,"Koordinator Paguyuban","mengkoordinir Kegiatan Paguyuban dengan Madrasah"]
[null,null,"2018","2019","2018/2019",null,null,"Petugas Koperasi Siswa","Kegiatan Koperasi Siswa Madrasah"]
[null,null,"2019","2020","2019/2020",null,null,"Tabungan Siswa","Kegiatan Menabung Siswa  Madrasah"]
[null,null,"2020","2021","2020/2021",null,null,"Tenaga Perpustakaan","Mengelolah Perpustakaan Madrasah"]
[null,null,"2021","2022","2021/2022",null,null,"Tenaga Kantin","Mengelolah Kantin Madrasah"]
[null,null,"2022","2023","2022/2023",null,null,"Petugas Unit Kesehatan Sekolah","Mengawasi dan memberi pelayanan kesehatan Siswa Madrasah"]
[null,null,null,null,null,null,null,"Petugas Keamanan","Menjaga keamanan dan ketentraman Madrasah"]
[null,null,null,null,null,null,null,"Wali Kelas 1A","penilaian dan administrasi kelas serta Kegiatan Belajar Mengajar "]
[null,null,null,null,null,null,null,"Wali Kelas 1B","penilaian dan administrasi kelas serta Kegiatan Belajar Mengajar "]
[null,null,null,null,null,null,null,"Wali Kelas 1C","penilaian dan administrasi kelas serta Kegiatan Belajar Mengajar "]
[null,null,null,null,null,null,null,"Wali Kelas 2A","penilaian dan administrasi kelas serta Kegiatan Belajar Mengajar "]
[null,null,null,null,null,null,null,"Wali Kelas 2B","penilaian dan administrasi kelas serta Kegiatan Belajar Mengajar "]
[null,null,null,null,null,null,null,"Wali Kelas 2C","penilaian dan administrasi kelas serta Kegiatan Belajar Mengajar "]
[null,null,null,null,null,null,null,"Wali Kelas 3A","penilaian dan administrasi kelas serta Kegiatan Belajar Mengajar "]
[null,null,null,null,null,null,null,"Wali Kelas 3B","penilaian dan administrasi kelas serta Kegiatan Belajar Mengajar "]
[null,null,null,null,null,null,null,"Wali Kelas 3C","penilaian dan administrasi kelas serta Kegiatan Belajar Mengajar "]
[null,null,null,null,null,null,null,"Wali Kelas 4A","penilaian dan administrasi kelas serta Kegiatan Belajar Mengajar "]
[null,null,null,null,null,null,null,"Wali Kelas 4B","penilaian dan administrasi kelas serta Kegiatan Belajar Mengajar "]
[null,null,null,null,null,null,null,"Wali Kelas 4C","penilaian dan administrasi kelas serta Kegiatan Belajar Mengajar "]
[null,null,null,null,null,null,null,"Wali Kelas 5A","penilaian dan administrasi kelas serta Kegiatan Belajar Mengajar "]
[null,null,null,null,null,null,null,"Wali Kelas 5B","penilaian dan administrasi kelas serta Kegiatan Belajar Mengajar "]
[null,null,null,null,null,null,null,"Wali Kelas 5C","penilaian dan administrasi kelas serta Kegiatan Belajar Mengajar "]
[null,null,null,null,null,null,null,"Wali Kelas 6A","penilaian dan administrasi kelas serta Kegiatan Belajar Mengajar "]
[null,null,null,null,null,null,null,"Wali Kelas 6B","penilaian dan administrasi kelas serta Kegiatan Belajar Mengajar "]
[null,null,null,null,null,null,null,"Wali Kelas 6C","penilaian dan administrasi kelas serta Kegiatan Belajar Mengajar "]

{"sheet":"DTPERSON1718","index":2,"n_rows":99,"n_cols":10,"rows_kept":99,"cut":false,"hidden":false,"merged":[[93,1,93,2],[94,7,94,8],[95,7,95,8],[78,2,78,4],[80,2,80,4],[82,2,82,4],[84,2,84,4],[86,2,86,4],[88,2,88,4],[90,2,90,4],[92,2,92,4],[76,2,76,4],[0,0,0,6],[2,0,2,1],[70,2,70,4],[72,2,72,4],[74,2,74,4]]}
["DATA PERSONAL",null,null,null,null,null,null,"2020/2021"]
[1,2,3,4,5,6,7,8,9,10]
[]
["No.","Nama","L/P","Tempat Lahir","Tanggal Lahir","Status","Alamat","No. SK","KODE SK","Tanggal dibuat"]
[1,"Sahroni,S.Pd.I","L","Lumajang","1974-03-15","Tenaga Pendidik","TOMPOKERSAN","004",{"$f":"\"/MINI.L-Kid/ 30.02.02/S.2-2/\"&ROMAN(TEXT(J5,\"mm\"))&\"/2020\"","v":"/MINI.L-Kid/ 30.02.02/S.2-2/XII/2020"},"2020-12-21"]
[2,"M. Said","L","Lumajang","1966-06-23","Tenaga Pendidik","KEBONSARI","005",{"$f":"\"/MINI.L-Kid/ 30.02.02/S.2-2/\"&ROMAN(TEXT(J6,\"mm\"))&\"/2020\"","v":"/MINI.L-Kid/ 30.02.02/S.2-2/XII/2020"},"2020-12-21"]
[3,"Sumarmi,S.Pd.I","P","Lumajang","1964-09-12","Tenaga Pendidik","LABRUK KIDUL","006","/MINI.L-Kid/ 30.02.02/S.2-2/XII/2020","2020-12-21"]
[4,"Minuk Ika Wulandari,S.Pd,I","P","Lumajang","1979-04-14","Tenaga Pendidik","LABRUK KIDUL","007","/MINI.L-Kid/ 30.02.02/S.2-2/XII/2020","2020-12-21"]
[5,"Chayul Mu'afa,S.Ag","P","Lumajang","1977-04-15","Tenaga Pendidik","LABRUK KIDUL","008","/MINI.L-Kid/ 30.02.02/S.2-2/XII/2020","2020-12-21"]
[6,"Khusnul Adibah,S.Pd.I","P","Lumajang","1968-10-03","Tenaga Pendidik","MOJOSARI","009","/MINI.L-Kid/ 30.02.02/S.2-2/XII/2020","2020-12-21"]
[7,"Muhammad Khoiri,S.Pd.I.","L","Lumajang","1978-05-03","Tenaga Pendidik","PETAHUNAN","010","/MINI.L-Kid/ 30.02.02/S.2-2/XII/2020","2020-12-21"]
[8,"Yuliana,S.Pd.I","P","Lumajang","1986-10-24","Tenaga Pendidik","SUMBEREJO","011","/MINI.L-Kid/ 30.02.02/S.2-2/XII/2020","2020-12-21"]
[9,"Ahmad Shodiq,S.H.","L","Lumajang","1977-05-15","Tenaga Pendidik","LABRUK KIDUL","012","/MINI.L-Kid/ 30.02.02/S.2-2/XII/2020","2020-12-21"]
[10,"Chusni Kurniawan,S.Pd.","L","Lumajang","1987-03-09","Tenaga Pendidik","LABRUK KIDUL","013","/MINI.L-Kid/ 30.02.02/S.2-2/XII/2020","2020-12-21"]
[11,"M. Zuhdi Agus Riyanto,S.Pd.","L","Jember","1975-08-23","Tenaga Pendidik","DITOTRUNAN","014","/MINI.L-Kid/ 30.02.02/S.2-2/XII/2020","2020-12-21"]
[12,"Liya Shobihatul Qudriyah,S.Pd","P","Lumajang","1990-04-25","Tenaga Pendidik","MOJOSARI","015","/MINI.L-Kid/ 30.02.02/S.2-2/XII/2020","2020-12-21"]
[13,"Siti Munfaridah, S.Pd","P","Lumajang","1974-09-20","Tenaga Pendidik","LABRUK KIDUL","016","/MINI.L-Kid/ 30.02.02/S.2-2/XII/2020","2020-12-21"]
[14,"Nur Ratna Prihatiningsih, S.Pd","P","Lumajang","1987-09-09","Tenaga Pendidik","PETAHUNAN","017","/MINI.L-Kid/ 30.02.02/S.2-2/XII/2020","2020-12-21"]
[15,"Azan Tudhoni, S.Pd","L","Lumajang","1990-11-26","Tenaga Pendidik","KARANGSARI","018","/MINI.L-Kid/ 30.02.02/S.2-2/XII/2020","2020-12-21"]
[16,"Evi Nuning Faridah,S.Pd.I","P","Lumajang","1987-10-16","Tenaga Pendidik","LABRUK LOR","019","/MINI.L-Kid/ 30.02.02/S.2-2/XII/2020","2020-12-21"]
[17,"Nurul Lathifah, M.Pd","P","Lumajang","1992-07-12","Tenaga Pendidik","KEBONSARI","020","/MINI.L-Kid/ 30.02.02/S.2-2/XII/2020","2020-12-21"]
[18,"I'natul Husriyah,S.Pd","P","Lumajang","1988-01-01","Tenaga Pendidik","LABRUK KIDUL","021","/MINI.L-Kid/ 30.02.02/S.2-2/XII/2020","2020-12-21"]
[19,"Yulia Azmil Millah,S.Pd","P","Lumajang","1995-07-25","Tenaga Pendidik","PETAHUNAN","022","/MINI.L-Kid/ 30.02.02/S.2-2/XII/2020","2020-12-21"]
[20,"Mokh.Ma'mun Jauhari","L","Lumajang","1995-11-23","Tenaga Kependidikan","KEBONSARI","023","/MINI.L-Kid/ 30.02.02/S.2-2/XII/2020","2020-12-21"]
[]
[]
[]
[]
[]
[]
[]
[]
[]
[]
[]
[]
[]
[]
[]
[]
{"$rows_left_out":60}
{"sheet":"SK1718 1th","index":3,"n_rows":39,"n_cols":8,"rows_kept":39,"cut":false,"hidden":false,"merged":[[11,0,11,5],[12,0,12,5]]}
[]
[]
[]
[]
[null,null,null,null,null,null,null,"SEMESTER"]
[null,null,null,null,null,null,null,1]
[]
[null,null,null,null,null,null,null,20]
[null,null,null,null,null,null,null,{"$f":"VLOOKUP(H8,DTPERSON1718!A2:I70,7,TRUE)","v":"KEBONSARI"}]
[]
[]
["SURAT KETERANGAN AKTIF MENGAJAR"]
[{"$f":"\"Nomor \"&\": \"&VLOOKUP(H8,DTPERSON1718!A4:I70,8)&VLOOKUP(H8,DTPERSON1718!A4:I70,9)","v":"Nomor : 023/MINI.L-Kid/ 30.02.02/S.2-2/XII/2020"}]
[]
["Yang bertanda tangan dibawah ini :"]
[null,"Nama",":","Sahroni,S.Pd.I"]
[null,"Jabatan",":","Kepala Madrasah"]
[null,"Unit Pendidikan",":","MI Nurul Islam Labruk Kidul"]
[]
["dengan ini menerangkan dengan sesungguhnya bahwa"]
[null,"Nama",":",{"$f":"VLOOKUP(H8,DTPERSON1718!A4:I70,2)","v":"Mokh.Ma'mun Jauhari"}]
[null,"Kelamin",":",{"$f":"IF(VLOOKUP(H8,DTPERSON1718!A4:I70,3)=\"L\",\"Laki-laki\",\"Perempuan\")","v":"Laki-laki"}]
[null,"Tanggal Lahir",":",{"$f":"VLOOKUP(H8,DTPERSON1718!A4:I70,4)&\", \"&TEXT(VLOOKUP(H8,DTPERSON1718!A4:I70,5),\"dd mmmm yyyy\")","v":"Lumajang, 23 November 1995"}]
[null,"Alamat",":",{"$f":"VLOOKUP(H8,DTPERSON1718!A4:I70,7)","v":"KEBONSARI"}]
[]
[null,"menerangkan dengan sesungguhnya bahwa yang bersangkutan diatas adalah benar-benar guru kami"]
["yang masih aktif pada tahun pelajaran 2020/2021"]
[null,"demikian surat keterangan ini kami buat untuk dipergunakan sebagaimana mestinya"]
[]
[]
[]
[null,null,null,null,{"$f":"\"Lumajang, \"&TEXT(DTPERSON1718!J5,\"dd mmmm yyyy\")","v":"Lumajang, 21 Desember 2020"}]
[null,null,null,null,{"$f":"UPPER(\"Kepala Madrasah\")","v":"KEPALA MADRASAH"}]
[null,null,null,null,{"$f":"UPPER(DATASK!C3)","v":"MI NURUL ISLAM LABRUK KIDUL"}]
[null,null,null,null,{"$f":"DATASK!C5","v":"SAHRONI,S.Pd.I"}]
[]
[]
["                                        "]
["  "]

{"sheet":"SK1718","index":4,"n_rows":49,"n_cols":8,"rows_kept":49,"cut":false,"hidden":false,"merged":[[14,0,14,5],[17,3,17,5],[18,3,18,5],[23,3,23,5],[37,3,37,5],[30,0,30,5],[8,0,8,5],[9,0,9,5],[11,0,11,5],[12,0,12,5],[13,0,13,5]]}
[]
[]
[]
[]
[null,null,null,null,null,null,null,"SEMESTER"]
[null,null,null,null,null,null,null,1]
[]
[null,null,null,null,null,null,null,50]
["SURAT KEPUTUSAN",null,null,null,null,null,null,{"$f":"VLOOKUP(H8,DTPERSON1718!A4:I70,7,TRUE)","v":"KEBONSARI"}]
[{"$f":"\"Nomor \"&\": \"&VLOOKUP(H8,DTPERSON1718!A4:I70,8)&VLOOKUP(H8,DTPERSON1718!A4:I70,9)","v":"Nomor : 023/MINI.L-Kid/ 30.02.02/S.2-2/XII/2020"}]
[]
["TENTANG"]
[{"$f":"\"PENGANGKATAN \"&UPPER(VLOOKUP(H8,DTPERSON1718!A4:I70,6,TRUE))","v":"PENGANGKATAN TENAGA KEPENDIDIKAN"}]
[{"$f":"\"DI LINGKUNGAN \"&DATASK!C3","v":"DI LINGKUNGAN MI NURUL ISLAM LABRUK KIDUL"}]
[{"$f":"H5&\" \"&H6&\" \"&\"Tahun Pelajaran \"&DTPERSON1718!C71","v":"SEMESTER 1 Tahun Pelajaran 2020/2021"}]
[]
[]
["Menimbang",":","1.",{"$f":"\"Bahwa guna melancarkan pelaksanaan \"&IF(H9=RUMUS!H3,RUMUS!I3,IF(H9=RUMUS!H4,RUMUS!I4,IF(H9=RUMUS!H5,RUMUS!I5,IF(H9=RUMUS!H6,RUMUS!I6,IF(H9=RUMUS!H7,RUMUS!I7,IF(H9=RUMUS!H8,RUMUS!I8,IF(H9=RUMUS!H9,RUMUS!I9,IF(H9=RUMUS!H10,RUMUS!I10,IF(H9=RUMUS!H11,RUMUS!I11,IF(H9=RUMUS!H12,RUMUS!I12,IF(H9=RUMUS!H13,RUMUS!I13,IF(H9=RUMUS!H14,RUMUS!I14,IF(H9=RUMUS!H15,RUMUS!I15,IF(H9=RUMUS!H16,RUMUS!I16,IF(H9=RUMUS!H17,RUMUS!I17,IF(H9=RUMUS!H18,RUMUS!I18,IF(H9=RUMUS!H19,RUMUS!I19,IF(H9=RUMUS!H20,RUMUS!I20,IF(H9=RUMUS!H21,RUMUS!I21,IF(H9=RUMUS!H22,RUMUS!I22,IF(H9=RUMUS!H23,RUMUS!I23,IF(H9=RUMUS!H24,RUMUS!I24,IF(H9=RUMUS!H25,RUMUS!I25,IF(H9=RUMUS!H26,RUMUS!I26,IF(H9=RUMUS!H27,RUMUS!I27,IF(H9=RUMUS!H28,RUMUS!I28,IF(H9=RUMUS!H29,RUMUS!I29,IF(H9=RUMUS!H30,RUMUS!I30,IF(H9=RUMUS!H31,RUMUS!I31,IF(H9=RUMUS!H32,RUMUS!I32,IF(H9=RUMUS!H33,RUMUS!I33,IF(H9=RUMUS!H34,RUMUS!I34,IF(H9=RUMUS!H35,RUMUS!I35,IF(H9=RUMUS!H36,RUMUS!I36,IF(H9=RUMUS!H37,RUMUS!I37,IF(H9=RUMUS!H38,RUMUS!I38,\"\"))))))))))))))))))))))))))))))))))))&\" perlu ditetapkan \"&UPPER(H9)&\" pada \"&UPPER(DATASK!C3)","v":"Bahwa guna melancarkan pelaksanaan  perlu ditetapkan KEBONSARI pada MI NURUL ISLAM LABRUK KIDUL"}]
[null,null,"2.",{"$f":"\"Bahwa untuk menjamin terpeliharanya Tata Tertib serta kelancaran tugas -  tugas pokok \"&(VLOOKUP('SK1718'!H8,DTPERSON1718!A5:I70,7))&\" perlu diatur dalam Surat Keputusan Kepala Madrasah.\"","v":"Bahwa untuk menjamin terpeliharanya Tata Tertib serta kelancaran tugas -  tugas pokok KEBONSARI perlu diatur dalam Surat Keputusan Kepala Madrasah."}]
[]
["Mengingat",":","1.","Undang – undang nomor 20 Tahun 2003, tentang Sistem Pendidikan Nasional"]
[null,null,"2.","Peraturan Pemerintah RI Nomor 29 Tahun 1990."]
[null,null,"3.","Keputusan Mentri Pendayagunaan Aparatur Negara Nomor Tahun 1993"]
[null,null,"4.","Surat Keputusan bersama Mentri Pendidikan dan Kebudayaan dan Kepala  Badan Administrasi Kepegawaian Negara Nomor : 0433/P/1993 dan Nomor :  25/P/1993."]
[null,null,"5.","Keputusan Mentri Pendidikan Nasional Nomor : 084/U/2004."]
[null,null,null,"  "]
[]
[]
["Memperhatikan ",":",{"$f":"\"Hasil rapat Dewan Guru \"&PROPER(DATASK!C3)","v":"Hasil rapat Dewan Guru Mi Nurul Islam Labruk Kidul"}]
[]
["MEMUTUSKAN"]
["Menetapkan",":","1.","Mengangkat Saudara :"]
[null,null,null,"      Nama",{"$f":"\": \"&VLOOKUP('SK1718'!H8,DTPERSON1718!A5:I70,2)","v":": Mokh.Ma'mun Jauhari"}]
[null,null,null,"      Jenis Kelamin",{"$f":"\": \"&IF(VLOOKUP('SK1718'!H8,DTPERSON1718!A5:I70,3)=\"L\",\"Laki-laki\",\"Perempuan\")","v":": Laki-laki"}]
[null,null,null,"      Tempat/tanggal lahir",{"$f":"\": \"&VLOOKUP('SK1718'!H8,DTPERSON1718!A5:I70,4)&\", \"&TEXT(VLOOKUP('SK1718'!H8,DTPERSON1718!A5:I70,5),\"dd mmmm yyyy\")","v":": Lumajang, 23 November 1995"}]
[null,null,null,"      Sebagai ",{"$f":"\": \"&VLOOKUP('SK1718'!H8,DTPERSON1718!A5:I70,7)","v":": KEBONSARI"}]
[null,null,null,"      Tanggal Mulai tugas",{"$f":"\": \"&TEXT(DTPERSON1718!E95,\"dd mmmm yyyy\")","v":": 13 Juli 2020"}]
[null,null,"2.",{"$f":"\"mengamanatkan kepada yang bersangkutan tersebut diatas untuk  melaksanakan tugasnya dengan sebaik baiknya dan bertanggung jawab berdasarkan pedoman dan ketentuan yang berlaku pada \"&DTPERSON1718!C73","v":"mengamanatkan kepada yang bersangkutan tersebut diatas untuk  melaksanakan tugasnya dengan sebaik baiknya dan bertanggung jawab berdasarkan pedoman dan ketentuan yang berlaku pada MI NURUL ISLAM LABRUK KIDUL"}]
[null,null,"3.",{"$f":"\"Surat Keputusan ( SK ) ini berlaku sampai dengan tanggal \"&TEXT(VLOOKUP(H6,DTPERSON1718!C94:I96,4),\"dd mmmm yyyy\")","v":"Surat Keputusan ( SK ) ini berlaku sampai dengan tanggal 10 Juli 2021"}]
[]
{"$rows_left_out":10}
{"sheet":"LPT1718","index":5,"n_rows":55,"n_cols":6,"rows_kept":55,"cut":false,"hidden":false,"merged":[[35,5,35,6],[16,5,16,6],[18,5,29,6],[30,5,30,6],[31,5,31,6],[32,5,32,6],[33,5,33,6],[9,5,15,6],[4,0,5,0],[4,1,5,2],[4,3,5,4],[4,5,5,6],[6,5,7,6]]}
["Lampiran 1 ",null,{"$f":"'LPJ1718'!C1","v":": SK Kepala MIS. Nurul Islam Labruk Kidul"}]
["Nomor",null,{"$f":"'LPJ1718'!C2","v":": 001/MINI.L-Kid/30.02.02/SK.S.1-0/VII/2019"}]
["Tanggal",null,{"$f":"'LPJ1718'!C3","v":": 13 Juli 2020"}]
[]
["NO","N A M A",null,"JENIS TUGAS",null,"KETERANGAN"]
[]
["01","KEPALA MADRASAH"]
[null,"1. SAHRONI,S.Pd.I",null,"Ø","Kepala Madrasah"]
["02","PEMBANTU KEPALA MADRASAH"]
[null,"2.1.AZAN TUDHONI, S.Pd",null,"Ø","PKM Kesiswaan","Membantu Kepala Madrasah"]
[null,"2.2. NURUL HIDAYAH, S.Pd.I. MA",null,"Ø","PKM Tenaga Kependidikan"]
[null,"2.3. NUR RATNA PRIHATININGSIH, S.Pd",null,"Ø","PKM Kurikulum"]
[null,"2.4. KHUSNUL ADIBAH, S.Pd.I",null,"Ø","PKM Sarana Prasarana"]
[null,"2.5. AHMAD SHODIQ, SH",null,"Ø","PKM. Humas"]
["03","BENDAHARA"]
[null,"1. NURUL HIDAYAH, S.Pd.I,MA",null,"Ø","Bendahara Umum"]
["04","WALI KELAS"]
[null,"1. KHUSNUL ADIBAH, S.Pd.I",null,"Ø","Wali Kelas I. A"]
[null,"2. EVY NUNING FARIDAH, S.Pd.I",null,"Ø","Wali Kelas I. B","Membantu PKM. Kurikulum"]
[null,"3. SITI MUNFARIDAH, S.Pd",null,"Ø","Wali Kelas I. C"]
[null,"4. MINUK IKA WULANDARI, S.Pd.I",null,"Ø","Wali Kelas II A"]
[null,"5. NURUL LATHIFAH, S.Pd.I",null,"Ø","Wali Kelas II B"]
[null,"6. MUHAMMAD KHOIRI, S.Pd",null,"Ø","Wali Kelas III A"]
[null,"7. SUMARMI, S,Pd.I",null,"Ø","Wali Kelas III B"]
[null,"8. CHUSNI KURNIAWAN, S.Pd",null,"Ø","Wali Kelas IV. A"]
[null,"9. LIYA SHOBIHATUL QUDRIYAH, S.Pd",null,"Ø","Wali Kelas IV. B"]
[null,"10. AHMAD SHODIQ, SH",null,"Ø","Wali Kelas V. A"]
[null,"11. NUR RATNA PRIHATININGSIH, S.Pd",null,"Ø","Wali Kelas V. B"]
[null,"12. CHAYUL MU'AFA, S.Ag",null,"Ø","Wali Kelas VI A"]
[null,"13. NURUL HIDAYAH, S.Pd.I MA",null,"Ø","Wali Kelas VI B"]
["05","OPERATOR",null,null,null,"Membantu :"]
[null,"1. CHUSNI KURNIAWAN,S.Pd",null,"Ø","mengelola administrasi berbasis IT","- Kepala Madrasah dan TU"]
["06","KEPALA TATA USAHA",null,"Ø","Mengelola, Menyiapkan dan","Membantu :"]
[null,"1. STEPHANIE AYU SAKETHI",null,null,"membuat data/Administrasi","- Kepala Madrasah"]
["07","KOPERASI PERALATAN SEKOLAH",null,"Ø","Mengelola Koperasi Serta","- Wali Kelas"]
[null,"1. ROFIATUL MAZIDAH",null,null,"menyediakan kebutuhan murid","Membantu WK. Kesiswaan"]
["08","KOPERASI KANTIN"]
[null,"1. SHOLIKHATI",null,"Ø","Mengelola Kantin"]
[null,"2. YULIANA, S. Pd I"]
["09","TABUNGAN"]
{"$rows_left_out":16}
{"sheet":"LPJ1718","index":6,"n_rows":166,"n_cols":22,"rows_kept":166,"cut":false,"hidden":false,"merged":[[1,21,2,22],[4,21,5,22],[157,0,157,4],[151,0,152,0],[151,1,152,2],[151,3,152,3],[151,20,152,20],[153,0,154,0],[153,1,154,2],[153,3,154,3],[153,20,154,20],[148,3,150,3],[148,20,150,20],[129,0,138,0],[129,3,138,3],[129,20,138,20],[139,20,147,20],[143,1,143,2],[144,1,144,2],[109,0,118,0],[109,3,118,3],[109,20,118,20],[113,1,113,2],[119,0,128,0],[119,3,128,3],[119,20,128,20],[124,1,124,2],[132,1,132,2],[133,1,133,2],[134,1,134,2],[139,0,147,0],[139,3,147,3],[89,0,98,0],[89,20,98,20],[93,1,93,2],[99,0,108,0],[99,3,108,3],[99,20,108,20],[103,1,103,2],[104,1,104,2],[67,0,77,0],[67,3,77,3],[67,20,77,20],[72,1,72,2],[73,1,73,2],[78,0,88,0],[78,20,88,20],[83,1,83,2],[83,3,87,3],[84,1,84,2],[45,0,55,0],[45,3,55,3],[45,20,55,20],[50,1,50,2],[51,1,51,2],[56,0,66,0],[56,3,66,3],[56,20,66,20],[61,1,61,2],[62,1,62,2],[34,0,44,0],[34,3,44,3],[34,20,44,20],[9,1,9,2],[10,0,11,0],[10,1,11,2],[10,3,11,3],[10,20,11,20],[12,0,22,0],[12,3,22,3],[12,20,22,20],[23,0,33,0],[23,3,33,3],[23,20,33,20],[28,1,28,2],[29,1,29,2],[4,0,4,20],[5,0,5,20],[6,0,6,20],[7,0,8,0],[7,1,8,2],[7,4,8,4],[7,5,7,17],[7,18,8,18],[7,19,8,19],[7,20,8,20]]}
["Lampiran 2",null,{"$f":"[1]Tugas!C1","v":": SK Kepala MIS. Nurul Islam Labruk Kidul"}]
["Nomor",null,{"$f":"\": \"&VLOOKUP(V5,DTPERSON1718!C95:I96,6)","v":": 001/MINI.L-Kid/30.02.02/SK.S.1-0/VII/2019"},null,null,null,null,null,null,null,null,null,null,null,null,null,null,null,null,null,null,"SEMESTER"]
["Tanggal",null,{"$f":"\": \"&TEXT(VLOOKUP(V5,DTPERSON1718!C95:I96,2),\"dd mmmm yyyy\")","v":": 13 Juli 2020"}]
[]
["DATA TUGAS MENGAJAR DAN JUMLAH JAM MENGAJAR",null,null,null,null,null,null,null,null,null,null,null,null,null,null,null,null,null,null,null,null,{"$f":"'SK1718'!H6","v":1}]
["MI. MA'ARIF NU NURUL ISLAM LABRUK KIDUL - SUMBERSUKO"]
["TAHUN PELAJARAN 2017/2018"]
["NO","NAMA GURU",null,"KD","TUGAS MENGAJAR","Jumlah Jam Dalam Kelas",null,null,null,null,null,null,null,null,null,null,null,null,"KS","JML JAM PER-BDG STUDI","JML JAM TOTAL"]
[null,null,null,"GURU",null,"1a","1b","1c","2a","2b","3a","3b","4a","4b","5a","5b","6a","6b"]
[1,"Sahroni, S.Pd.I",null,null,"Aswaja",null,null,null,null,null,null,null,null,null,null,null,2,2,18,{"$f":"SUM(F10:S10)","v":22},{"$f":"SUM(T10:T10)","v":22}]
[2,"M. Said",null,null,"B. Arab",null,null,null,null,null,null,null,2,2,2,2,2,2,null,12,{"$f":"SUM(T11:T12)","v":24}]
[null,null,null,null,"Nahwu/Shorof",null,null,null,null,null,null,null,2,2,2,2,2,2,null,12]
[3,null,null,null,"Matematika",4,null,null,null,null,null,null,null,null,null,null,null,null,null,4,{"$f":"SUM(F13:R23)","v":30}]
[null,null,null,null,"IPA/Sains",3,null,null,null,null,null,null,null,null,null,null,null,null,null,3]
[null,null,null,null,"B. Indonesia",4,null,null,null,null,null,null,null,null,null,null,null,null,null,4]
[null,null,null,null,"IPS",3,null,null,null,null,null,null,null,null,null,null,null,null,null,3]
[null,null,null,null,"PPKn",2,null,null,null,null,null,null,null,null,null,null,null,null,null,2]
[null,"Khusnul Adibah, S.Pd.I",null,null,"Kertakes",3,null,null,null,null,null,null,null,null,null,null,null,null,null,3]
[null,"(WALI KELAS I A)",null,null,"Fiqih",2,null,null,null,null,null,null,null,null,null,null,null,null,null,2]
[null,null,null,null,"AlQuran Hadits",2,null,null,null,null,null,null,null,null,null,null,null,null,null,2]
[null,null,null,null,"Aqidah Akhlaq",2,null,null,null,null,null,null,null,null,null,null,null,null,null,2]
[null,null,null,null,"Bhs Inggris",1,null,null,null,null,null,null,null,null,null,null,null,null,null,1]
[null,null,null,null,"Penjaskes",4,null,null,null,null,null,null,null,null,null,null,null,null,null,4]
[4,null,null,null,"Matematika",null,4,null,null,null,null,null,null,null,null,null,null,null,null,{"$f":"SUM(G24:S24)","v":4},{"$f":"SUM(T24:T34)","v":30}]
[null,null,null,null,"IPA/Sains",null,3,null,null,null,null,null,null,null,null,null,null,null,null,3]
[null,null,null,null,"B. Indonesia",null,4,null,null,null,null,null,null,null,null,null,null,null,null,4]
[null,null,null,null,"IPS",null,3,null,null,null,null,null,null,null,null,null,null,null,null,3]
[null,null,null,null,"PPKn",null,2,null,null,null,null,null,null,null,null,null,null,null,null,2]
[null,"Evi Nuning Faridah, S.Pd.I",null,null,"Kertakes",null,3,null,null,null,null,null,null,null,null,null,null,null,null,3]
[null,"(WALI KELAS I B)",null,null,"Fiqih",null,2,null,null,null,null,null,null,null,null,null,null,null,null,2]
[null,null,null,null,"AlQuran Hadits",null,2,null,null,null,null,null,null,null,null,null,null,null,null,2]
[null,null,null,null,"Aqidah Akhlaq",null,2,null,null,null,null,null,null,null,null,null,null,null,null,2]
[null,null,null,null,"Bhs Inggris",null,1,null,null,null,null,null,null,null,null,null,null,null,null,1]
[null,null,null,null,"Penjaskes",null,4,null,null,null,null,null,null,null,null,null,null,null,null,4]
[5,null,null,null,"Matematika",null,null,4,null,null,null,null,null,null,null,null,null,null,null,4,30]
[null,null,null,null,"IPA/Sains",null,null,3,null,null,null,null,null,null,null,null,null,null,null,3]
[null,null,null,null,"B. Indonesia",null,null,4,null,null,null,null,null,null,null,null,null,null,null,4]
[null,null,null,null,"IPS",null,null,3,null,null,null,null,null,null,null,null,null,null,null,3]
[null,null,null,null,"PPKn",null,null,2,null,null,null,null,null,null,null,null,null,null,null,2]
[null,"Siti Munfaridah,S.Pd",null,null,"Kertakes",null,null,3,null,null,null,null,null,null,null,null,null,null,null,3]
{"$rows_left_out":126}